{"text_format":"1","workbook":"xlsx","n_sheets":11,"sheets":["Coversheet","Connect Information","Template","Data Input","Staging & Submission","Errors","Remark Codes + Descriptions","Required & Optional Fields","FEGLI Codes","Special Employment Program","Config"],"not_rendered":{"charts":0,"images":3,"macros":1,"external_links":0,"defined_names":64,"comments":4,"pivot_tables":0},"unopened":[],"bounds":{"document_bytes":16777216,"sheet_cells":100000,"rows_first":2000,"rows_last":500,"rows_between":2000,"halvings":0,"cell_chars":16384,"cell_head_chars":4096},"cells_cut":0,"cells_raw":0,"read":"row_number_cap","date_system":"1900"}

{"sheet":"Coversheet","index":0,"n_rows":18,"n_cols":3,"rows_kept":18,"cut":false,"hidden":false,"merged":[]}
[]
[null,null,"Excel To CI Utility"]
[null,null,"The purpose of this workbook is to upload data from Excel into PeopleSoft using the Component Interface to execute business logic for each transaction. This source workbook contains both worksheets and Excel VBA code modules.  The Worksheets can be copied to other workbooks for distribution without copying the code modules."]
[]
[null,"Process:"]
[null,"1)","Connection Information sheet: The information provided on this sheet is required to create a new template or submit data to the database. You will need to specify environment information as well as information in regard to how each transaction should be handled. The Action will be filled in automatically. By default, character fields which are left blank or only contain blanks will not be submitted for update. There is an option to override this setting."]
[]
[null,"2)","Template sheet: Here you create the template that you are going to use. The template is based upon the structure of a Component Interface on the PeopleSoft database."]
{"$rows_left_out":11}
{"sheet":"Connect Information","index":1,"n_rows":23,"n_cols":8,"rows_kept":23,"cut":false,"hidden":false,"merged":[],"read":"row_number_cap"}
[]
[null,"Optional Keys:"]
[]
[]
[null,"Environment:","AG - Production COPY"]
[null,"Web Server Machine Name:",{"$f":"IF(ISNA(VLOOKUP(C5 & \"\",Config!A1:B26,2,FALSE)),\"\", VLOOKUP(C5 & \"\",Z_ConnectTable,2,FALSE))","v":"empusda.copy.nfc.usda.gov"}]
[null,"Protocol:",{"$f":"IF(ISNA(VLOOKUP(C5 & \"\",Z_ConnectTable,3,FALSE)),\"\", VLOOKUP(C5 & \"\",Z_ConnectTable,3,FALSE))","v":"https"}]
[null,"HTTP Port:",{"$f":"IF(ISNA(VLOOKUP(C5 & \"\",Z_ConnectTable,4,FALSE)),\"\", VLOOKUP(C5 & \"\",Z_ConnectTable,4,FALSE))","v":443}]
{"$rows_left_out":16}
{"sheet":"Template","index":2,"n_rows":14,"n_cols":83,"rows_kept":14,"cut":false,"hidden":false,"merged":[]}
[]
["Z_PAR_MASSLOAD_CI"]
[]
[null,null,"Collection","Z_PAR_MASSLOAD_CI","Z_PAR_MASSLOAD_CI","Z_PAR_MASSLOAD_CI","Z_PAR_MASSLOAD_CI","Z_PAR_MASSLOAD_CI","Z_PAR_MASSLOAD_CI","Z_PAR_MASSLOAD_CI","Z_PAR_MASSLOAD_CI","Z_PAR_MASSLOAD_CI","Z_PAR_MASSLOAD_CI","Z_PAR_MASSLOAD_CI","Z_PAR_MASSLOAD_CI","Z_PAR_MASSLOAD_CI","Z_PAR_MASSLOAD_CI","Z_PAR_MASSLOAD_CI","Z_PAR_MASSLOAD_CI","Z_PAR_MASSLOAD_CI","Z_PAR_MASSLOAD_CI","Z_PAR_MASSLOAD_CI","Z_PAR_MASSLOAD_CI","Z_PAR_MASSLOAD_CI","Z_PAR_MASSLOAD_CI","Z_PAR_MASSLOAD_CI","Z_PAR_MASSLOAD_CI","Z_PAR_MASSLOAD_CI","Z_PAR_MASSLOAD_CI","Z_PAR_MASSLOAD_CI","Z_PAR_MASSLOAD_CI","Z_PAR_MASSLOAD_CI","Z_PAR_MASSLOAD_CI","Z_PAR_MASSLOAD_CI","Z_PAR_MASSLOAD_CI","Z_PAR_MASSLOAD_CI","Z_PAR_MASSLOAD_CI","Z_PAR_MASSLOAD_CI","Z_PAR_MASSLOAD_CI","Z_PAR_MASSLOAD_CI","Z_PAR_MASSLOAD_CI","Z_PAR_MASSLOAD_CI","Z_PAR_MASSLOAD_CI","Z_PAR_MASSLOAD_CI","Z_PAR_MASSLOAD_CI","Z_PAR_MASSLOAD_CI","Z_PAR_MASSLOAD_CI","Z_PAR_MASSLOAD_CI","Z_PAR_MASSLOAD_CI","Z_PAR_MASSLOAD_CI","Z_PAR_MASSLOAD_CI","Z_PAR_MASSLOAD_CI","Z_PAR_MASSLOAD_CI","Z_PAR_MASSLOAD_CI","Z_PAR_MASSLOAD_CI","Z_PAR_MASSLOAD_CI","Z_PAR_MASSLOAD_CI","Z_PAR_MASSLOAD_CI","Z_PAR_MASSLOAD_CI","Z_PAR_MASSLOAD_CI","Z_PAR_MASSLOAD_CI","Z_PAR_MASSLOAD_CI","Z_PAR_MASSLOAD_CI","Z_PAR_MASSLOAD_CI","Z_PAR_MASSLOAD_CI","Z_PAR_MASSLOAD_CI","Z_PAR_MASSLOAD_CI","Z_PAR_MASSLOAD_CI","Z_PAR_MASSLOAD_CI","Z_PAR_MASSLOAD_CI","Z_PAR_MASSLOAD_CI","Z_PAR_MASSLOAD_CI","Z_IMP_PAR_RMKS","Z_IMP_PAR_RMKS","Z_IMP_PAR_RMKS","Z_IMP_PAR_RMKS","Z_IMP_PAR_RMKS","Z_IMP_PAR_RMKS","Z_IMP_PAR_RMKS","Z_IMP_PAR_RMKS","Z_IMP_PAR_RMKS","Z_IMP_PAR_RMKS","Z_IMP_PAR_RMKS"]
[null,null,"Property","RUN_DTTM","PROCESSNAME","COMPANY","NATIONAL_ID","GVT_SUB_AGENCY","GVT_NOA_CODE","GVT_POI","Z_EFFDT_C","Z_ACTION_DT_C","EMPLID","OPR_ID","LAST_NAME","FIRST_NAME","MIDDLE_NAME","GVT_VET_PREF_APPT","GVT_NFC_PREVSUBAGE","Z_LAST_WORKED_DT_C","Z_NFC_PROJSKL_DT_C","Z_SERVICE_DT_C","GVT_NFC_FEHB_COVRG","GVT_PAR_AUTH_D1","GVT_APPT_LIMIT_HRS","GVT_APPT_LIMIT_DYS","GVT_PAR_AUTH_D2","Z_GVT_PAR_NTE_DT_C","GVT_XFER_FROM_AGCY","Z_APPT_LMT_AMT_TOT","Z_APPT_LMT_HRS_TOT","Z_APPT_LMT_DYS_TOT","GVT_APPT_LIMIT_AMT","Z_PROF_EXPRNC_DT_C","GVT_NFC_POS_CLSSCD","GVT_LEG_AUTH_1","GVT_LEG_AUTH_2","GVT_WORK_SCHED","STEP","GVT_COMPRATE","GVT_PAY_RATE_DETER","Z_GVT_SCD_RETIRE_C","Z_CMPNY_SNRTY_DT_C","Z_GVT_DT_LEI_C","GVT_POSN_OCCUPIED","GVT_ANN_IND","GVT_SPEP","GVT_NFC_ANL_LV_CAT","GVT_NFC_ANLV_45DAY","GVT_NFC_LEAVERN_ST","Z_GRADE_ENTRY_DT_C","MILITARY_STATUS","GVT_TYPE_OF_APPT","GVT_NFC_SPCLEMPLCD","GVT_NFC_COLA_PSTDI","GVT_NFC_SAL_SHRCD","Z_NF_CP_ST_SHR_AMT","GVT_NFC_QTR_DEDAMT","GVT_NFC_QTR_DED_CD","Z_NF_63_AGNCY_USE","GVT_VET_PREF_RIF","GVT_FEGLI","Z_NF_VFRTPE","Z_NF_LV_CEIL_REA","Z_CBPO_RET_SCD_C","Z_NF_FEGLI_CRT_OR","STD_HOURS","ACTION","ACTION_REASON","POSITION_NBR","Z_LC_RECOMMENDER","GVT_SF52_NBR","GVT_SF50_REMARK","GVT_INSERT_REQD","GVT_REMARK_LINE1","GVT_REMARK_LINE2","GVT_REMARK_LINE3","GVT_REMARK_LINE4","GVT_REMARK_LINE5","GVT_REMARK_LINE6","GVT_REMARK_LINE7","GVT_REMARK_LINE8","GVT_REMARK_LINE9"]
[null,null,"Record Type","0-0-0","0-0-0","0-0-0","0-0-0","0-0-0","0-0-0","0-0-0","0-0-0","0-0-0","0-0-0","0-0-0","0-0-0","0-0-0","0-0-0","0-0-0","0-0-0","0-0-0","0-0-0","0-0-0","0-0-0","0-0-0","0-0-0","0-0-0","0-0-0","0-0-0","0-0-0","0-0-0","0-0-0","0-0-0","0-0-0","0-0-0","0-0-0","0-0-0","0-0-0","0-0-0","0-0-0","0-0-0","0-0-0","0-0-0","0-0-0","0-0-0","0-0-0","0-0-0","0-0-0","0-0-0","0-0-0","0-0-0","0-0-0","0-0-0","0-0-0","0-0-0","0-0-0","0-0-0","0-0-0","0-0-0","0-0-0","0-0-0","0-0-0","0-0-0","0-0-0","0-0-0","0-0-0","0-0-0","0-0-0","0-0-0","0-0-0","0-0-0","0-0-0","0-0-0","1-0-0","1-0-0","1-0-0","1-0-0","1-0-0","1-0-0","1-0-0","1-0-0","1-0-0","1-0-0","1-0-0"]
[null,null,"Field Type","DATETIME","CHARACTER","CHARACTER","CHARACTER","CHARACTER","CHARACTER","CHARACTER","CHARACTER","CHARACTER","CHARACTER","CHARACTER","CHARACTER","CHARACTER","CHARACTER","CHARACTER","CHARACTER","CHARACTER","CHARACTER","CHARACTER","CHARACTER","CHARACTER","NUMBER","NUMBER","CHARACTER","CHARACTER","CHARACTER","NUMBER","NUMBER","NUMBER","NUMBER","CHARACTER","CHARACTER","CHARACTER","CHARACTER","CHARACTER","NUMBER","NUMBER","CHARACTER","CHARACTER","CHARACTER","CHARACTER","CHARACTER","CHARACTER","CHARACTER","CHARACTER","CHARACTER","CHARACTER","CHARACTER","CHARACTER","CHARACTER","CHARACTER","CHARACTER","CHARACTER","NUMBER","SIGNED_NUMBER","CHARACTER","CHARACTER","CHARACTER","CHARACTER","CHARACTER","CHARACTER","CHARACTER","CHARACTER","NUMBER","CHARACTER","CHARACTER","CHARACTER","CHARACTER","CHARACTER","CHARACTER","CHARACTER","CHARACTER","CHARACTER","CHARACTER","CHARACTER","CHARACTER","CHARACTER","CHARACTER","CHARACTER","CHARACTER"]
[null,null,"Field Length","26","12","3","20","2","3","4","8","8","11","8","30","30","30","1","2","8","8","8","1","25","4.2","3","25","8","2","6.2","4.2","3","6.2","8","1","3","3","1","2","12.2","1","8","8","8","1","1","2","1","1","1","8","1","2","2","1","1","6.2","5","1","12","1","2","6","75","8","1","4.2","3","3","8","11","10","3","1","72","72","72","72","72","72","72","72","72"]
{"$rows_left_out":7}
{"sheet":"Data Input","index":3,"n_rows":5,"n_cols":32,"rows_kept":5,"cut":false,"hidden":false,"merged":[]}
[]
["Z_PAR_MASSLOAD_CI"]
["Record Type 0-0-0","Record Type 0-0-0","Record Type 0-0-0","Record Type 0-0-0","Record Type 0-0-0","Record Type 0-0-0","Record Type 0-0-0","Record Type 0-0-0","Record Type 0-0-0","Record Type 0-0-0","Record Type 0-0-0","Record Type 0-0-0","Record Type 1-0-0","Record Type 1-0-0","Record Type 1-0-0","Record Type 1-0-0","Record Type 1-0-0","Record Type 1-0-0","Record Type 1-0-0","Record Type 1-0-0","Record Type 1-0-0","Record Type 1-0-0","Record Type 1-0-0","Record Type 1-0-0","Record Type 1-0-0","Record Type 1-0-0","Record Type 1-0-0","Record Type 1-0-0","Record Type 1-0-0","Record Type 1-0-0","Record Type 1-0-0","Record Type 1-0-0"]
["Sub-Agency","Personnel Office ID","Effective Date","Action Date","Empl ID","Last Name","First Name","Middle Name","Authority 1 Descr - Part 1","Authority 2 Description","Legal Authority (1)","Legal Authority (2)","SF50 Remark Code","Remark Line 1","Remark Line 2","Remark Line 3","Remark Line 4","Remark Line 5","Remark Line 6","Remark Line 7","Remark Line 8","Remark Line 9","SF50 Remark Code","Remark Line 1","Remark Line 2","Remark Line 3","Remark Line 4","Remark Line 5","Remark Line 6","Remark Line 7","Remark Line 8","Remark Line 9"]
["11","5153","03092025","03092025","12345","MOUSE","MICKEY","NMN",null,null,"CGM",null,"247","NAME WAS FORMERLY","MOUSE, MICKEY MICKEY",null,null,null,null,null,null,null,"28J","NAME CHANGE DUE TO MARRIAGE"]

{"sheet":"Staging & Submission","index":4,"n_rows":14,"n_cols":29,"rows_kept":14,"cut":false,"hidden":false,"merged":[]}
[]
["Z_PAR_MASSLOAD_CI"]
[null,null,null,"Z_PAR_MASSLOAD_CI","Z_PAR_MASSLOAD_CI","Z_PAR_MASSLOAD_CI","Z_PAR_MASSLOAD_CI","Z_PAR_MASSLOAD_CI","Z_PAR_MASSLOAD_CI","Z_PAR_MASSLOAD_CI","Z_PAR_MASSLOAD_CI","Z_PAR_MASSLOAD_CI","Z_PAR_MASSLOAD_CI","Z_PAR_MASSLOAD_CI","Z_PAR_MASSLOAD_CI","Z_PAR_MASSLOAD_CI","Z_PAR_MASSLOAD_CI","Z_PAR_MASSLOAD_CI","Z_PAR_MASSLOAD_CI","Z_IMP_PAR_RMKS","Z_IMP_PAR_RMKS","Z_IMP_PAR_RMKS","Z_IMP_PAR_RMKS","Z_IMP_PAR_RMKS","Z_IMP_PAR_RMKS","Z_IMP_PAR_RMKS","Z_IMP_PAR_RMKS","Z_IMP_PAR_RMKS","Z_IMP_PAR_RMKS"]
[null,null,null,"PROCESSNAME","GVT_SUB_AGENCY","GVT_NOA_CODE","GVT_POI","Z_EFFDT_C","Z_ACTION_DT_C","EMPLID","LAST_NAME","FIRST_NAME","MIDDLE_NAME","GVT_PAR_AUTH_D1","GVT_PAR_AUTH_D2","GVT_LEG_AUTH_1","GVT_LEG_AUTH_2","ACTION","ACTION_REASON","GVT_SF50_REMARK","GVT_REMARK_LINE1","GVT_REMARK_LINE2","GVT_REMARK_LINE3","GVT_REMARK_LINE4","GVT_REMARK_LINE5","GVT_REMARK_LINE6","GVT_REMARK_LINE7","GVT_REMARK_LINE8","GVT_REMARK_LINE9"]
[null,null,null,"0-0-0","0-0-0","0-0-0","0-0-0","0-0-0","0-0-0","0-0-0","0-0-0","0-0-0","0-0-0","0-0-0","0-0-0","0-0-0","0-0-0","0-0-0","0-0-0","1-0-0","1-0-0","1-0-0","1-0-0","1-0-0","1-0-0","1-0-0","1-0-0","1-0-0","1-0-0"]
[null,null,null,"CHARACTER","CHARACTER","CHARACTER","CHARACTER","CHARACTER","CHARACTER","CHARACTER","CHARACTER","CHARACTER","CHARACTER","CHARACTER","CHARACTER","CHARACTER","CHARACTER","CHARACTER","CHARACTER","CHARACTER","CHARACTER","CHARACTER","CHARACTER","CHARACTER","CHARACTER","CHARACTER","CHARACTER","CHARACTER","CHARACTER"]
[null,null,null,"12","2","3","4","8","8","11","30","30","30","25","25","3","3","3","3","3","72","72","72","72","72","72","72","72","72"]
[null,null,null,"Y/ ","Y/ ","Y/ ","Y/ ","Y/ ","Y/ "," / "," / "," / "," / "," / "," / "," / "," / "," / "," / ","Y/ "," / "," / "," / "," / "," / "," / "," / "," / "," / "]
{"$rows_left_out":7}
{"sheet":"Errors","index":5,"n_rows":0,"n_cols":0,"rows_kept":0,"cut":false,"hidden":false,"merged":[]}

{"sheet":"Remark Codes + Descriptions","index":6,"n_rows":1265,"n_cols":12,"rows_kept":1265,"cut":false,"hidden":false,"merged":[]}
["Remark Code","Insertion Required?","Remark Line 1","Remark Line 2","Remark Line 3","Remark Line 4","Remark Line 5","Remark Line 6","Remark Line 7","Remark Line 8","Remark Line 9","Effective Date"]
[7,"N","UCFE SECURE REMARK REQUIRED"," "," "," "," "," "," "," "," ","1990-03-25"]
["01A","N","THIS ACTION IS BASED ON SUSTAINED SUPERIOR PERFORMANCE"," "," "," "," "," "," "," "," ","1992-05-17"]
["01C","N","UNDER P.L. 96-8, IS ENTITLED TO CONTINUE FEGLI AND HEALTH BENEFITS.","HAS REEMPLOYMENT RIGHTS IN                                    OR","SUCCESSOR AGENCY UPON SEPARATION FROM THE INSTITUTE, SUBJECT TO SU","CH TIME  PERIOD AND OTHER CONDITIONS AS THE PRESIDENT MAY PRESCRIBE."," "," "," "," "," ","1992-01-26"]
["01P","N","PAYABLE SALARY LIMITED TO $115,700 BY 5 U.S.C. 5304 (G)(1)"," "," "," "," "," "," "," "," ","1997-02-01"]
["02A","N","THIS ACTION IS BASED ON A SPECIAL ACT"," "," "," "," "," "," "," "," ","1992-05-17"]
["02C","N","VOLUNTARY SEPARATION WITHOUT A BREAK IN SERVICE FROM COMPETITIVE","SERVICE."," "," "," "," "," "," "," ","1992-01-26"]
["03A","N","THIS RATING OF RECORD IS OUTSTANDING"," "," "," "," "," "," "," "," ","1992-05-17"]
{"$rows_left_out":1258}
{"sheet":"Required & Optional Fields","index":7,"n_rows":228,"n_cols":155,"rows_kept":228,"cut":false,"hidden":false,"merged":[]}
["Element Number","1","2","3","4","5","6","7","8","9","10","11","12","13","14","15","16","17","18","19","20","21","22","23","24","25","26","27","28","29","30","31","32","33","34","35","36","37","38","39","40","41","42","43","44","45","46","47","48","49","50","51","52","53","54","55","56","57","58","59","60","61","62","63","64","65","66","67","68","69","70","71","72","73","74","75","76","77","78","79","80","81","82","83","84","85","86","87","88","89","90","91","92","93","94","95","96","97","98","99","100","101","102","103","104","105","106","107","108","109","110","111","112","113","114","115","116","117","118","119","120","121","122","123","124","125","126","127","128","129","130","131","132","133","134","135","136","137","138","139","140","141","142","143","144","145","146","147","148","149","150","151","152","153","154"]
["NOA CODE","SSNO\n001","DEPARTMENT-CODE\n002","AGCY-CODE\n003","EMPLOYING-OFFICE-CODE\n004","PAY-PERIOD-NUMBER\n005","PP-DATE-PRES-ACTN-EFF\n006","ENTRY-OPER-CODE\n007","NAT-ACT-1ST-3-POS\n008","CSC-AUTH-CODE-1ST-NOA\n009","CSC-AUTH-2ND-CODE-1ST-NOA\n010","NAT-ACT-2ND-3-POS\n011","CSC-AUTH-CODE-2ND-NOA\n012","CSC-AUTH-2ND-CODE-2ND-NOA\n013","ACTION-CODE-350\n014","NAME-EMPLOYEE-LAST\n015","NAME-EMPLOYEE-FIRST\n016","NAME-EMPLOYEE-MIDDLE\n017","SEX-CODE\n018","DATE-OF-BIRTH\n019","EDUCATION-LEVEL\n020","VETERAN-PREF-CODE\n021","PREVIOUS-AGENCY-CODE","DATE-LAST-PAY-STAT-RET","DATE-SICK-LEAVE-EXP-RET","TENURE-GROUP","DATE-SCD-LEAVE","PHYSICAL-HANDICAP-CODE","FEGLI-COVERAGE-CODE","LI-COVERAGE-AMOUNT","FEHB-COVERAGE-CODE","RETIREMENT-COVERAGE-CODE","NAT-ACT-PREV-3-POS","CSC-AUTH-CODE-PREV-NOA","CSC-AUTH-2ND-CODE-PREV-NOA","DATE-CORR-NATURE-ACTN","DATE-NTE-SF50","DATE-PERS-ACTN-EFF","GAIN-LOSE-DEPT-NON-USDA","CSC-OTHER-LEGAL-AUTH","CSC-OTHER-LEGAL-AUTH-2ND","APPNT-LIMIT-DOLR-TOTAL","APPNT-LIMIT-HOURS-TOTAL","APPNT-LIMIT-DAYS-TOTAL","APPNT-LIMIT-DOLR-BALANCE","APPNT-LIMIT-HOURS-BALANCE","APPNT-LIMIT-DAYS-BALANCE","DATE-SERVICE-YEAR-START","PMSO-DEPT","PMSO-AGCY","PMSO-SON","MASTER-RECORD-NUMBER","GRADE","POSITION-NUMBER","POSITION-CLASSIF-CODE","RNO-CODE","PAY-PLAN","STEP","BASE-CONTRACT-SALARY","SALARY-RATE-CODE","PAY-RAISE-VERIFY-SALARY","PAY-RAISE-STALE-ACTN-SAL","PAY-RATE-DETERMINANT-CODE","DATE-RETAIN-RATE-EXPIR","DATE-SCD-CSR","DATE-SCD-RIF","DATE-SCD-WGI","DATE-SUPV-MGR-PROB","POSITION-STATUS-CSC","ANNUITANT-INDICATOR","SPEC-EMPLOYMENT-PGMS-CODE","REMARK-CODE","DATE-PROB-PERIOD-START","DATE-CAR-ERM-TEN-START","ANNUAL-LEAVE-CATEGORY","ANNUAL-LEAVE-45-DAY-CODE","LEAVE-EARNING-STATUS-PP","DATE-ENTERED-PRES-GRADE","TSP-ELIGIBILITY-CODE","VETERAN-STATUS","NAME-CORRECTION-CODE","SSNO-OLD","TOUR-OF-DUTY-HOURS","PROMOTION-PLAN-CODE","TYPE-APPOINTMENT-CODE","SPECIAL-EMPLOYEE-CODE","CITIZENSHIP-CODE","COLA-POST-DIFF-CODE","WAGE-BOARD-SHIFT-RATE-VAR","COOP-ANNUIT-SHARE-CODE","COOP-STATE-SHARE-SALARY","ANNUITANT SHARE AMT","COOP-EMT-OT RATE-FURNISHED","COOP-EMP-HOLRATE-FURNISHED","QUARTERS-DEDUCTION-RATE","QUARTERS-DEDUCTION-CODE","FMHA-COMMITTEE-TRAV-ALLOW","DATE-DEGREE-RCVD-CTR-YR","INSTRUCTIONAL-PROGRAM","AGENCY-USE","DATE-TSP-VESTED","UNIFORM-SERVICE-STATUS","FROZEN-CSRS-SERVICE","CSRS-COVERAGE-AT-APPNT","CRED-MILITARY-SERVICE","DATE-RETIRED-MILITARY","VETERAN-PREF-RIF","WORK SCHEDULE","RELOCATION-BONUS","RECRUITMENT-BONUS","SUPVY-PERCENT","RETENTION-PERCENT","PRES-STATUS-CODE","AWARDS-CASE-NUMBER","DATE-CASH-AWARD-FROM-MO","DATE-CASH-AWARD-TO-MO","CASH-AWARD-CODE","TANGIBLE BENEFITS","FIRST-YEAR-SAVINGS","INTANGIBLE-BENEFITS","NO-PERSONS-CASH-AWARD","CURRENT-CASH-AWARD","ELEMENT7-1","AMT-PD-EXTERNAL-SOURCE","CASH-AWARD-PAY-CODE","ACCTG-DISTRIBUTION","CASH-AWARD-AGCY-CHARGED","CASH-AWARD-ACCT-STA-CHG","CHECK-MAIL-ADDR-IND","SUPERVISORY/MANAGERIAL PROBATIONARY PERIOD REQUIRED","PAY-RAISE-STALE-ACTN-SAL","SAV-GR-GRADE","SAV-GR-PAY-PLAN","SAV-GR-OCC-SERIES","SAV-GR-OCC-SER-FUN-CODE","CASH-AWARD-TYPE-CODE",null,"STORED-ACCTG-IND","ADDRESS LINE 1","ADDRESS LINE 2","ADDRESS CITY NAME","ADDRESS STATE NAME","POSTAL CODE 5","POSTAL CODE 4","DESIGNATED AGENT","AWARD HOURS","VERIFY AWARD HOURS","CSRS-PREV-COV-IND","FERS-PREV-COV-IND","LV-CEIL-REASON","ERI-CODE","DATE-CBPO-RET-SCD","SPECIAL-POSITION-CD","VAR-FT-REG-TOD-PT-EMP","FEGLI-COURT-ORDER"]
["NOAC","SSN","DEPT","AGCY-CODE","POI","EFF PAY PERIOD","AUTH DATE","OPER INIT","1ST NOA CODE","1A AUTH CODE","1B AUTH CODE","2ND NOA CODE","2A AUTH CODE","2B AUTH CODE","ACTION CODE","NAME LAST","NAME FIRST","NAME MIDDLE","SEX","BIRTHDAY","EDUCATION LEVEL","VETERAN PREF","PREVIOUS AGENCY","LAST DAY IN PAY","PROJECTED SICK LV","TENURE GROUP","SCD LEAVE","HANDICAP","FEGLI COVERAGE","FEGLI AMT","FEHB COVERAGE","RETIREMENT COVERAGE","NOA","AUTH","2ND AUTH","CORR DATE","NTE DATE","EFFECTIVE DATE","LOSE/GAIN DEPT","LEGAL AUTHORITY 1ST","LEGAL AUTHORITY 2ND","FULL (DOLLARS)","FULL (HOURS)","FULL (DAYS)","BALANCE (DOLLARS)","BALANCE (HOURS)","BALANCE (DAYS)","COMMENCING DATE OF SERVICE YEAR","PMSO DEPARTMENT","PMSO AGCY","PMSO POI","PMSO MR","PMSO GRADE","PMSO IP","CLASSIFICATION ACTION","RNO","PAY PLAN","STEP","BASE SALARY","SALARY RATE CD","VERIFY SALARY","MERIT INCREASE","PAY RATE DETERMINANT CODE","GRADE RETENTION DATE","SCD RET","SCD RIF","SCD WGI","SUPV/MGRL PROB PERIOD","POSITION OCCUPIED","ANNUITANT INDICATOR","SPECIAL EMPLOYMENT PGMS CODE","REMARKS","PROBATIONARY/TRIAL DATE","CAREER TENURE DATE","AL CATEGORY","45 DAYS - A/L","LEAVE EARNING STATUS","DATE LAST ENTERED GRADE","TSP ELIG","VETERANS STATUS","NAME CORR","PREVIOUS SSN","DUTY HOURS","PROMOTION PLAN","TYPE APPT","SPECIAL EMPLOYEE CODE","CITIZENSHIP STATUS","COLA AND/OR POST DIFF CODE","SHIFT RATE","SALARY SHARE CODE","SALARY SHARE AMT","ANNUITANT SHARE AMT","COOP OVERTIME RATE","COOP HOLIDAY RATE","QUARTERS DED AMT","QUARTERS DED CODE","TRAVEL ALLOW/ENVIRON DIFF","YR DEGR/CERT RECEIVED","INSTRUCTIONAL PGM","AGENCY USE","SCD TSP","UNIFORM SERVICE","FROZEN SERVICE","PREV RET COVERAGE","CREDITABLE MILITARY SVS","DATE RETIRED MILITARY","VETERANS PREF RIF","WORK SCHEDULE","BONUS AMT","BONUS AMT","SUPVY PCT","ALLOWANCE PCT","STATUS","CASE NUMBER","PERIOD COVERED FROM DATE","PERIOD COVERED TO DATE","AWARD CODE","TANGIBLE BENEFITS","FIRST YR SAVINGS","INTANGIBLE BENEFITS","NO PERSONS RECEVING AWD","AMOUNT OF AWARD","VERIFY AMOUNT OF AWARD","AMT PD BY NON GOVT SOURCE","GENERATE PAYMENT","ACCOUNTING CODE","AGENCY-CHARGED","ACCOUNTING STAT CHARGED","ADDRESS INDICATOR","SUP MGR PROB PER REQ","ADJ SALARY","OCCUPIED GRADE","OCCUPIED PAYPLAN","OCCUPIED OCC-SERIES-CD","OCCUPIED OCC-FUNC-CD","CASH AWD TYPE CD",null,"STORED ACCTG IND","ADDRESS","ADDRESS 2","CITY","STATE","POSTAL","ZIP+4","DESIGNATED AGENT","AWARD HOURS","VERIFY AWARD HOURS","CSRS COV PRIOR TO APPT","FERS COV PRIOR TO APPT","REASON FOR PERSONAL AL CEILING","ETHNICITY-RACE INDICATOR CODES","SCD FOR CBPO RETIREMENT","SPECIAL POPULATION CODE","POSITION TOD IF PT EMPLOYEE WORKED FT","FEGLI COVERAGE ORDERED BY COURTS"]
["006","R","R","R","R","R","R","R","R","O","O","O","O","O","S","R","R","O"," "," ","O"," "," "," "," "," "," ","O"," ","O"," "," "," "," "," "," "," ","R"," ","O","O","O","O","O","O","O","O","O"," "," "," "," "," "," "," "," "," "," "," "," "," "," "," ","O","O","O","O","O"," "," ","O"," ","O","O","O","O"," "," "," "," "," "," "," "," "," ","O","O","O"," ","O","O"," "," "," ","O","O"," ","O","O"," "," ","O","O"," ","O","O"," "," "," "," "," "," ","R"," "," "," "," "," "," "," "," "," "," "," "," "," "," "," "," "," "," "," "," "," "," "," "," "," "," "," "," "," "," "," "," "," "," "," "," "," "," "," "," "," "," "]
["100","R","R","R","R","R","R","R","R","O","O","O","O","O","S","R","R","O","R","R","R","R"," "," "," ","R","R","R","R","O","R","R"," "," "," "," "," ","R","R","O","O"," "," "," "," "," "," "," ","R","R","R","R","R","R"," "," ","R","R","R","O","R"," ","R"," ","R","O","O","O"," ","R","O","O","O","O","R","R","R","R","R","R"," "," ","O"," ","R","R","R","R"," ","O","O","O","O","O","O","O"," ","O","O","O","O","R","O","R","O","O","R","R"," "," "," "," ","R"," "," "," "," "," "," "," "," "," "," "," "," "," "," "," "," ","O","O"," "," "," "," "," "," "," "," "," "," "," "," "," "," "," "," ","R","R","O","R","O","O","O"," "]
["101","R","R","R","R","R","R","R","R","O","O","O","O","O","S","R","R","O","R","R","R","R"," "," "," ","R","R","R","R","O","R","R"," "," "," "," "," ","R","R","O","O"," "," "," "," "," "," "," ","R","R","R","R","R","R"," "," ","R","R","R","O","R"," ","R"," ","R","O","O","O"," ","R","O","O","R","O","R","R","R","R","R","R"," "," ","O"," ","R","R","R","R"," ","O","O","O","O","O","O","O"," ","O","O","O","O","R","O","R","O","O","R","R"," "," "," "," ","R"," "," "," "," "," "," "," "," "," "," "," "," "," "," "," "," ","O","O"," "," "," "," "," "," "," "," "," "," "," "," "," "," "," "," ","R","R","O","R","O","O","O"," "]
["102","R","R","R","R","R","R","R","R","O","O","O","O","O","S","R","R","O","R","R","R","R"," "," "," ","R","R","R","R","O","R","R"," "," "," "," "," ","R","R","O","O"," "," "," "," "," "," "," ","R","R","R","R","R","R"," ","R","R","R","R","O","O"," ","R"," ","R","O","R","O"," ","O","R","O","O"," ","R","R","R","O","R","R"," "," ","O"," ","R","R","R","R"," ","O","O","O","O","O","O","O"," ","O","O","O","O","R","O","R","O","O","R","R"," "," "," "," ","R"," "," "," "," "," "," "," "," "," "," "," "," "," "," "," "," ","O","O"," "," "," "," "," "," "," "," "," "," "," "," "," "," "," "," "," "," "," "," "," "," "," "," "]
["103","R","R","R","R","R","R","R","R","O","O","O","O","O","S","R","R","O","R","R","R","R"," "," "," ","R","R","R","R","O","R","R"," "," "," "," "," ","R","R","O","O"," "," "," "," "," "," "," ","R","R","R","R","R","R"," ","R","R","R","R","O","O"," ","R"," ","O","O","O","O"," ","O","R","O","O","R","R","R","R","O","R","R"," "," ","O"," ","R","R","R","R"," ","O","O","O","O","O","O","O"," ","O","O","O","O","O","O","R","O","O","R","R"," "," "," "," ","R"," "," "," "," "," "," "," "," "," "," "," "," "," "," "," "," "," ","O"," "," "," "," "," "," "," "," "," "," "," "," "," "," "," "," "," "," "," "," "," "," "," "," "]
{"$rows_left_out":221}
{"sheet":"FEGLI Codes","index":8,"n_rows":76,"n_cols":2,"rows_kept":76,"cut":false,"hidden":false,"merged":[]}
["FEGLI CODE","DESCRIPTION"]
[90,"Basic+B(3x)"]
["A0","Ineligible"]
["A1","FEGLI Cov Ended-12 Months NonP"]
["B0","Waived"]
["C0","Basic only"]
["D0","Basic+A"]
["E1","Basic+C(1x)"]
{"$rows_left_out":69}
{"sheet":"Special Employment Program","index":9,"n_rows":97,"n_cols":2,"rows_kept":97,"cut":false,"hidden":false,"merged":[]}
["SPECIAL EMPLOYMENT PROGRAM CODE","DESCRIPTION"]
["00","Not Applicable"]
["01","Part-Time BLS Fld Econ Asst"]
["02","Chemical Engineering"]
["03","Electrical Engineering"]
["04","General Engineering"]
["05","General Chemistry"]
["06","Electronics"]
{"$rows_left_out":90}
{"sheet":"Config","index":10,"n_rows":51,"n_cols":10,"rows_kept":51,"cut":false,"hidden":true,"merged":[]}
["AG - Production COPY","empusda.copy.nfc.usda.gov","https",443,"EMPLOYEE","hr","hrms","ENG",10,10]
["AG - Production","usda.empowhr.gov","https",443,"EMPLOYEE","hr","hrms","ENG",10,10]
["DHS - Production COPY","empdhs.copy.nfc.usda.gov","https",443,"EMPLOYEE","hr","hrms","ENG",10,10]
["DHS - Production","dhs.empowhr.gov","https",443,"EMPLOYEE","hr","hrms","ENG",10,10]
["DOJ - Production COPY","empdoj.copy.nfc.usda.gov","https",443,"EMPLOYEE","hr","hrms","ENG",10,10]
["DOJ - Production  ","doj.empowhr.gov","https",443,"EMPLOYEE","hr","hrms","ENG",10,10]
["OFA - Production COPY","empofa.copy.nfc.usda.gov","https",443,"EMPLOYEE","hr","hrms","ENG",10,10]
["OFA - Production","ofa.empowhr.gov","https",443,"EMPLOYEE","hr","hrms","ENG",10,10]
{"$rows_left_out":43}