{"text_format":"1","workbook":"xlsx","n_sheets":11,"sheets":["Coversheet","Connect Information","Template","Data Input","Staging & Submission","Errors","Remark Codes + Descriptions","Required & Optional Fields","FEGLI Codes","Special Employment Program","Config"],"not_rendered":{"charts":0,"images":3,"macros":1,"external_links":0,"defined_names":64,"comments":4,"pivot_tables":0},"unopened":[],"bounds":{"document_bytes":16777216,"sheet_cells":100000,"rows_first":2000,"rows_last":500,"rows_between":2000,"halvings":0,"cell_chars":16384,"cell_head_chars":4096},"cells_cut":0,"cells_raw":0,"read":"row_number_cap","date_system":"1900"}

{"sheet":"Coversheet","index":0,"n_rows":18,"n_cols":3,"rows_kept":18,"cut":false,"hidden":false,"merged":[]}
[]
[null,null,"Excel To CI Utility"]
[null,null,"The purpose of this workbook is to upload data from Excel into PeopleSoft using the Component Interface to execute business logic for each transaction. This source workbook contains both worksheets and Excel VBA code modules.  The Worksheets can be copied to other workbooks for distribution without copying the code modules."]
[]
[null,"Process:"]
[null,"1)","Connection Information sheet: The information provided on this sheet is required to create a new template or submit data to the database. You will need to specify environment information as well as information in regard to how each transaction should be handled. The Action will be filled in automatically. By default, character fields which are left blank or only contain blanks will not be submitted for update. There is an option to override this setting."]
[]
[null,"2)","Template sheet: Here you create the template that you are going to use. The template is based upon the structure of a Component Interface on the PeopleSoft database."]
[null,null,"2.1. New Template: When prompted, enter the name of your PeopleSoft User ID, password, and the Component Interface you wish to use. The connect information previously provided is used to retrieve the PeopleSoft Component Interface properties. The Component Interface structure is displayed graphically."]
[null,null,"2.2. Manipulate Template: Here input cells are selected for inclusion on the Data Input and Staging & Submisson sheets.  The purpose of each button provided to allow manipulation of the template is more fully described by mousing over the button on the toolbar."]
[null,null,"2.3. New Data Input: This button copies the selected input cells into the Data Input sheet. The Data Input sheet becomes active, and you will be prompted before the structures and data on that sheet are deleted."]
[]
[null,"3)","Data Input sheet: Here you enter data values for submission to the PeopleSoft database."]
[null,null,"3.1. Stage Data for Submission: The data entered on the Data Input sheet is then staged in hierarchical form in preparation for submission to the database."]
[]
[null,"4)","Staging & Submission sheet: The last step is to format the data and submit to the database."]
[null,null,"4.1. Submit Data: This submits the data to the database.  Your PeopleSoft User ID and Password will be required. Each row submitted is marked with the reply from the database which will either be OK, Warning, or Error."]
[null,null,"4.2. Post Results: This posts the status for each row submitted to the database on the Data Input sheet so that data in a status of error can be corrected and resubmitted."]

{"sheet":"Connect Information","index":1,"n_rows":23,"n_cols":8,"rows_kept":23,"cut":false,"hidden":false,"merged":[],"read":"row_number_cap"}
[]
[null,"Optional Keys:"]
[]
[]
[null,"Environment:","AG - Production COPY"]
[null,"Web Server Machine Name:",{"$f":"IF(ISNA(VLOOKUP(C5 & \"\",Config!A1:B26,2,FALSE)),\"\", VLOOKUP(C5 & \"\",Z_ConnectTable,2,FALSE))","v":"empusda.copy.nfc.usda.gov"}]
[null,"Protocol:",{"$f":"IF(ISNA(VLOOKUP(C5 & \"\",Z_ConnectTable,3,FALSE)),\"\", VLOOKUP(C5 & \"\",Z_ConnectTable,3,FALSE))","v":"https"}]
[null,"HTTP Port:",{"$f":"IF(ISNA(VLOOKUP(C5 & \"\",Z_ConnectTable,4,FALSE)),\"\", VLOOKUP(C5 & \"\",Z_ConnectTable,4,FALSE))","v":443}]
[null,"Portal:",{"$f":"IF(ISNA(VLOOKUP(C5 & \"\",Z_ConnectTable,5,FALSE)),\"\", VLOOKUP(C5 & \"\",Z_ConnectTable,5,FALSE))","v":"EMPLOYEE"}]
[null,"PeopleSoft Site Name:",{"$f":"IF(ISNA(VLOOKUP(C5 & \"\",Z_ConnectTable,6,FALSE)),\"\", VLOOKUP(C5 & \"\",Z_ConnectTable,6,FALSE))","v":"hr"}]
[null,"Node:","PT_LOCAL",null,"NOA:",780,null,{"$f":"VLOOKUP(F11,Config!C25:D51,2,FALSE)","v":"NAME CHANGE (SEE REMARK)"}]
[null,"Language Code:",{"$f":"IF(ISNA(VLOOKUP(C5 & \"\",Z_ConnectTable,8,FALSE)),\"\", VLOOKUP(C5 & \"\",Z_ConnectTable,8,FALSE))","v":"ENG"}]
[null,"Number of Remarks:",2]
[null,"Chunking Factor:",40]
[null,"Error Threshold:",1]
[null,"Submit Blanks as Input:"]
[null,"Action:","CREATE"]
[null,"Action:"]
[null,"Submit Options"]
[]
[null,"Allow Blanks:"," "]
[null,"Z_PAR_MASSLOAD_CI"]
[null,"Submit Options"]

{"sheet":"Template","index":2,"n_rows":14,"n_cols":83,"rows_kept":14,"cut":false,"hidden":false,"merged":[]}
[]
["Z_PAR_MASSLOAD_CI"]
[]
[null,null,"Collection","Z_PAR_MASSLOAD_CI","Z_PAR_MASSLOAD_CI","Z_PAR_MASSLOAD_CI","Z_PAR_MASSLOAD_CI","Z_PAR_MASSLOAD_CI","Z_PAR_MASSLOAD_CI","Z_PAR_MASSLOAD_CI","Z_PAR_MASSLOAD_CI","Z_PAR_MASSLOAD_CI","Z_PAR_MASSLOAD_CI","Z_PAR_MASSLOAD_CI","Z_PAR_MASSLOAD_CI","Z_PAR_MASSLOAD_CI","Z_PAR_MASSLOAD_CI","Z_PAR_MASSLOAD_CI","Z_PAR_MASSLOAD_CI","Z_PAR_MASSLOAD_CI","Z_PAR_MASSLOAD_CI","Z_PAR_MASSLOAD_CI","Z_PAR_MASSLOAD_CI","Z_PAR_MASSLOAD_CI","Z_PAR_MASSLOAD_CI","Z_PAR_MASSLOAD_CI","Z_PAR_MASSLOAD_CI","Z_PAR_MASSLOAD_CI","Z_PAR_MASSLOAD_CI","Z_PAR_MASSLOAD_CI","Z_PAR_MASSLOAD_CI","Z_PAR_MASSLOAD_CI","Z_PAR_MASSLOAD_CI","Z_PAR_MASSLOAD_CI","Z_PAR_MASSLOAD_CI","Z_PAR_MASSLOAD_CI","Z_PAR_MASSLOAD_CI","Z_PAR_MASSLOAD_CI","Z_PAR_MASSLOAD_CI","Z_PAR_MASSLOAD_CI","Z_PAR_MASSLOAD_CI","Z_PAR_MASSLOAD_CI","Z_PAR_MASSLOAD_CI","Z_PAR_MASSLOAD_CI","Z_PAR_MASSLOAD_CI","Z_PAR_MASSLOAD_CI","Z_PAR_MASSLOAD_CI","Z_PAR_MASSLOAD_CI","Z_PAR_MASSLOAD_CI","Z_PAR_MASSLOAD_CI","Z_PAR_MASSLOAD_CI","Z_PAR_MASSLOAD_CI","Z_PAR_MASSLOAD_CI","Z_PAR_MASSLOAD_CI","Z_PAR_MASSLOAD_CI","Z_PAR_MASSLOAD_CI","Z_PAR_MASSLOAD_CI","Z_PAR_MASSLOAD_CI","Z_PAR_MASSLOAD_CI","Z_PAR_MASSLOAD_CI","Z_PAR_MASSLOAD_CI","Z_PAR_MASSLOAD_CI","Z_PAR_MASSLOAD_CI","Z_PAR_MASSLOAD_CI","Z_PAR_MASSLOAD_CI","Z_PAR_MASSLOAD_CI","Z_PAR_MASSLOAD_CI","Z_PAR_MASSLOAD_CI","Z_PAR_MASSLOAD_CI","Z_PAR_MASSLOAD_CI","Z_PAR_MASSLOAD_CI","Z_PAR_MASSLOAD_CI","Z_IMP_PAR_RMKS","Z_IMP_PAR_RMKS","Z_IMP_PAR_RMKS","Z_IMP_PAR_RMKS","Z_IMP_PAR_RMKS","Z_IMP_PAR_RMKS","Z_IMP_PAR_RMKS","Z_IMP_PAR_RMKS","Z_IMP_PAR_RMKS","Z_IMP_PAR_RMKS","Z_IMP_PAR_RMKS"]
[null,null,"Property","RUN_DTTM","PROCESSNAME","COMPANY","NATIONAL_ID","GVT_SUB_AGENCY","GVT_NOA_CODE","GVT_POI","Z_EFFDT_C","Z_ACTION_DT_C","EMPLID","OPR_ID","LAST_NAME","FIRST_NAME","MIDDLE_NAME","GVT_VET_PREF_APPT","GVT_NFC_PREVSUBAGE","Z_LAST_WORKED_DT_C","Z_NFC_PROJSKL_DT_C","Z_SERVICE_DT_C","GVT_NFC_FEHB_COVRG","GVT_PAR_AUTH_D1","GVT_APPT_LIMIT_HRS","GVT_APPT_LIMIT_DYS","GVT_PAR_AUTH_D2","Z_GVT_PAR_NTE_DT_C","GVT_XFER_FROM_AGCY","Z_APPT_LMT_AMT_TOT","Z_APPT_LMT_HRS_TOT","Z_APPT_LMT_DYS_TOT","GVT_APPT_LIMIT_AMT","Z_PROF_EXPRNC_DT_C","GVT_NFC_POS_CLSSCD","GVT_LEG_AUTH_1","GVT_LEG_AUTH_2","GVT_WORK_SCHED","STEP","GVT_COMPRATE","GVT_PAY_RATE_DETER","Z_GVT_SCD_RETIRE_C","Z_CMPNY_SNRTY_DT_C","Z_GVT_DT_LEI_C","GVT_POSN_OCCUPIED","GVT_ANN_IND","GVT_SPEP","GVT_NFC_ANL_LV_CAT","GVT_NFC_ANLV_45DAY","GVT_NFC_LEAVERN_ST","Z_GRADE_ENTRY_DT_C","MILITARY_STATUS","GVT_TYPE_OF_APPT","GVT_NFC_SPCLEMPLCD","GVT_NFC_COLA_PSTDI","GVT_NFC_SAL_SHRCD","Z_NF_CP_ST_SHR_AMT","GVT_NFC_QTR_DEDAMT","GVT_NFC_QTR_DED_CD","Z_NF_63_AGNCY_USE","GVT_VET_PREF_RIF","GVT_FEGLI","Z_NF_VFRTPE","Z_NF_LV_CEIL_REA","Z_CBPO_RET_SCD_C","Z_NF_FEGLI_CRT_OR","STD_HOURS","ACTION","ACTION_REASON","POSITION_NBR","Z_LC_RECOMMENDER","GVT_SF52_NBR","GVT_SF50_REMARK","GVT_INSERT_REQD","GVT_REMARK_LINE1","GVT_REMARK_LINE2","GVT_REMARK_LINE3","GVT_REMARK_LINE4","GVT_REMARK_LINE5","GVT_REMARK_LINE6","GVT_REMARK_LINE7","GVT_REMARK_LINE8","GVT_REMARK_LINE9"]
[null,null,"Record Type","0-0-0","0-0-0","0-0-0","0-0-0","0-0-0","0-0-0","0-0-0","0-0-0","0-0-0","0-0-0","0-0-0","0-0-0","0-0-0","0-0-0","0-0-0","0-0-0","0-0-0","0-0-0","0-0-0","0-0-0","0-0-0","0-0-0","0-0-0","0-0-0","0-0-0","0-0-0","0-0-0","0-0-0","0-0-0","0-0-0","0-0-0","0-0-0","0-0-0","0-0-0","0-0-0","0-0-0","0-0-0","0-0-0","0-0-0","0-0-0","0-0-0","0-0-0","0-0-0","0-0-0","0-0-0","0-0-0","0-0-0","0-0-0","0-0-0","0-0-0","0-0-0","0-0-0","0-0-0","0-0-0","0-0-0","0-0-0","0-0-0","0-0-0","0-0-0","0-0-0","0-0-0","0-0-0","0-0-0","0-0-0","0-0-0","0-0-0","0-0-0","0-0-0","0-0-0","1-0-0","1-0-0","1-0-0","1-0-0","1-0-0","1-0-0","1-0-0","1-0-0","1-0-0","1-0-0","1-0-0"]
[null,null,"Field Type","DATETIME","CHARACTER","CHARACTER","CHARACTER","CHARACTER","CHARACTER","CHARACTER","CHARACTER","CHARACTER","CHARACTER","CHARACTER","CHARACTER","CHARACTER","CHARACTER","CHARACTER","CHARACTER","CHARACTER","CHARACTER","CHARACTER","CHARACTER","CHARACTER","NUMBER","NUMBER","CHARACTER","CHARACTER","CHARACTER","NUMBER","NUMBER","NUMBER","NUMBER","CHARACTER","CHARACTER","CHARACTER","CHARACTER","CHARACTER","NUMBER","NUMBER","CHARACTER","CHARACTER","CHARACTER","CHARACTER","CHARACTER","CHARACTER","CHARACTER","CHARACTER","CHARACTER","CHARACTER","CHARACTER","CHARACTER","CHARACTER","CHARACTER","CHARACTER","CHARACTER","NUMBER","SIGNED_NUMBER","CHARACTER","CHARACTER","CHARACTER","CHARACTER","CHARACTER","CHARACTER","CHARACTER","CHARACTER","NUMBER","CHARACTER","CHARACTER","CHARACTER","CHARACTER","CHARACTER","CHARACTER","CHARACTER","CHARACTER","CHARACTER","CHARACTER","CHARACTER","CHARACTER","CHARACTER","CHARACTER","CHARACTER","CHARACTER"]
[null,null,"Field Length","26","12","3","20","2","3","4","8","8","11","8","30","30","30","1","2","8","8","8","1","25","4.2","3","25","8","2","6.2","4.2","3","6.2","8","1","3","3","1","2","12.2","1","8","8","8","1","1","2","1","1","1","8","1","2","2","1","1","6.2","5","1","12","1","2","6","75","8","1","4.2","3","3","8","11","10","3","1","72","72","72","72","72","72","72","72","72"]
[null,null,"Key / Required","Y/ ","Y/ ","Y/ ","Y/ ","Y/ ","Y/ ","Y/ ","Y/ ","Y/ "," / "," / "," / "," / "," / "," / "," / "," / "," / "," / "," / "," / "," / "," / "," / "," / "," / "," / "," / "," / "," / "," / "," / "," / "," / "," / "," / "," / "," / "," / "," / "," / "," / "," / "," / "," / "," / "," / "," / "," / "," / "," / "," / "," / "," / "," / "," / "," / "," / "," / "," / "," / "," / "," / "," / "," / "," / "," / "," / "," / ","Y/ "," / "," / "," / "," / "," / "," / "," / "," / "," / "," / "]
[null,null,"Sequence","1","2","3","4","5","6","7","8","9","10","11","12","13","14","15","16","17","18","19","20","21","22","23","24","25","26","27","28","29","30","31","32","33","34","35","36","37","38","39","40","41","42","43","44","45","46","47","48","49","50","51","52","53","54","55","56","57","58","59","60","61","62","63","64","65","66","67","68","69","70","71","72","73","74","75","76","77","78","79","80"]
["Status","Line No","Record Type","Run Date and Time","Process Name","Agency","Social Security Number","Sub-Agency","Nature of Action Code","Personnel Office ID","Effective Date","Action Date","Empl ID","Operator Id","Last Name","First Name","Middle Name","Veterans Preference","Previous Sub-Agency","Last Date Worked","Project Sick Leave Usage Dt",null,"FEHB Eligibility","Authority 1 Descr - Part 1","Appointment Limit Hours Balance","Appointment Limit Days Balance","Authority 2 Description","NTE Date","Losing/Gaining Dept.","Appointment Limit Amount Total","Appointment Limit Hours Total","Appointment Limit Days Total","Appointment Limit Amount Balance","Commencing Date of Service","Classification Action Code","Legal Authority (1)","Legal Authority (2)","Work Schedule","Step","Base Pay","Pay Rate Determinant","SCD - Retire Date","SCD - RIF Date","SCD - WGI Date","Position Occupied","Annuitant Indicator","Special Employment Program","Annual Leave Category","Annual Leave 45-Day Indicator","Annual Leave Category","Grade Entry Date","Military Status","Type of Appointment","Special Employee Code","COLA/Post Differential","Salary Share Code","Coop Share Amt","Quarters Deduction Amount","Quarters Deduction Code","Agency Use","Veterans Preference RIF","FEGLI Code","Variable FT Reg Tour of Duty","Leave CEIL reason","Date CBPO Ret Sch","FEGLI Court Order","Standard Hours","Action","Reason Code","Position Number","Recommending Official","SF-52 Request Number","SF50 Remark Code","Insertion Required","Remark Line 1","Remark Line 2","Remark Line 3","Remark Line 4","Remark Line 5","Remark Line 6","Remark Line 7","Remark Line 8","Remark Line 9"]
["Template",null,"0-0-0","","CIIMP","","","","780","","","","","","","","","","","","","","","","","","","","","","","","","","","","","","","","","","","","","","","","","","","","","","","","","","","","","","","","","","","NAM","MAR","","",""]
["Template",null,"1-0-0",null,null,null,null,null,null,null,null,null,null,null,null,null,null,null,null,null,null,null,null,null,null,null,null,null,null,null,null,null,null,null,null,null,null,null,null,null,null,null,null,null,null,null,null,null,null,null,null,null,null,null,null,null,null,null,null,null,null,null,null,null,null,null,null,null,null,null,null,null,"","","","","","","","","","",""]
["Template",null,"1-0-0",null,null,null,null,null,null,null,null,null,null,null,null,null,null,null,null,null,null,null,null,null,null,null,null,null,null,null,null,null,null,null,null,null,null,null,null,null,null,null,null,null,null,null,null,null,null,null,null,null,null,null,null,null,null,null,null,null,null,null,null,null,null,null,null,null,null,null,null,null,"","","","","","","","","","",""]

{"sheet":"Data Input","index":3,"n_rows":5,"n_cols":32,"rows_kept":5,"cut":false,"hidden":false,"merged":[]}
[]
["Z_PAR_MASSLOAD_CI"]
["Record Type 0-0-0","Record Type 0-0-0","Record Type 0-0-0","Record Type 0-0-0","Record Type 0-0-0","Record Type 0-0-0","Record Type 0-0-0","Record Type 0-0-0","Record Type 0-0-0","Record Type 0-0-0","Record Type 0-0-0","Record Type 0-0-0","Record Type 1-0-0","Record Type 1-0-0","Record Type 1-0-0","Record Type 1-0-0","Record Type 1-0-0","Record Type 1-0-0","Record Type 1-0-0","Record Type 1-0-0","Record Type 1-0-0","Record Type 1-0-0","Record Type 1-0-0","Record Type 1-0-0","Record Type 1-0-0","Record Type 1-0-0","Record Type 1-0-0","Record Type 1-0-0","Record Type 1-0-0","Record Type 1-0-0","Record Type 1-0-0","Record Type 1-0-0"]
["Sub-Agency","Personnel Office ID","Effective Date","Action Date","Empl ID","Last Name","First Name","Middle Name","Authority 1 Descr - Part 1","Authority 2 Description","Legal Authority (1)","Legal Authority (2)","SF50 Remark Code","Remark Line 1","Remark Line 2","Remark Line 3","Remark Line 4","Remark Line 5","Remark Line 6","Remark Line 7","Remark Line 8","Remark Line 9","SF50 Remark Code","Remark Line 1","Remark Line 2","Remark Line 3","Remark Line 4","Remark Line 5","Remark Line 6","Remark Line 7","Remark Line 8","Remark Line 9"]
["11","5153","03092025","03092025","12345","MOUSE","MICKEY","NMN",null,null,"CGM",null,"247","NAME WAS FORMERLY","MOUSE, MICKEY MICKEY",null,null,null,null,null,null,null,"28J","NAME CHANGE DUE TO MARRIAGE"]

{"sheet":"Staging & Submission","index":4,"n_rows":14,"n_cols":29,"rows_kept":14,"cut":false,"hidden":false,"merged":[]}
[]
["Z_PAR_MASSLOAD_CI"]
[null,null,null,"Z_PAR_MASSLOAD_CI","Z_PAR_MASSLOAD_CI","Z_PAR_MASSLOAD_CI","Z_PAR_MASSLOAD_CI","Z_PAR_MASSLOAD_CI","Z_PAR_MASSLOAD_CI","Z_PAR_MASSLOAD_CI","Z_PAR_MASSLOAD_CI","Z_PAR_MASSLOAD_CI","Z_PAR_MASSLOAD_CI","Z_PAR_MASSLOAD_CI","Z_PAR_MASSLOAD_CI","Z_PAR_MASSLOAD_CI","Z_PAR_MASSLOAD_CI","Z_PAR_MASSLOAD_CI","Z_PAR_MASSLOAD_CI","Z_IMP_PAR_RMKS","Z_IMP_PAR_RMKS","Z_IMP_PAR_RMKS","Z_IMP_PAR_RMKS","Z_IMP_PAR_RMKS","Z_IMP_PAR_RMKS","Z_IMP_PAR_RMKS","Z_IMP_PAR_RMKS","Z_IMP_PAR_RMKS","Z_IMP_PAR_RMKS"]
[null,null,null,"PROCESSNAME","GVT_SUB_AGENCY","GVT_NOA_CODE","GVT_POI","Z_EFFDT_C","Z_ACTION_DT_C","EMPLID","LAST_NAME","FIRST_NAME","MIDDLE_NAME","GVT_PAR_AUTH_D1","GVT_PAR_AUTH_D2","GVT_LEG_AUTH_1","GVT_LEG_AUTH_2","ACTION","ACTION_REASON","GVT_SF50_REMARK","GVT_REMARK_LINE1","GVT_REMARK_LINE2","GVT_REMARK_LINE3","GVT_REMARK_LINE4","GVT_REMARK_LINE5","GVT_REMARK_LINE6","GVT_REMARK_LINE7","GVT_REMARK_LINE8","GVT_REMARK_LINE9"]
[null,null,null,"0-0-0","0-0-0","0-0-0","0-0-0","0-0-0","0-0-0","0-0-0","0-0-0","0-0-0","0-0-0","0-0-0","0-0-0","0-0-0","0-0-0","0-0-0","0-0-0","1-0-0","1-0-0","1-0-0","1-0-0","1-0-0","1-0-0","1-0-0","1-0-0","1-0-0","1-0-0"]
[null,null,null,"CHARACTER","CHARACTER","CHARACTER","CHARACTER","CHARACTER","CHARACTER","CHARACTER","CHARACTER","CHARACTER","CHARACTER","CHARACTER","CHARACTER","CHARACTER","CHARACTER","CHARACTER","CHARACTER","CHARACTER","CHARACTER","CHARACTER","CHARACTER","CHARACTER","CHARACTER","CHARACTER","CHARACTER","CHARACTER","CHARACTER"]
[null,null,null,"12","2","3","4","8","8","11","30","30","30","25","25","3","3","3","3","3","72","72","72","72","72","72","72","72","72"]
[null,null,null,"Y/ ","Y/ ","Y/ ","Y/ ","Y/ ","Y/ "," / "," / "," / "," / "," / "," / "," / "," / "," / "," / ","Y/ "," / "," / "," / "," / "," / "," / "," / "," / "," / "]
[null,null,null,"2","5","6","7","8","9","10","12","13","14","21","24","33","34","65","66","70","72","73","74","75","76","77","78","79","80"]
["Status","Line No","Record Type","Process Name","Sub-Agency","Nature of Action Code","Personnel Office ID","Effective Date","Action Date","Empl ID","Last Name","First Name","Middle Name","Authority 1 Descr - Part 1","Authority 2 Description","Legal Authority (1)","Legal Authority (2)","Action","Reason Code","SF50 Remark Code","Remark Line 1","Remark Line 2","Remark Line 3","Remark Line 4","Remark Line 5","Remark Line 6","Remark Line 7","Remark Line 8","Remark Line 9"]
["OK",5,"0-0-0","CIIMP","11","780","5153","03092025","03092025","12345","MOUSE","MICKEY","NMN",null,null,"CGM",null,"NAM","MAR"]
[" ",5,"1-0-0",null,null,null,null,null,null,null,null,null,null,null,null,null,null,null,null,"247","NAME WAS FORMERLY ","MOUSE,MICKEY MICKEY"]
[" ",5,"1-0-0",null,null,null,null,null,null,null,null,null,null,null,null,null,null,null,null,"28J","NAME CHANGE DUE TO MARRIAGE."]
["STOP"]

{"sheet":"Errors","index":5,"n_rows":0,"n_cols":0,"rows_kept":0,"cut":false,"hidden":false,"merged":[]}

{"sheet":"Remark Codes + Descriptions","index":6,"n_rows":1265,"n_cols":12,"rows_kept":1265,"cut":false,"hidden":false,"merged":[]}
["Remark Code","Insertion Required?","Remark Line 1","Remark Line 2","Remark Line 3","Remark Line 4","Remark Line 5","Remark Line 6","Remark Line 7","Remark Line 8","Remark Line 9","Effective Date"]
[7,"N","UCFE SECURE REMARK REQUIRED"," "," "," "," "," "," "," "," ","1990-03-25"]
["01A","N","THIS ACTION IS BASED ON SUSTAINED SUPERIOR PERFORMANCE"," "," "," "," "," "," "," "," ","1992-05-17"]
["01C","N","UNDER P.L. 96-8, IS ENTITLED TO CONTINUE FEGLI AND HEALTH BENEFITS.","HAS REEMPLOYMENT RIGHTS IN                                    OR","SUCCESSOR AGENCY UPON SEPARATION FROM THE INSTITUTE, SUBJECT TO SU","CH TIME  PERIOD AND OTHER CONDITIONS AS THE PRESIDENT MAY PRESCRIBE."," "," "," "," "," ","1992-01-26"]
["01P","N","PAYABLE SALARY LIMITED TO $115,700 BY 5 U.S.C. 5304 (G)(1)"," "," "," "," "," "," "," "," ","1997-02-01"]
["02A","N","THIS ACTION IS BASED ON A SPECIAL ACT"," "," "," "," "," "," "," "," ","1992-05-17"]
["02C","N","VOLUNTARY SEPARATION WITHOUT A BREAK IN SERVICE FROM COMPETITIVE","SERVICE."," "," "," "," "," "," "," ","1992-01-26"]
["03A","N","THIS RATING OF RECORD IS OUTSTANDING"," "," "," "," "," "," "," "," ","1992-05-17"]
["03C","N","SUBJECT TO CONDITIONS AS SPECIFIED BY LAW, YOU ARE ENTITLED TO","MANDATORY RETENTION RIGHTS WHICH EXPIRE        ."," "," "," "," "," "," "," ","1992-01-26"]
["04A","N","THIS RATING OF RECORD IS EXCELLENT"," "," "," "," "," "," "," "," ","1992-05-17"]
["04C","N","YOUR WAIVER OF INSURANCE BECAME EFFECTIVE THE","DAY PRIOR TO THE EFFECTIVE DATE SHOWN ABOVE."," "," "," "," "," "," "," ","1992-01-26"]
[50,"N","A"," "," "," "," "," "," "," "," ","1997-03-09"]
["05A","N","THIS RATING OF RECORD IS FULLY SUCCESSFUL"," "," "," "," "," "," "," "," ","1992-05-17"]
["05C","N","EMPLOYMENT TERMINATES WHEN THE LIMITATION (OR THE EARLIEST IF MORE","THAT THAN ONE) IS REACHED. THERE IS NO AUTHORITY TO PAY FOR SERVICE","THEREFROM WITHOUT APPROPRIATE PERSONNEL ACTION."," "," "," "," "," "," ","1992-01-26"]
[60,"N","B"," "," "," "," "," "," "," "," ","1997-03-09"]
["06A","N","THE JUSTIFICATION FOR THIS SPECIAL ACT IS"," "," "," "," "," "," "," "," ","1992-05-17"]
["06C","N","SAVED SALARY RATE EXPIRES        UNLESS TERMINATED EARLIER BY","APPROPRIATE PERSONNEL ACTION."," "," "," "," "," "," "," ","1992-01-26"]
["07A","N","RECIPIENT OF AN EXECUTIVE OFFICE FOR UNITED STATES ATTORNEYS' DIRECTOR'S","AWARD"," "," "," "," "," "," "," ","1992-05-17"]
["07C","N","THE WAITING PERIOD FOR YOUR NEXT STEP INCREASE IS      WEEKS FROM","THE ABOVE EFFECTIVE DATE. THIS PERIOD CAN BE CHANGED BY AN","EQUIVALENT INCREASE ACTION, EXTENDED LWOP, OR NON-WORK DAYS IF","INTERMITTENT."," "," "," "," "," ","1992-01-26"]
["08A","N","ELIGIBILITY NEXT FULL API WILL BE IN APRIL,    ."," "," "," "," "," "," "," "," ","1993-01-24"]
["08C","N","APPROPRIATION."," "," "," "," "," "," "," "," ","1992-01-26"]
["09A","N","YOUR SALARY HAS BEEN ADJUSTED TO REFLECT A CHANGE IN SPECIAL RATE","AND/OR LOCALITY PAY."," "," "," "," "," "," "," ","1993-03-21"]
["09C","N","EMPLOYEE IS A PARTICIPANT IN AN ORGANIZED WORK STUDY PROGRAM."," "," "," "," "," "," "," "," ","1992-01-26"]
[100,"N","THIS CORRECTS BLOCK 30, RETIREMENT PLAN, FROM CODE ( ) TO CODE ( )","EFFECTIVE (  -  -  ) AND ALL SUBSEQUENT ACTIONS."," "," "," "," "," "," "," ","1991-06-30"]
[101,"N","YOUR TOUR OF DUTY WILL BE FULL-TIME OR PART-TIME WHEN NEEDED.  YOUR","SERVICES MAY NOT BE REQUIRED AT CERTAIN TIMES DUE TO LACK OF FUNDS, L","ACK   OF WORK, WEATHER CONDITIONS, OR OTHER UNFORESEEN CIRCUMSTANCES.  I","T IS     EXPECTED YOU WILL WORK LESS THAN 1040 HOURS EACH YEAR.  DURING","THESE       PERIODS, YOU WILL BE PLACED IN A NON-WORK STATUS."," "," "," "," ","1985-10-13"]
[102,"N","TENTATIVE SCD PENDING CERTIFICATION OF PRIOR FEDERAL SERVICE."," "," "," "," "," "," "," "," ","1985-10-13"]
[103,"N","YOU ARE NOT SUBJECT TO ANNUAL LEAVE CEILING WHILE SERVING IN THE","SENIOR EXECUTIVE SERVICE (SES)."," "," "," "," "," "," "," ","1985-10-13"]
[104,"N","YOUR ANNUAL LEAVE BALANCE OF       ACCUMULATED WHILE IN THE SES BECOMES","YOUR CEILING FOR THE LEAVE YEAR.  ANY ANNUAL LEAVE USED IN EXCESS OF","LEAVE EARNED DURING EACH SUBSEQUENT LEAVE YEAR WILL REDUCE THE ABO","VE       BALANCE UNTIL THE NORMAL CARRY-OVER OF 240 HOURS IS ATTAINED."," "," "," "," "," ","1985-10-13"]
[105,"N","ANNUAL AND SICK LEAVE BALANCES TO BE TRANSFERRED."," "," "," "," "," "," "," "," ","1985-10-13"]
[106,"N","ELIGIBLE TO EARN ANNUAL LEAVE SINCE APPOINTMENT NOW EXCEEDS 90 CALENDAR","DAYS.  CREDIT FOR ANNUAL LEAVE IS RETROACTIVE TO DATE OF INITIAL","APPOINTMENT."," "," "," "," "," "," ","1985-10-13"]
[107,"N","INELIGIBLE TO EARN ANNUAL LEAVE BECAUSE APPOINTMENT IS FOR LESS THAN 90","CALENDAR DAYS."," "," "," "," "," "," "," ","1985-10-13"]
[108,"N","THIS ACTION TAKEN PENDING A DECISION ON APPLICATION FOR DISABILITY","RETIREMENT."," "," "," "," "," "," "," ","1985-10-13"]
[109,"N","ENTITLED TO UNIFORM ALLOWANCE."," "," "," "," "," "," "," "," ","1985-10-13"]
["10C","N","COMPLETION OF WORK FOR WHICH EMPLOYED."," "," "," "," "," "," "," "," ","1992-01-26"]
["10I","N","WELCOME TO THE INTERNAL REVENUE SERVICE"," "," "," "," "," "," "," "," ","1990-08-26"]
["10J","N","TERMINATION IS BASED UPON EXPIRATION OF ASSIGNMENT OR AT VOLUNTEER'S","REQUEST."," "," "," "," "," "," "," ","1991-04-07"]
[110,"N","THIS POSITION HAS PROMOTION POTENTIAL TO        ; HOWEVER, PROMOTION IS","NEITHER GUARANTEED, NOR IS THE PROMISE OF PROMOTION IMPLIED."," "," "," "," "," "," "," ","1985-10-13"]
[111,"N","THIS EMPLOYEE HAS ELECTED TO PARTICIPATE IN THE MIXED-TOUR PROGRAM WITH","A              SCHEDULE TOUR OF DUTY.  BASED ON THE AGENCY'S FLUCTUAT","ING   WORKLOAD, THE EMPLOYEE WILL REVERT TO INTERMITTENT STATUS, AS NECE","SARY."," "," "," "," "," ","1985-10-13"]
[112,"N","THIS ACTION EFFECTED UNDER 13 USC 24 (A) IS STRICTLY TEMPORARY NOT TO","EXCEED         .  WHEN YOUR SERVICES ARE NO LONGER NEEDED IN THIS","TEMPORARY ASSIGNMENT, YOU WILL REVERT TO YOUR LAST PERMANENT LEVEL","WHERE   YOU WILL BE GRANTED ALL RIGHTS AND PRIVILEGES AS IF YOU HAD NOT","BEEN       TEMPORARILY PROMOTED."," "," "," "," ","1985-10-13"]
[113,"N","THIS ACTION EFFECTED UNDER 13 USC 24 (A) CONTINUES YOUR TEMPORARY","PROMOTION NOT TO EXCEED         .  WHEN YOUR SERVICES ARE NO LONGER","NEEDED IN THIS TEMPORARY ASSIGNMENT, YOU WILL REVERT TO YOUR LAST","PERMANENTLEVEL WHERE YOU WILL BE GRANTED ALL RIGHTS AND PRIVILEGES AS IF","YOU HAD    NOT BEEN TEMPORARILY PROMOTED."," "," "," "," ","1985-10-13"]
[114,"N","TOUR OF DUTY TWO YEARS (SUBJECT TO NEEDS OF SERVICE)."," "," "," "," "," "," "," "," ","1986-03-30"]
[115,"Y","EMPLOYEE IS APPOINTED AS A CAREER-CANDIDATE ON A LIMITED APPOINTMENT","NTE *******, OR NEED FOR SERVICES, OR CONVERSION TO CAREER APPOINTMEN","T  BASED ON THE FINAL DECISION OF A COMMISSIONING BOARD ESTABLISHED UNDE","R        THE FS ACT OF 1980, WHICHEVER IS SOONEST."," "," "," "," "," ","1986-03-30"]
[116,"N","U.S. OPM SPECIAL TRAINING AGREEMENT, SSS:EDU 5-2, DATED AUGUST 12, 1988."," "," "," "," "," "," "," "," ","1986-05-11"]
["11C","N","TRAVEL AND TRANSPORTATION AND OTHER RELOCATION ALLOWANCES ARE IN","THE INTEREST OF THE GOVERNMENT & AUTHORIZED AS PROVIDED BY","PARAGRAPH 5333.5 OF THE CUSTOMS SERVICE TRAVEL GUIDELINES.","THERE ARE CERTAIN EXCEPTIONS THAT REQUIRE SPECIFIC AUTHORIZATIO","N AS        NOTED IN PARAGRAPH CITED. REFUND OF ALL EXPENSES WILL BE REQ","UIRED IF       THE INCUMBENT LEAVES THE FEDERAL SERVICE WITHIN 12 MONTHS","TRAVEL AND TRANSPORTATION AND OTHER RELOCATION ALLOWANCES ARE IN","THE INTEREST OF THE GOVERNMENT & AUTHORIZED AS PROVIDED BY","PARAGRAPH 5333.5 OF THE CUSTOMS SERVICE TRAVEL GUIDELINES.","1992-01-26"]
["11F","N","STATEMENT OF DUTIES ATTACHED TO EMPLOYEE COPY"," "," "," "," "," "," "," "," ","1990-01-01"]
["11I","N","CONGRATULATIONS ON YOUR PROMOTION"," "," "," "," "," "," "," "," ","1990-08-26"]
["11J","N","A DD-214 IS REQUIRED FOR VERIFICATION OF MILITARY SERVICE."," "," "," "," "," "," "," "," ","1991-04-07"]
["11P","N","ACTION DOCUMENTS CHANGE IN WORK SCHEDULE CODING.  THERE IS NO CHANGE IN","CONDITIONS OF EMPLOYMENT."," "," "," "," "," "," "," ","1995-01-13"]
["12C","N","RETIREMENT CLAIM                          ."," "," "," "," "," "," "," "," ","1992-01-26"]
["12F","N","THIS NOTICE IS ISSUED FOR RECORD PURPOSES ONLY"," "," "," "," "," "," "," "," ","1990-01-01"]
["12I","N","THANK YOU FOR YOUR SERVICE TO THE IRS"," "," "," "," "," "," "," "," ","1990-08-26"]
["12J","N","SCD TO BE COMPLETED UPON RECEIPT OF DOCUMENTATION OF PRIOR CREDITABLE","FEDERAL SERVICE."," "," "," "," "," "," "," ","1991-04-07"]
["12P","N","SPECIAL RATE UNDER PUBLIC LAW 101-509"," "," "," "," "," "," "," "," ","1996-01-01"]
["13C","N","EMPLOYMENT SUBJECT TO FURLOUGH WHEN SERVICES ARE NOT REQUIRED."," "," "," "," "," "," "," "," ","1992-01-26"]
["13F","N","RETROACTIVE DUE TO ADMINISTRATIVE OVERSIGHT"," "," "," "," "," "," "," "," ","1990-01-01"]
["13I","N","TEMPORARY REASSIGNMENT NTE.  UPON COMPLETION EMPLOYEE WILL RETUR","N  TO THEIR FORMER ORGANIZATION OF ASSIGNMENT"," "," "," "," "," "," "," ","1990-08-26"]
["13J","N","NEXT ADMINISTRATIVE PAY INCREASE TO BE EFFECTIVE ONE FULL YEAR FROM","UNLESS THERE IS RECOGNITION OF \"SLIPPAGE\"."," "," "," "," "," "," "," ","1991-04-07"]
["14C","N","ADMINISTRATIVE FURLOUGH IS IN ACCORDANCE WITH CONDITIONS OF APPOINTMENT."," "," "," "," "," "," "," "," ","1992-01-26"]
["14F","N","OFFICIAL POSITION DESCRIPTION ATTACHED TO EMPLOYEE COPY"," "," "," "," "," "," "," "," ","1990-01-01"]
["14I","N","EMPLOYEE IS EXPECTED TO WORK 6 MONTHS OR MORE EACH YEAR"," "," "," "," "," "," "," "," ","1990-08-26"]
["14J","N","EFFECTIVE DATE BASED ON RECOGNITION OF \"SLIPPAGE\"."," "," "," "," "," "," "," "," ","1991-04-07"]
[150,"N","EFFECTIVE WITH THIS OVERSEAS ASSIGNMENT, YOUR ANNUAL LEAVE ACCRUAL","CATEGORY IS RAISED TO THE 360 CEILING."," "," "," "," "," "," "," ","1985-10-13"]
[151,"N","SALARY INCLUDES PROFICIENCY INCREASE OF STEPS IN ACCORDANCE WITH 3 FAM","873.3."," "," "," "," "," "," "," ","1985-10-13"]
[152,"N","UPON NEXT PROMOTION, SALARY MUST REFLECT       ADDITIONAL STEPS NOT","REFLECTED IN THIS LANGUAGE PROFICIENCY INCREASE."," "," "," "," "," "," "," ","1985-10-13"]
[153,"N","APPOINTMENT BY THE PRESIDENT AS SECRETARY IN THE DIPLOMATIC SERVICE OF","THE USA."," "," "," "," "," "," "," ","1985-10-13"]
[154,"N","APPOINTMENT BY THE PRESIDENT AS CONSULAR OFFICER IN THE DIPLOMATIC SERVI","CE OF THE USA."," "," "," "," "," "," "," ","1985-10-13"]
[155,"N","APPOINTMENT BY THE PRESIDENT AS CONSULAR OFFICER AND SECRETARY IN THE","DIPLOMATIC SERVICE OF THE USA."," "," "," "," "," "," "," ","1985-10-13"]
[156,"N","REEMPLOYMENT RIGHTS TO THE CAREER PERSONNEL CATEGORY WHICH CONVERTED TO","LIMITED FS.  CONVERTED FROM"," "," "," "," "," "," "," ","1985-10-13"]
[157,"N","TOUR OF DUTY OF 18 MONTHS FOLLOWED BY HOME LEAVE AND TRANSFER (SUBJECT","TO NEEDS OF SERVICE)."," "," "," "," "," "," "," ","1985-10-13"]
[158,"N","TOUR OF DUTY OF 2 YEARS FOLLOWED BY HOME LEAVE AND TRANSFER (SUBJECT TO","NEEDS OF SERVICE)."," "," "," "," "," "," "," ","1985-10-13"]
[159,"N","TOUR OF DUTY OF 2 YEARS WITH ONE REST AND RECUPERATION TRIP DURING TOUR","(SUBJECT TO NEEDS OF SERVICE)."," "," "," "," "," "," "," ","1985-10-13"]
["15C","N","YOU ARE SUBJECT TO CALL AS NEEDED."," "," "," "," "," "," "," "," ","1992-01-26"]
["15F","N","THE INCUMBENT OF THIS POSITION IS INCLUDED IN THE FCC BARGAINING","UNIT-LABOR RELATIONS CODE"," "," "," "," "," "," "," ","1990-01-01"]
["15I","N","NO PRE-SCHEDULED TOUR OF DUTY"," "," "," "," "," "," "," "," ","1990-08-26"]
["15J","N","TRAVEL AND TRANSPORTATION EXPENSES WILL BE PAID BY THE GOVERNMENT","INCLUDING TRANSPORTATION OF HOUSEHOLD EFFECTS AND DEPENDENT FAMILY","MEMBERS."," "," "," "," "," "," ","1991-04-07"]
[160,"N","TOUR OF DUTY IS 2 YEARS SUBJECT TO EXTENSION BASED ON PERFORMANCE REVIEW","BY THE FCS ASSIGNMENTS PANEL."," "," "," "," "," "," "," ","1985-10-13"]
[161,"N","TOUR OF DUTY OF 4 YEARS WITH HOME LEAVE AFTER 2 YEARS (SUBJECT TO NEEDS","OF SERVICE)."," "," "," "," "," "," "," ","1985-10-13"]
[162,"N","TOUR OF DUTY OF 4 YEARS (SUBJECT TO NEEDS OF SERVICE)."," "," "," "," "," "," "," "," ","1985-10-13"]
[163,"N","TOUR OF DUTY OF 4 YEARS WITH HOME LEAVE AFTER 2 YEARS AND TWO REST AND","RECUPERATION TRIPS DURING TOUR (SUBJECT TO NEEDS OF SERVICE)."," "," "," "," "," "," "," ","1985-10-13"]
[164,"N","TOUR OF DUTY OF 3 YEARS FOLLOWED BY HOME LEAVE AND TRANSFER (SUBJECT TO","NEEDS OF SERVICE)."," "," "," "," "," "," "," ","1985-10-13"]
[165,"N","TOUR OF DUTY OF 3 YEARS WITH HOME LEAVE AFTER 18 MONTHS (SUBJECT TO NEED","S  OF SERVICE)."," "," "," "," "," "," "," ","1985-10-13"]
[166,"N","TOUR OF DUTY OF 3 YEARS WITH TWO REST AND RECUPERATION TRIPS DURING TOUR","(SUBJECT TO NEEDS OF SERVICE)."," "," "," "," "," "," "," ","1985-10-13"]
[167,"N","EMPLOYEE ELECTED AS A COUNTY COMMITTEE MEMBER"," "," "," "," "," "," "," "," ","1986-07-01"]
[168,"N","EMPLOYEE DESIGNATED AS A COUNTY COMMITTEE MEMBER"," "," "," "," "," "," "," "," ","1986-07-01"]
[169,"N","EMPLOYEE DESIGNATED AS AN ALTERNATE COUNTY COMMITTEE MEMBER"," "," "," "," "," "," "," "," ","1986-07-01"]
["16C","N","ISSUES."," "," "," "," "," "," "," "," ","1992-01-26"]
["16F","N","THE INCUMBENT OF THIS POSITION IS EXCLUDED FROM THE FCC BARGAINING UNITS","FOR THE FOLLOWING REASON-CATEGORY LABOR RELATION","S     CODE"," "," "," "," "," "," ","1990-01-01"]
["16I","N","APPOINTMENT ON A SEASONAL BASIS AS SERVICES ARE NEEDED"," "," "," "," "," "," "," "," ","1990-08-26"]
["16J","N","THIS VACANCY HAS BEEN REVIEWED.  THE DUTIES CANNOT BE REASSIGNED AND","THE POSITION CANNOT BE ABOLISHED WITHOUT SERIOUSLY AFFECTING THE","EXECUTION OF ESSENTIAL FUNCTIONS."," "," "," "," "," "," ","1991-04-07"]
["17C","N","THIS APPOINTMENT MAY BE TERMINATED AT ANY TIME IF YOUR SERVICES ARE","NO LONGER NEEDED OR FUNDS ARE NOT AVAILABLE."," "," "," "," "," "," "," ","1992-01-26"]
["17F","N","THIS ACTION IS FOR PERSONNEL RECORD PURPOSES ONLY AND MAY NOT BE A LEGAL","NAME CHANGE UNDER STATE LAW. CONTACT YOUR LOCAL SOCIAL SECURITY ADMIN",".     OFFICE TO REPORT NAME CHANGE. YOU MAY BE ELIGIBLE TO CHANGE YOUR","HEALTH BENEFITS AND LIFE INSURANCE COVERAGE. CHECK ANY DESIGNAT","IONS OF     BENEFICIARY YOU MAY HAVE FILED UNDER YOUR OLD NAME."," "," "," "," ","1990-01-01"]
["17I","N","TOUR IS 8 HOURS A DAY, 5 DAYS A WEEK, UNTIL CHANGE TO NON-WORK STATUS"," "," "," "," "," "," "," "," ","1990-08-26"]
["17J","N","AS THIS TRANSFER IS FOR YOUR PERSONAL CONVENIENCE, AND NOT TO MEET ANY","EMERGENCY IN THE SERVICE, YOUR TRANSPORTATION AND TRAVEL EXPENSES WIL","L     NOT BE PAID BY THE GOVERNMENT."," "," "," "," "," "," ","1991-04-07"]
["18C","N","LIMITATIONS OF PREVIOUS APPOINTMENT REMOVED."," "," "," "," "," "," "," "," ","1992-01-26"]
["18F","N","ELIGIBLE FOR HEALTH BENEFITS."," "," "," "," "," "," "," "," ","1990-01-01"]
["18I","N","MOVING EXPENSES UNDER PL 89-516 ARE AUTHORIZED"," "," "," "," "," "," "," "," ","1990-08-26"]
["19C","N","UPGRADING OF THIS POSITION RESULTS FROM THE INCUMBENT'S ACCRETION","OF HIGHER GRADE DUTIES AND RESPONSIBILITIES."," "," "," "," "," "," "," ","1992-01-26"]
["19I","N","MOVING EXPENSES UNDER PL 89-516 ARE NOT AUTHORIZED"," "," "," "," "," "," "," "," ","1990-08-26"]
["1BC","Y","OPM RECENTLY CHANGED THE NUMBERING SYSTEM FOR COLLECTIVE BARGAINING","UNITS.  THIS NUMBER IS REFLECTED AS \"BARGAINING UNIT STATUS\" ON YOUR","PERSONNEL ACTION."," "," "," "," "," "," ","2009-01-04"]
["1EP","N","EMPLOYEE HAS SUCCESSFULLY COMPLETED THE       SIX MONTHS OF THE","TRAINING PROGRAM."," "," "," "," "," "," "," ","1992-02-09"]
[200,"N","YOUR FEHB DEDUCTION WILL NOT BE PRORATED, IN ACCORDANCE WITH THE PART-TI","ME EMPLOYMENT ACT OF 1978."," "," "," "," "," "," "," ","1980-01-01"]
[202,"N","COVERED BY SOCIAL SECURITY AND BY CIVIL SERVICE RETIREMENT AT THE SPECIA","L  DEDUCTION RATE OF 7 1/2 PERCENT"," "," "," "," "," "," "," ","1983-12-12"]
[203,"N","STUDENT VOLUNTEER-EXPECTED TO WORK    HOURS PER WEEK."," "," "," "," "," "," "," "," ","1985-03-01"]
[204,"N","STUDENT VOLUNTEER-WORKED      HOURS         THROUGH           ."," "," "," "," "," "," "," "," ","1985-03-01"]
[205,"N","EMPLOYMENT IS NTE 120 DAYS FOLLOWING COMPLETION OF REQUIREMENTS FOR GRAD","UATION FROM A BACCALAUREATE DEGREE PROGRAM.  UPON SATISFACTORY COMPLE","TION  OF YOUR DEGREE PROGRAM, YOU MAY AT THE EMPLOYING AGENCY'S OPTION B","E NON-   COMPETITIVELY CONVERTED TO CAREER OR CAREER-CONDITIONAL APPOINT","MENT.  IF   YOUR PERFORMANCE IS NOT SATISFACTORY OR IF YOU FAIL TO SATIS","FACTORILY COM- PLETE THE PROGRAM, EMPLOYMENT WILL BE TERMINATED.","EMPLOYMENT IS NTE 120 DAYS FOLLOWING COMPLETION OF REQUIREMENTS FOR GRAD","=-  UATION FROM A BACCALAUREATE DEGREE PROGRAM.  UPON SATISFACTORY COMPLE","TION  OF YOUR DEGREE PROGRAM, YOU MAY AT THE EMPLOYING AGENCY'S OPTION B","1982-12-12"]
[208,"Y","CHANGE OF APPOINTING OFFICE. FORMER EMPLOYING OFFICE WAS *********."," "," "," "," "," "," "," "," ","1983-01-09"]
[209,"N","THIS IS A PRIMARY POSITION UNDER 5 CFR 831 SUBPART I - SPECIAL","RETIREMENT PROVISIONS FOR LAW ENFORCEMENT OFFICERS AND FIREFIGHTRS."," "," "," "," "," "," "," ","1983-03-06"]
["20C","N","THIS ACTION REMOVES ELIGIBILITY FOR STANDBY DUTY."," "," "," "," "," "," "," "," ","1992-01-26"]
["20F","N","APPOINTMENT AND RATE OF COMPENSATION APPROVED BY THE COMMISSIONER."," "," "," "," "," "," "," "," ","1990-01-01"]
["20I","N","NOTIFICATION OF CHANGE IN TOUR OF DUTY WILL BE BY SF-50"," "," "," "," "," "," "," "," ","1990-08-26"]
["20J","N","SERVICE CREDITABLE FROM         , COMPLETED 260 DAYS IN PAY STATUS","ENDING"," "," "," "," "," "," "," ","1991-04-07"]
[210,"N","THIS IS A SECONDARY POSITION UNDER 5 CFR 831 SUBPART I - SPECIAL","RETIREMENT PROVISIONS FOR LAW ENFORCEMENT OFFICERS AND FIREFIGHTERS."," "," "," "," "," "," "," ","1983-03-06"]
[211,"N","LWOP PENDING APPROVAL OF DISABILITY RETIREMENT APPLICATION."," "," "," "," "," "," "," "," ","1984-05-11"]
[215,"N","APPOINTMENTS FOR MASTER'S DEGREE CANDIDATES MUST NOT EXCEED 3O MONTHS","FROM DATE OF ENTRANCE INTO GRADUATE SCHOOL."," "," "," "," "," "," "," ","1985-03-01"]
[216,"N","APPOINTMENTS FOR DOCTORATE DEGREE CANDIDATES MUST NOT EXCEED 42 MONTHS","FROM DATE OF ENTRANCE INTO GRADUATE SCHOOL."," "," "," "," "," "," "," ","1985-03-01"]
[217,"N","UNDER 5 U.S.C. 3111, STUDENT VOLUNTEER IS NOT A FEDERAL EMPLOYEE FOR ANY","PURPOSE OTHER THAN INJURY COMPENSATION AND LAWS RELATED TO THE TORT","CLAIMS ACT.  SERVICE IS NOT CREDITABLE FOR LEAVE ACCRUAL OR ANY OT","HER      EMPLOYEE BENEFITS."," "," "," "," "," ","1985-03-01"]
[219,"N","OCCUPANCY OF POSITION LIMITED TO RETURN OF FORMER INCUMBENT APPROXIMATEL","Y"," "," "," "," "," "," "," ","1981-12-01"]
["21C","N","THE AGENCY COUNSELOR OR DEPUTY COUNSELOR HAS REVIEWED A STATEMENT","OF EMPLOYMENT AND FINANCIAL INTERESTS AND HAS DETERMINED THAT NO","CONFLICT OF INTEREST EXISTS."," "," "," "," "," "," ","1992-01-26"]
["21I","N","EMPLOYEE INFORMED IN ADVANCE OF REASONS/CONDITIONS OF THE PROMOTION"," "," "," "," "," "," "," "," ","1990-08-26"]
["21J","N","INTERMITTENT-NO REGULAR TOUR OF DUTY DURING EACH ADMINISTRATIVE WORK","WEEK."," "," "," "," "," "," "," ","1991-04-07"]
[220,"N","SF-85 NOT SUBMITTED BECAUSE EMPLOYEE WAS CLEARED ON PRIOR APPOINTMENT."," "," "," "," "," "," "," "," ","1981-12-01"]
[221,"N","SF-86 NOT SUBMITTED BECAUSE"," "," "," "," "," "," "," "," ","1981-12-01"]
[226,"N","SUBJECT TO SATISFACTORY RECORD CHECK AND INQUIRY UNDER EO 10450."," "," "," "," "," "," "," "," ","1981-12-01"]
[227,"N","SUBJECT TO SATISFACTORY MEDICAL."," "," "," "," "," "," "," "," ","1981-12-01"]
[228,"N","SATISFACTORY MEDICAL ON FILE."," "," "," "," "," "," "," "," ","1981-12-01"]
["22C","N","PREMIUM PAY FOR DUTY AUTHORIZED","COMPUTED ON THAT PART OF BASIC PAY WHICH DOES NOT EXCEED THE BASIC","PAY FOR GS-10, STEP 1 (5U.S.C. 5545)."," "," "," "," "," "," ","1992-01-26"]
["22I","N","DOCUMENT 7107 GIVEN TO EMPLOYEE"," "," "," "," "," "," "," "," ","1990-08-26"]
["22J","N","INCUMBENT WILL REVERT TO TENURE GROUP 1 UPON COMPLETION OF 1-YEAR","PROBATION PERIOD."," "," "," "," "," "," "," ","1991-04-07"]
[234,"N","ACCRUED ANNUAL LEAVE TO BE RETAINED FOR USE AFTER RESTORATION TO DUTY."," "," "," "," "," "," "," "," ","1982-09-19"]
["23C","N","YOU ARE HEREBY RETURNED TO DUTY IN A PAY STATUS FROM ADMINISTRATIVE","FURLOUGH."," "," "," "," "," "," "," ","1992-01-26"]
["23I","N","SF-2810 ISSUED"," "," "," "," "," "," "," "," ","1990-08-26"]
["23J","N","SF-2809/SF-2817 NOT ON FILE, EMPLOYEE RESIGNED PRIOR TO EXPIRATION OF","THE 31-DAY PERIOD."," "," "," "," "," "," "," ","1991-04-07"]
[247,"Y","NAME WAS FORMERLY *********************************"," "," "," "," "," "," "," "," ","1981-12-01"]
["24C","N","ALLOWANCE           ."," "," "," "," "," "," "," "," ","1992-01-26"]
["24I","N","LWOP WITHIN SEASON      HOURS"," "," "," "," "," "," "," "," ","1990-08-26"]
["24J","N","WITHIN-GRADE INCREASE DUE          EXTENDED DUE TO     HOURS EXCESS","LWOP."," "," "," "," "," "," "," ","1991-04-07"]
[254,"Y","THIS APPOINTMENT AS A MEMBER OF THE ******* COMMITTEE WILL","AUTOMATICALLY TERMINATE ON *******."," "," "," "," "," "," "," ","1981-12-01"]
[255,"Y","ENTITLED TO $****** PER DAY IN LIEU OF TRAVEL AND SUBSISTENCE EXPENSES."," "," "," "," "," "," "," "," ","1981-12-01"]
[256,"N","CONV TO TEMPORARY APPOINTMENT NEW COMMITTEE ESTABLISHED."," "," "," "," "," "," "," "," ","1981-12-01"]
["25C","N","FWS WAGE SCHEDULE REVISED PURSUANT TO 5 U.S.C. 5343(A)(4)."," "," "," "," "," "," "," "," ","1992-01-26"]
["25I","N","SEASON FROM          TO"," "," "," "," "," "," "," "," ","1990-08-26"]
["25J","N","COMPENSATED UNDER FEDERAL EMPLOYEE COMPENSATION ACT."," "," "," "," "," "," "," "," ","1991-04-07"]
[268,"N","ROTATIONAL ASSIGNMENT IN WASHINGTON,D.C.,NTE TO SERVICE AS",",WITHOUT REGARD TO CS REGS. AND WITH NO REDUCTIO","N IN  GRADE. (PL 89-106 AND DPM 930)."," "," "," "," "," "," ","1981-12-01"]
["26C","N","ADDITIONAL ANNUAL PREMIUM PAY FOR ADMINISTRATIVELY UNCONTROLLABLE","OVERTIME           ."," "," "," "," "," "," "," ","1992-01-26"]
["26I","N","LWOP MATERNITY (LESS THAN 30 DAYS)"," "," "," "," "," "," "," "," ","1990-08-26"]
["26J","N","CONFIRMED BY SENATE."," "," "," "," "," "," "," "," ","1991-04-07"]
[273,"N","APPOINTED WITHOUT COMPENSATION. WILL RECEIVE TRAVEL ALLOWANCE."," "," "," "," "," "," "," "," ","1981-12-01"]
[279,"N","DECREASE IN SEASONAL WORK."," "," "," "," "," "," "," "," ","1981-12-01"]
["27C","N","MEMBER OF STATE BAR."," "," "," "," "," "," "," "," ","1992-01-26"]
["27I","N","LWOP EDUCATION (LESS THAN 30 DAYS)"," "," "," "," "," "," "," "," ","1990-08-26"]
["27J","N","HONOR PROGRAM."," "," "," "," "," "," "," "," ","1991-04-07"]
[288,"N",".HR USE ONLY - RETRO PAYMENT AND/OR RE-VALIDATION SUPPRESSED"," "," "," "," "," "," "," "," ","2005-05-15"]
["28C","N","YOUR STATUS AND TENURE IN FEDERAL SERVICE REMAIN UNCHANGED."," "," "," "," "," "," "," "," ","1992-01-26"]
["28I","N","LWOP ILLNESS (LESS THAN 30 DAYS)"," "," "," "," "," "," "," "," ","1990-08-26"]
["28J","N","NAME CHANGE DUE TO MARRIAGE."," "," "," "," "," "," "," "," ","1991-04-07"]
[290,"N","RESEARCH SCIENTIST HAS COMPLETED 3-YEAR EXTENDED PROBATIONARY PERIOD UND","ER THE USDA DEMONSTRATION PROJECT"," "," "," "," "," "," "," ","1990-06-17"]
[291,"N","LUMP SUM CASH PAYMENT AUTHORIZED UNDER THE USDA DEMONSTRATION PROJECT"," "," "," "," "," "," "," "," ","1990-06-17"]
[292,"N","DEFERRED CASH PAYMENT AUTHORIZED UNDER THE USDA DEMONSTRATION PROJECT"," "," "," "," "," "," "," "," ","1990-06-17"]
[293,"N","INCREMENTAL CASH PAYMENT AUTHORIZED UNDER THE USDA DEMONSTRATION PROJECT"," "," "," "," "," "," "," "," ","1990-06-17"]
[294,"Y","SUBJECT TO A 3-YEAR EXTENDED PROBATIONARY PERIOD BEGINNING **********","AS PART OF A DEMONSTRATION PROJECT ESTABLISHED UNDER 5 U.S.C. 4703."," "," "," "," "," "," "," ","1990-06-17"]
[295,"N","INITIAL APPOINTMENT PROBATIONARY PERIOD COMPLETED (LAST DAY EMPLOYEE","SERVES IN A DEMONSTRATION PROJECT POSITION)."," "," "," "," "," "," "," ","1990-08-26"]
[296,"N","INITIAL APPOINTMENT PROBATIONARY PERIOD COMPLETED."," "," "," "," "," "," "," "," ","1990-08-26"]
["29C","N","ORDERS RECEIVED TO REPORT TO","ON       ."," "," "," "," "," "," "," ","1992-01-26"]
["29I","N","LWOP MATERNITY (MORE THAN 30 DAYS)"," "," "," "," "," "," "," "," ","1990-08-26"]
["29J","N","NAME CHANGE DUE TO DIVORCE."," "," "," "," "," "," "," "," ","1991-04-07"]
["2EP","N","EMPLOYEE HAS SUCCESSFULLY COMPLETED THE      YEAR OF THE","TRAINING PROGRAM."," "," "," "," "," "," "," ","1992-02-09"]
[303,"N","THE ACTION IS IN ACCORDANCE WITH THE APPRENTICESHIP AGREEMENT."," "," "," "," "," "," "," "," ","1985-03-01"]
[304,"N","EMPLOYEE INFORMED IN ADVANCE OF THE REASONS AND THE CONDITIONS OF","APPOINTMENT UNDER THE PRESIDENTIAL MANAGEMENT INTERN PROGRAM."," "," "," "," "," "," "," ","1985-03-01"]
[307,"N","AD 343 TO ESTABLISH SF2806 HISTORY SENT UNDER REQUEST (    )."," "," "," "," "," "," "," "," ","1983-01-01"]
[308,"N","EMPLOYEE HAS AUTHORIZED DEDUCTIONS FOR MILITARY SERVICE DEPOSITS."," "," "," "," "," "," "," "," ","1983-12-01"]
[309,"N","ACCEPTED ASC COUNTY EMPLOYMENT WITHOUT A BREAK IN SERVICE. ELIGIBLE TO","TRANSFER LEAVE (5 USC 6308)."," "," "," "," "," "," "," ","1981-12-01"]
["30C","N","THIS APPOINTMENT IS SUBJECT TO CERTAIN STATUTORY RESTRICTIONS RELATING","TO CONFLICT OF INTEREST.  COPY OF DEPARTMENTAL REGULATIONS WERE PRE-","VIOUSLY FURNISHED CONCERNING EMPLOYEE RESPONSIBILITY AND CONDUCT."," "," "," "," "," "," ","1992-01-26"]
["30G","N","INSUBORDINATION (DELIBERATE AND WILLFUL REFUSAL TO PERFORM ASSIGNED WORK","); INSOLENCE (FLAGRANT AND CONTEMPTUOUS DISRESPECT)."," "," "," "," "," "," "," ","1989-04-23"]
["30I","N","LWOP EDUCATION (MORE THAN 30 DAYS)"," "," "," "," "," "," "," "," ","1990-08-26"]
["30J","N","EMPLOYEE RECEIVED MILITARY COLA OF $  THIS YEAR."," "," "," "," "," "," "," "," ","1991-04-07"]
[314,"N","CONV TO TEMPORARY APPOINTMENT NEW COMMITTEE ESTABLISHED"," "," "," "," "," "," "," "," ","1981-12-01"]
["31C","N","YOU WILL CONTINUE TO BE SUBJECT TO CETAIN STATUTORY RESTRICTIONS RELATIN","G  TO CONFLICT OF INTEREST.  COPY OF DEPARTMENTAL REGULATIONS WERE","PREVIOUSLY FURNISHED CONCERNING EMPLOYEE RESPONSIBILITY AND CONDUC","."," "," "," "," "," ","1992-01-26"]
["31G","N","FIGHTING ON DUTY OR ON GALLERY PREMISES."," "," "," "," "," "," "," "," ","1989-04-23"]
["31I","N","LWOP ILLNESS (MORE THAN 30 DAYS)"," "," "," "," "," "," "," "," ","1990-08-26"]
["31J","N","YOUR SERVICE TO THE DEPARTMENT OF JUSTICE HAS BEEN APPRECIATED."," "," "," "," "," "," "," "," ","1991-04-07"]
[328,"N","TERMINATION OF APPOINTMENT BECAUSE OF ESTABLISHMENT OF A NEW COMMITTEE."," "," "," "," "," "," "," "," ","1981-12-01"]
["32C","N","MERIT PROMOTION PLAN."," "," "," "," "," "," "," "," ","1992-01-26"]
["32G","N","DRINKING OR POSSESSION OF INTOXICANTS WHILE ON DUTY."," "," "," "," "," "," "," "," ","1989-04-23"]
["32I","N","NON-COMPETITITVE ACTION"," "," "," "," "," "," "," "," ","1990-08-26"]
["32J","N","AUTHORITY IS 28 USC 548."," "," "," "," "," "," "," "," ","1991-04-07"]
["33C","N","PAYMENT WILL BE MADE FOR EACH DAY OR FRACTION OF A DAY THAT YOUR SERVICE","S  ARE UTILIZED."," "," "," "," "," "," "," ","1992-01-26"]
["33G","N","REPORTING FOR DUTY UNDER THE INFLUENCE OF INTOXICANTS TO A DEGREE WHICH","WOULD INTERFERE WITH THE PROPER PERFORMANCE OF DUTY, BE A MENACE TO S","AFETY OR BE PREJUDICIAL TO THE MAINTENANCE OF DISCIPLINE AND MORALE AMON","G FELLOW WORKERS."," "," "," "," "," ","1989-04-23"]
["33I","N","FROM APPROVED LWOP SINCE"," "," "," "," "," "," "," "," ","1990-08-26"]
["33J","N","AUTHORITY IS 28 USC 542."," "," "," "," "," "," "," "," ","1991-04-07"]
["34C","N","LAST PAID AT NIGHT SHIFT RATE OF          P.H."," "," "," "," "," "," "," "," ","1992-01-26"]
["34G","N","SELLING OR DISTRIBUTING NARCOTICS"," "," "," "," "," "," "," "," ","1989-04-23"]
["34I","N","CAREER LADDER PROMOTION (GS-9 AND ABOVE)"," "," "," "," "," "," "," "," ","1990-08-26"]
["34J","N","THIS TERMINATES PREVIOUS TEMPORARY APPOINTMENT."," "," "," "," "," "," "," "," ","1991-04-07"]
[354,"Y","THIS APPOINTMENT AS A MEMBER OF THE ******* COMMITTEE IS HEREBY","TERMINATED."," "," "," "," "," "," "," ","1981-12-01"]
["35C","N","EXCEPTION TO THE COMPETITIVE PROCEDURES OF THE CUSTOMS MERIT PROMOTION","PLAN."," "," "," "," "," "," "," ","1992-01-26"]
["35G","N","POSSESSING, CONSUMING OR REPORTING FOR DUTY UNDER THE INFLUENCE OF","NARCOTICS."," "," "," "," "," "," "," ","1989-04-23"]
["35I","N","CAREER LADDER PROMOTION (GS-7 AND BELOW)"," "," "," "," "," "," "," "," ","1990-08-26"]
["35J","N","THIS ACTION IS AN EXCEPTION TO MERIT PROMOTION PROCEDURES."," "," "," "," "," "," "," "," ","1991-04-07"]
["36C","N","RETROACTIVE PROMOTION IN ACCORDANCE WITH ARTICLE 17, SECTION 13 OF THE","NATIONAL AGREEMENT BETWEEN NTEU AND U.S. CUSTOMS SERVICE."," "," "," "," "," "," "," ","1992-01-26"]
["36G","N","IMMORAL OR INDECENT ACTS, ON THE JOB. MISCONDUCT OFF THE JOB WHICH IS","PREJUDICIAL TO THE IMAGE OR REPUTATION OF THE GALLERY OR THE GOVERNME","NT."," "," "," "," "," "," ","1989-04-23"]
["36I","N","LAST DATE SEPARATING EMPLOYEE WILL BE CARRIED ON THE ROLLS"," "," "," "," "," "," "," "," ","1990-08-26"]
["36J","N","MILITARY RETIRED PAY WAIVED, CERTIFICATION ATTACHED."," "," "," "," "," "," "," "," ","1991-04-07"]
["37C","N","EMPLOYEE IS AUTHORIZED      % PREMIUM PAY."," "," "," "," "," "," "," "," ","1992-01-26"]
["37F","N","THE DUTY STATION LISTED IN BLOCK 39 MAY NOT REPRESENT THE OFFICIAL DUTY","STATION AND MAY ONLY REFER TO THE CLOSEST IDENTIFIABLE TOWN OR CITY.","REFER TO LOCAL ASSIGNMENT DOCUMENTATION FOR THE PRIMARY DUTY LOCAT","ION      AND GEOGRAPHICAL LIMITS OF THE OFFICIAL DUTY STATION."," "," "," "," "," ","1991-08-11"]
["37G","N","PROMOTION OF GAMBLING."," "," "," "," "," "," "," "," ","1989-04-23"]
["37I","N","LUMP SUM PAYMENT WILL NOT BE MADE FOR ALL ANNUAL LEAVE TO YOUR CREDIT AS","OF THE EFFECTIVE DATE OF YOUR SEPARATION"," "," "," "," "," "," "," ","1990-08-26"]
["37J","N","SALARY BASED ON RETAINED PAY PLAN, GRADE, STEP OF"," "," "," "," "," "," "," "," ","1991-04-07"]
[380,"N","TERMINATE FDIC HEALTH PLAN ENROLLMENT."," "," "," "," "," "," "," "," ","1988-06-19"]
[381,"N","TRANSFER FDIC HEALTH PLAN ENROLLMENT TO THE CARRIER."," "," "," "," "," "," "," "," ","1988-06-19"]
[383,"N","CONV TO TEMPORARY APPOINTMENT NEW COMMITTEE ESTABLISHED"," "," "," "," "," "," "," "," ","1981-12-01"]
[388,"N","TERMINATE FEHB ENROLLMENT."," "," "," "," "," "," "," "," ","1981-12-01"]
[389,"N","TRANSFER FEHB ENROLLMENT TO OPM."," "," "," "," "," "," "," "," ","1979-12-01"]
["38C","N","EMPLOYEE INFORMED IN ADVANCE OF REASON FOR AND THE CONDITIONS OF THE","PROMOTION."," "," "," "," "," "," "," ","1992-01-26"]
["38G","N","GAMBLING WHILE ON DUTY OR ON PREMISES."," "," "," "," "," "," "," "," ","1989-04-23"]
["38I","N","TEMPORARY REASSIGNMENT NTE"," "," "," "," "," "," "," "," ","1990-08-26"]
["38J","N","SERVICE YEAR BEGINNING DATE CHANGED TO         ."," "," "," "," "," "," "," "," ","1991-04-07"]
[390,"N","TRANSFER FEHB TO DC RETIREMENT SYSTEM."," "," "," "," "," "," "," "," ","1990-01-14"]
[391,"N","TRANSFER COVA RETIREMENT TO ANNUITY SYSTEM"," "," "," "," "," "," "," "," ","1995-12-10"]
[392,"N","EMPLOYEE TERMINATED FEHB ENROLLMENT","NONPAY STATUS OR INSUFFICIENT PAY STATUS"," "," "," "," "," "," "," ","1997-01-06"]
[393,"N","TERMINATED FEHB ENROLLMENT/5 CFR 890.502B(3)AND(5)","EMPLOYEE FAILED TO RESPOND TO WRITTEN NOTICE DURING A PERIOD OF NON","PAY     STATUS OR INSUFFICIENT PAY STATUS"," "," "," "," "," "," ","1997-01-06"]
[398,"N","SF-8 FURNISHED."," "," "," "," "," "," "," "," ","1981-12-01"]
["39C","N","ACTION EFFECTED TO CHANGE A FEDERAL JUNIOR FELLOWSHIP PARTICIPANT TO","A TEMPORARY APPOINTMENT DURING A STUDY PERIOD."," "," "," "," "," "," "," ","1992-01-26"]
["39G","N","FAILURE TO CARRY OUT SPECIFIC VERBAL OR WRITTEN ORDERS OR TO OBSERVE","REGULATIONS PRESCRIBED BY COMPETENT AUTHORITY:","SAFETY OF PERSONS OR PROPERTY ENDANGERED"," "," "," "," "," "," ","1989-04-23"]
["39I","N","SUBJECT TO DRUG SCREENING"," "," "," "," "," "," "," "," ","1990-08-26"]
["39J","N","SERVICE YEAR EARNINGS LIMITATION IS $"," "," "," "," "," "," "," "," ","1991-04-07"]
[401,"N","UNDESIRABLE DUTY HOURS."," "," "," "," "," "," "," "," ","1981-12-01"]
[402,"N","TOO MUCH JOB PRESSURE."," "," "," "," "," "," "," "," ","1981-12-01"]
[403,"N","WORK TOO HARD."," "," "," "," "," "," "," "," ","1981-12-01"]
[404,"N","TOO MUCH TRAVEL."," "," "," "," "," "," "," "," ","1981-12-01"]
[405,"N","POOR PHYSICAL ENVIRONMENT."," "," "," "," "," "," "," "," ","1981-12-01"]
[406,"N","JOB LOCATION TOO FAR FROM RESIDENCE OR TRANSPORTATION INADEQUATE."," "," "," "," "," "," "," "," ","1981-12-01"]
[407,"N","DISSATISIFIED WITH AMOUNT OF OVERTIME WORK."," "," "," "," "," "," "," "," ","1981-12-01"]
[408,"N","ACCEPTED ASC COUNTY EMPLOYMENT WITHOUT BREAK IN SERVICE. ELIGIBLE TO","TRANSFER LEAVE (5 USC 6308)."," "," "," "," "," "," "," ","1981-12-01"]
[409,"N","ACCEPTED EMPLOYMENT IN ANOTHER FEDERAL AGENCY."," "," "," "," "," "," "," "," ","1981-12-01"]
["40C","N","POSITION RENUMBERED WITHOUT CHANGE TO DUTIES AND RESPONSIBILITIES."," "," "," "," "," "," "," "," ","1992-01-26"]
["40G","N","FAILURE TO CARRY OUT SPECIFIC VERBAL OR WRITTEN ORDERS OR TO OBSERVE","REGULATIONS PRESCRIBED BY COMPETENT AUTHORITY:","SAFETY OF PERSONS OR PROPERTY NOT ENDANGERED"," "," "," "," "," "," ","1989-04-23"]
["40I","N","POSITION FILLED UNDER VA#                        , DATED         , BELOW","FULL PERFORMANCE LEVEL.  PROMOTION THROUGH GS-   MAY BE MADE WITHOUT","FURTHER COMPETITION PROVIDED ADMINISTRATIVE, QUALIFICATION, AND TI","ME-IN-   GRADE REQUIRMENTS ARE MET; THE ABILITY TO WORK AT THE HIGHER LE","VEL HAS     BEEN DEMONSTRATED, AND THERE IS HIGHER LEVEL WORK PERFORMED"," "," "," "," ","1990-08-26"]
["40J","N","UNDER FPM LTR 831-80, DATED 02/23/84, SURVIVORS OF DECEASED EMPLOYEES","MAY MAKE, OR COMPLETE A DEPOSIT FOR THE EMPLOYEE'S POST-1956 MILITARY","SERVICE IN ONE LUMP SUM.  TO COMPLETE THE EMPLOYEE'S SERVICE CREDI","T        DEPOSIT INITIATED WITH THIS AGENCY, THE UNPAID BALANCE OF $","MUST BE REMITTED TO THIS AGENCY NOT LATER THAN          (DAT","E OF DEATH     PLUS 76 DAYS).  OPM WILL NOT DELAY FINAL ADJUDICATION OF","UNDER FPM LTR 831-80, DATED 02/23/84, SURVIVORS OF DECEASED EMPLOYEES","MAY MAKE, OR COMPLETE A DEPOSIT FOR THE EMPLOYEE'S POST-1956 MILITARY","SERVICE IN ONE LUMP SUM.  TO COMPLETE THE EMPLOYEE'S SERVICE CREDI","1991-04-07"]
[410,"N","ACCEPTED EMPLOYMENT IN STATE OR LOCAL GOVERNMENT."," "," "," "," "," "," "," "," ","1981-12-01"]
[411,"N","INSUFFICIENT CHALLENGE."," "," "," "," "," "," "," "," ","1981-12-01"]
[412,"N","INSUFFICIENT PRESTIGE."," "," "," "," "," "," "," "," ","1981-12-01"]
[413,"N","SKILLS NOT SUFFICIENTLY UTILIZED."," "," "," "," "," "," "," "," ","1981-12-01"]
[414,"N","DO NOT LIKE OR NOT SUITED TO KIND OF WORK."," "," "," "," "," "," "," "," ","1981-12-01"]
[415,"N","JOB NOT IN LINE WITH CAREER PLANS."," "," "," "," "," "," "," "," ","1981-12-01"]
[416,"N","NOT ENOUGH RECOGNITION FOR ACCOMPLISHMENTS."," "," "," "," "," "," "," "," ","1981-12-01"]
[417,"N","ACCEPTED EMPLOYMENT IN PRIVATE ENTERPRISE."," "," "," "," "," "," "," "," ","1981-12-01"]
[418,"N","SEEKING OTHER EMPLOYMENT."," "," "," "," "," "," "," "," ","1981-12-01"]
[419,"N","ASSUMING HOUSEHOLD DUTIES."," "," "," "," "," "," "," "," ","1981-12-01"]
["41C","N","SATISFACTORILY COMPLETED FULL FIELD INVESTIGATION."," "," "," "," "," "," "," "," ","1992-01-26"]
["41G","N","FAILING TO CARRY OUT REGULARLY ASSIGNED DUTIES, INCLUDING FAILURE OR","LATENESS IN MAKING ASSIGNED PATROLS, ETC."," "," "," "," "," "," "," ","1989-04-23"]
["41I","N","POSITION FILLED UNDER VA#                         , DATED         .","TEMPORARY PROMOTION MAY BE MADE WITHOUT FURTHER COMPETITION OR EXTEND","ED    NTE   YEARS"," "," "," "," "," "," ","1990-08-26"]
["41J","N","FISCAL YEAR      PERFORMANCE MANAGEMENT AND RECOGNITION SYSTEM (PMRS)","PERFORMANCE AWARD OF $"," "," "," "," "," "," "," ","1991-04-07"]
[421,"N","WISH TO MOVE TO DIFFERENT AREA FOR PERSONAL REASONS."," "," "," "," "," "," "," "," ","1981-12-01"]
["42C","N","MERIT PAY CASH AWARD BASED ON PERFORMANCE."," "," "," "," "," "," "," "," ","1992-01-26"]
["42G","N","CREATING A PUBLIC DISTURBANCE; RUDENESS OR USE OF THREATENING LANGUAGE T","O  OTHER PERSONS."," "," "," "," "," "," "," ","1989-04-23"]
["42I","N","INELIGIBLE FOR WITHIN-GRADE INCREASE"," "," "," "," "," "," "," "," ","1990-08-26"]
["42J","N","NEW DUTY STATION.  IS CORRECT STATE FOR WITHHOLDING TAXES?","IF NOT, NOTIFY PERSONNEL OFFICE IMMEDIATELY."," "," "," "," "," "," "," ","1991-04-07"]
[431,"N","NOT ENOUGH PAY."," "," "," "," "," "," "," "," ","1981-12-01"]
[432,"N","NOT ENOUGH FRINGE BENEFITS."," "," "," "," "," "," "," "," ","1981-12-01"]
[433,"N","NOT ENOUGH PROMOTIONAL OPPORTUNITY."," "," "," "," "," "," "," "," ","1981-12-01"]
[434,"N","LACK OF JOB SECURITY."," "," "," "," "," "," "," "," ","1981-12-01"]
["43C","N","PER POLICY STATEMENT 3120-05 DATED 6/3/86, THE MAXIMUM PERIOD OF THIS","ASSIGNMENT IS 5 YEARS (AN INITIAL 2 YEAR ASSIGNMENT WITH A POSSIBLE","2 YEAR EXTENSION AND A 1 YEAR EXTENSION FOR EXTENUATING CIRCUMSTAN","ES)."," "," "," "," "," ","1992-01-26"]
["43G","N","ABANDONING POST OF DUTY WITHOUT PROPER AUTHORIZATION."," "," "," "," "," "," "," "," ","1989-04-23"]
["43J","N","NEW STATE TAX CODE.  IS CORRECT STATE FOR WITHHOLDING","TAXES?  IF NOT, NOTIFY PERSONNEL OFFICE IMMEDIATELY."," "," "," "," "," "," "," ","1991-04-07"]
[441,"N","PERSONAL ILLNESS."," "," "," "," "," "," "," "," ","1981-12-01"]
[442,"N","PHYSICAL DISABILITY OTHER THAN RETIREMENT DISABILITY."," "," "," "," "," "," "," "," ","1981-12-01"]
[443,"N","PSYCHOLOGICAL OR NERVOUS DISORDERS."," "," "," "," "," "," "," "," ","1981-12-01"]
[444,"N","PREGNANCY."," "," "," "," "," "," "," "," ","1981-12-01"]
["44C","N","EMPLOYEE ACQUIRED COMPETITIVE STATUS UPON CONVERSION."," "," "," "," "," "," "," "," ","1992-01-26"]
["44G","N","ABANDONING POST OF DUTY WITHOUT PROPER AUTHORIZATION (WHERE SAFETY OF","PROPERTY OR PERSONS IS ENDANGERED)."," "," "," "," "," "," "," ","1989-04-23"]
["44J","N","CORRECTION IS RETROACTIVE TO APPOINTMENT DATE OF"," "," "," "," "," "," "," "," ","1991-04-07"]
[451,"N","DO NOT GET ALONG WITH FELLOW WORKERS."," "," "," "," "," "," "," "," ","1981-12-01"]
[452,"N","DO NOT GET ALONG WITH SUPERVISOR."," "," "," "," "," "," "," "," ","1981-12-01"]
[453,"N","FAVORITISM IN ASSIGNMENT, PROMOTIONS, ETC."," "," "," "," "," "," "," "," ","1981-12-01"]
[454,"N","DISCRIMINATION BECAUSE OF RACE, COLOR, OR NATIONAL ORIGIN."," "," "," "," "," "," "," "," ","1981-12-01"]
[455,"N","DISCRIMINATION BECAUSE OF RELIGION."," "," "," "," "," "," "," "," ","1981-12-01"]
[456,"N","DISCRIMINATION BECAUSE OF SEX."," "," "," "," "," "," "," "," ","1981-12-01"]
[457,"N","DISCRIMINATION BECAUSE OF AGE."," "," "," "," "," "," "," "," ","1981-12-01"]
["45C","N","RETURN RIGHTS ARE AS SPECIFIED IN THE NEGOTIATED AGREEMENT, ARTICLE 20,","SECTION 18/19: WITHIN 120 DAYS PRIOR TO THE COMPLETION OF THIS TOUR","OF DUTY AT A CUSTOMS PRECLEARENCE STATION, THE EMPLOYEE WILL SUBMI","T A      PRIORITIZED LIST OF AT LEAST 2, UP TO 3 DISTRICTS WITHIN HIS OR","IGINAL      REGION AND ONE ADDITIONAL DISTRICT OUTSIDE HIS ORIGINAL REGI","ON TO WHICH    HE PREFERS TO BE REASSIGNED. ABSENT JUST CAUSE, THE EMPLO","RETURN RIGHTS ARE AS SPECIFIED IN THE NEGOTIATED AGREEMENT, ARTICLE 20,","SECTION 18/19: WITHIN 120 DAYS PRIOR TO THE COMPLETION OF THIS TOUR","OF DUTY AT A CUSTOMS PRECLEARENCE STATION, THE EMPLOYEE WILL SUBMI","1992-01-26"]
["45G","N","RECURRING TARDINESS: BEING LATE FOR WORK (UP TO 30 MINUTES) WITHOUT","ADEQUATE JUSTIFICATION. A PENALTY ACTION MAY BE IMPOSED WHENEVER 3","UNEXCUSED TARDINESSES OCCUR WITHIN A PERIOD OF 2 MONTHS OR LESS."," "," "," "," "," "," ","1989-04-23"]
["45I","N","SEPARATION SF-2819 AND SF-2821 PROVIDED TO EMPLOYEE"," "," "," "," "," "," "," "," ","1990-08-26"]
["45J","N","CHANGE IS RETROACTIVE TO APPOINTMENT OF"," "," "," "," "," "," "," "," ","1991-04-07"]
[461,"N","MARRIAGE."," "," "," "," "," "," "," "," ","1981-12-01"]
[462,"N","CHILDREN REQUIRE FULL-TIME ATTENTION."," "," "," "," "," "," "," "," ","1981-12-01"]
[463,"N","ILLNESS IN FAMILY."," "," "," "," "," "," "," "," ","1981-12-01"]
["46C","N","SATISFACTORILY COMPLETED DRUG SCREENING."," "," "," "," "," "," "," "," ","1992-01-26"]
["46G","N","ABSENCE FROM DUTY FOR ONE DAY OR LESS WITHOUT PERMISSION AND WITHOUT","ADEQUATE JUSTIFICATION. INCLUDES TARDINESS OF MORE THAN 30 MINUTES AN","D     LEAVING THE JOB WITHOUT PERMISSION."," "," "," "," "," "," ","1989-04-23"]
["46I","N","SEPARATION SF-293 PROVIDED TO EMPLOYEE"," "," "," "," "," "," "," "," ","1990-08-26"]
["46J","N","OPF IS MAINTAINED BY:  DOJ EOUSA, BICN BUILDING, ROOM 8017, WASH, DC",20530," "," "," "," "," "," "," ","1991-04-07"]
[471,"N","TO FURTHER EDUCATION."," "," "," "," "," "," "," "," ","1981-12-01"]
[472,"N","OPPORTUNITY FOR MORE ON-THE-JOB TRAINING."," "," "," "," "," "," "," "," ","1981-12-01"]
[473,"N","TO BROADEN EXPERIENCE."," "," "," "," "," "," "," "," ","1981-12-01"]
[474,"N","STUDENT RETURNING TO SCHOOL."," "," "," "," "," "," "," "," ","1981-12-01"]
[475,"N","FACULTY MEMBER RETURNING TO REGULAR PROFESSION."," "," "," "," "," "," "," "," ","1981-12-01"]
["47C","N","INELIGIBLE FOR HEALTH BENEFITS, EMPLOYMENT NTE 20 HOURS IN ANY CALENDAR","WEEK OR 40 HOURS IN ANY CALENDAR WEEK WHICH FALLS WITHIN A VACATION","PERIOD. APPOINTEE MEETS ALL REQUIREMENTS UNDER STAY-IN-SCHOOL CAMP","AIGN     AS PROVIDED BY FPM CHAPTER213, APPENDIX F."," "," "," "," "," ","1992-01-26"]
["47G","N","ABSENCE FROM DUTY FOR MORE THAN ONE DAY WITHOUT PERMISSION AND WITHOUT","ADEQUATE JUSTIFICATION. (WHEN ABSENCE EXCEEDS 10 DAYS WITHOUT PERMISS","ION   AND WITHOUT ADEQUATE JUSTIFICATION, THE PENALTY OF REMOVAL MAY BE","IMPOSED  FOR THE FIRST OFFENSE.)"," "," "," "," "," ","1989-04-23"]
["47I","N","SEPARATION DOCUMENT 7106 PROVIDED TO EMPLOYEE"," "," "," "," "," "," "," "," ","1990-08-26"]
["47J","N","OPF IS MAINTAINED BY:  DEPARTMENT OF JUSTICE ATTORNEY PERSONNEL,","ROOM 4311, 10TH & PENN AVE, NW, WASH, DC 20530"," "," "," "," "," "," "," ","1991-04-07"]
[481,"N","VOLUNTARY RESIGNATION TO ENTER ARMED FORCES."," "," "," "," "," "," "," "," ","1981-12-01"]
[482,"N","RESIGNATION WHILE ON MILITARY FURLOUGH."," "," "," "," "," "," "," "," ","1981-12-01"]
[483,"N","SEPARATION BY AGENCY-EMPLOYEE ENTERING ARMED FORCES."," "," "," "," "," "," "," "," ","1981-12-01"]
[484,"N","NO RETURN FROM MILITARY FURLOUGH."," "," "," "," "," "," "," "," ","1981-12-01"]
["48C","N","IF THIS POSITION DOES NOT BECOME PERMANENT, THE INCUMBENT WILL BE","RETURNED TO THE SAME OR SIMILAR POSITION HE/SHE HELD IN THE REGION","AT THE GRADE LEVEL HELD PRIOR TO THE TEMPORARY PROMOTION/REASSIGNM","ENT.     SHOULD THE POSITION BECOME PERMANENT, THE SELECTEE WILL RETAIN","PROMOTION WITHOUT FURTHER COMPETITION."," "," "," "," ","1992-01-26"]
["48G","N","MISUSE OF SICK LEAVE (USING SICK LEAVE FOR ABSENCE UNRELATED TO ILLNESS","OR MEDICAL CARE)."," "," "," "," "," "," "," ","1989-04-23"]
["48I","N","SEPARATION INFORMATION ON WITHDRAWING YOUR TSP ACCOUNT BALANCE AND TSP-1","8  PROVIDED TO EMPLOYEE"," "," "," "," "," "," "," ","1990-08-26"]
["48J","N","ELIGIBILITY FOR ADMINISTRATIVE PAY INCREASE IS ONE FULL YEAR FROM"," "," "," "," "," "," "," "," ","1991-04-07"]
[499,"N","."," "," "," "," "," "," "," "," ","1981-12-01"]
["49C","N","EMPLOYEE SUBJECT TO TRANSPORTATION, SERVICE, AND REIMBURSEMENT AGREEMENT","REQUIRED BY 5 U.S.C. 5723(B) OR 5724(I),AS APPLICABLE FOR PAYMENT OF","MOV_  ING EXPENSES,WHICH DOES NOT EXPIRE UNTIL       ."," "," "," "," "," "," ","1992-01-26"]
["49G","N","SLEEPING ON DUTY WHERE SAFETY AND SECURITY OF PERSONS OR PROPERTY IS NOT","ENDANGERED."," "," "," "," "," "," "," ","1989-04-23"]
["49I","N","SF-8, SF-2821, AND SF-2810 ISSUED"," "," "," "," "," "," "," "," ","1990-08-26"]
["49J","N","RETAINED UNDER THE AUTHORITY OF REG. 316.702."," "," "," "," "," "," "," "," ","1991-04-07"]
[501,"Y","SICK LEAVE BALANCE AS OF THE DAY BEFORE EFFECTIVE DATE OF THIS ACTION IS","*******."," "," "," "," "," "," "," ","1998-06-21"]
[502,"N","AMOUNT IN BLOCK 32 REPRESENTS A LUMP SUM PRO RATA SHARE OF THE EQUIVALEN","T  OF ANY WITHIN-GRADE INCREASE OR MERIT INCREASE WHICH WOULD HAVE BEEN","DUE."," "," "," "," "," "," ","1987-10-01"]
[503,"N","ENTITLED TO SUPERVISORY/MANAGERIAL DIFFERENTIAL AT THE RATE OF 6% OF","SALARY.  THE SUPERVISORY/MANAGERIAL DIFFERENTIAL IS CONSIDERED A PART","OF   BASE PAY."," "," "," "," "," "," ","1987-10-01"]
[504,"N","ENTITLED TO SUPERVISORY/MANAGERIAL DIFFERENTIAL AT THE RATE OF 3% OF","SALARY.  THE SUPERVISORY/MANAGERIAL DIFFERENTIAL IS CONSIDERED A PART","OF   BASE PAY."," "," "," "," "," "," ","1987-10-01"]
[505,"N","MAY EXCEED UP TO 6% OF MAXIMUM RATE OF PAY BAND BASED ON PERFORMANCE."," "," "," "," "," "," "," "," ","1998-03-29"]
[507,"N","RECRUITMENT ALLOWANCE OF $          TO BE PAID IN A LUMP SUM.  SERVICE","AGREEMENT HAS BEEN SIGNED."," "," "," "," "," "," "," ","1987-10-01"]
[508,"N","RECRUITMENT ALLOWANCE OF $            TO BE PAID IN INCREMENTS.  SERVICE","AGREEMENT HAS BEEN SIGNED."," "," "," "," "," "," "," ","1987-10-01"]
[509,"N","ZSP SEC.10 P.L. 99-574"," "," "," "," "," "," "," "," ","1987-10-01"]
["50C","N","TRAINING AGREEMENT EXECUTED."," "," "," "," "," "," "," "," ","1992-01-26"]
["50G","N","SLEEPING ON DUTY WHERE SAFETY OF PERSONS OR PROPERTY IS ENDANGERED."," "," "," "," "," "," "," "," ","1989-04-23"]
["50I","N","SF-8 AND SF-2821 ISSUED"," "," "," "," "," "," "," "," ","1990-08-26"]
["50J","N","DANGER PAY ENTITLEMENT FROM    % TO    %."," "," "," "," "," "," "," "," ","1991-04-07"]
[510,"Y","APPOINTMENT IS SUBJECT TO COMPLETION OF A ONE TO THREE YEAR INITIAL","PROBATIONARY PERIOD BEGINNING *******."," "," "," "," "," "," "," ","1987-10-01"]
[511,"Y","APPOINTMENT IS SUBJECT TO COMPLETION OF A ONE TO THREE YEAR TRIAL PERIOD","BEGINNING *********."," "," "," "," "," "," "," ","1987-10-01"]
[512,"N","DEMONSTRATION PROJECT POSITION ABOVE IS EQUIVALENT TO GRADE","STEP        .  IN DETERMINING EQUIVALENT GS GRADE, BASE PAY REDUCED B","Y     LOCALITY PAYMENT OF      %."," "," "," "," "," "," ","1987-10-01"]
[513,"N","DEMONSTRATION PROJECT POSITION ABOVE IS EQUIVALENT TO       .SALARY FALL","S  BETWEEN STEP       AND STEP     ."," "," "," "," "," "," "," ","1987-10-01"]
[514,"N","DEMONSTRATION PROJECT POSITION ABOVE IS EQUIVALENT TO     . SALARY","EXCEEDS STEP 10. EMPLOYEE ELIGIBLE FOR PAY RETENTION."," "," "," "," "," "," "," ","1987-10-01"]
[515,"N","RETENTION ALLOWANCE OF $       TO BE PAID IN INCREMENTS.  SERVICE AGREEM","ENTHAS BEEN SIGNED."," "," "," "," "," "," "," ","1987-10-01"]
[516,"Y","PAYABLE SALARY LIMITED TO $********** BY P.L. 99-574, NBS DEMONSTRATION","PROJECT"," "," "," "," "," "," "," ","1990-03-25"]
[517,"N","ACCEPTED BELATED TRANSFER ELECTION FOR 1987 OPEN SEASON UNDER AUTHORITY","OF 5 CFR 846.204(A)."," "," "," "," "," "," "," ","1988-04-28"]
["51C","N","UNIFORM ALLOWANCE AUTHORIZED."," "," "," "," "," "," "," "," ","1992-01-26"]
["51G","N","FALSIFICATION OR UNLAWFUL CONCEALMENT, REMOVAL, MUTILATION, OR DESTRUCTI","ON OF ANY OFFICIAL DOCUMENTS OR RECORDS."," "," "," "," "," "," "," ","1989-04-23"]
["51I","N","SF-8 AND SF-2810 ISSUED"," "," "," "," "," "," "," "," ","1990-08-26"]
["51J","N","EMPLOYMENT IS NTE 18 MONTHS AND AT FULL PAY."," "," "," "," "," "," "," "," ","1991-04-07"]
[520,"N","ELIGIBLE FOR DIFFERENTIAL AND ALLOWANCE IN ACCORDANCE WITH STANDARDIZED","REGULATIONS."," "," "," "," "," "," "," ","1981-12-01"]
[521,"N","ELIGIBLE FOR POST ALLOWANCE IN ACCORDANCE WITH STANDARDIZED REGULATIONS."," "," "," "," "," "," "," "," ","1981-12-01"]
[522,"N","TOUR OF DUTY - TWO YEARS FROM DATE OF ARRIVAL AT POST OF DUTY."," "," "," "," "," "," "," "," ","1981-12-01"]
[523,"N","IN CONTINUATION OF PRESENT TOUR OF DUTY ABROAD."," "," "," "," "," "," "," "," ","1981-12-01"]
[524,"N","HOME LEAVE WILL BE EARNED ON BASIS OF AVAILABILITY FOR WORLD WIDE","ASSIGNMENT."," "," "," "," "," "," "," ","1981-12-01"]
[525,"N","THIS POSITION IS UNDER SCHEDULE A AND IS OUTSIDE THE COMPETITIVE CIVIL -","SERVICE. IN ACCEPTING THIS APPOINTMENT THE INCUMBENT UNDERSTANDS THAT","THE  APPOINTMENT IS TERMINABLE UPON NOTICE THEREOF."," "," "," "," "," "," ","1981-12-01"]
[526,"N","U.S. RESIDENT."," "," "," "," "," "," "," "," ","1981-12-01"]
[527,"N","INELIGIBLE FOR HOME LEAVE."," "," "," "," "," "," "," "," ","1981-12-01"]
[528,"N","ELIGIBLE TO ACCUMULATE 30 DAYS OF ANNUAL LEAVE."," "," "," "," "," "," "," "," ","1981-12-01"]
[529,"N","HOME LEAVE WILL BE EARNED ON BASIS OF POST DIFFERENTIAL."," "," "," "," "," "," "," "," ","1981-12-01"]
["52C","N","WELCOME TO HEADQUARTERS."," "," "," "," "," "," "," "," ","1992-01-26"]
["52G","N","LENDING MONEY FOR PROFIT ON NGA PREMISES TO ANY OTHER PERSON; BORROWING","MONEY FROM A SUBORDINATE EMPLOYEE OR SECURING HIS ENDORSEMENT ON A LO","AN."," "," "," "," "," "," ","1989-04-23"]
["52I","N","SF-2821 ISSUED"," "," "," "," "," "," "," "," ","1990-08-26"]
["52J","N","ALTHOUGH THE FEDERAL EMPLOYEES' RETIREMENT SYSTEM (FERS) COVERAGE IS","EFFECTIVE 01/01/87, DUE TO TECHNICAL ADMENDMENTS TO THE FERS ACT, FER","S     EMPLOYEE DEDUCTIONS AND AGENCY CONTRIBUTIONS COMMENCE 01/04/87."," "," "," "," "," "," ","1991-04-07"]
["52M","N"," "," "," "," "," "," "," "," "," ","2010-03-28"]
[530,"N","THIS EMPLOYEE WILL WORK SIX 24-HOUR DAYS PER PAY PERIOD","AND WILL RECEIVE 25 PERCENT STANDBY PAY IN LIEU OF","OVERTIME,HOLIDAY PAY,AND NIGHT DIFFERENTIAL."," "," "," "," "," "," ","1988-07-03"]
["53C","N","WELCOME TO CUSTOMS AND BORDER PROTECTION."," "," "," "," "," "," "," "," ","2003-03-09"]
["53G","N","UNETHICAL OR IMPROPER USE OF OFFICIAL AUTHORITY OR CREDENTIALS, OR","UNAUTHORIZED DISCLOSURE OR USE OF OFFICIAL INFORMATION."," "," "," "," "," "," "," ","1989-04-23"]
["53I","N","SF-8 AND SF-2819 ISSUED"," "," "," "," "," "," "," "," ","1990-08-26"]
["53J","N","THIS IS A TEMPORARY ASSIGNMENT AT EMPLOYEES'S REQUEST.  UPON COMPLETION","OF THE ASSIGNMENT, YOU WILL BE RETURNING TO YOUR FORMER POSITION, OR","A POSITION OF EQUIVALENT GRADE AND PAY."," "," "," "," "," "," ","1991-04-07"]
[540,"Y","S.C. DATES FOR LEAVE, RIF, AND/OR RETIREMENT ADJUSTED BY ***** DAYS","COMPUTED FROM ******* INT HRS WORKED DURING ****** ELAPSED CALENDAR","DAYS. PREVIOUS DATES WERE LEAVE *******, RIF *******, AND/OR","RET @813******."," "," "," "," "," ","1989-12-31"]
[541,"N","S.C. DATES FOR TSP, LEAVE, RIF, AND/OR RETIREMENT ADJUSTED BY          I","NT HRS WORKED DURING     ELAPSED CALENDAR DAYS AND      HOURS NONPAY STA","TUS.  PREVIOUS DATES WERE TSP         , LEAVE         , RIF         ,","AND/OR RET         ."," "," "," "," "," ","1991-12-29"]
[542,"N","S.C. DATES FOR TSP, LEAVE, RIF, AND/OR RETIREMENT ADJUSTED BY      HOURS","EXCESS NONPAY STATUS.  PREVIOUS DATES WERE TSP         , LEAVE",",   RIF         , AND/OR RET         ."," "," "," "," "," "," ","1991-12-29"]
[543,"Y","S.C. DATES FOR RIF, AND/OR RETIREMENT ADJUSTED BY ***** DAYS COMPUTED FR","OM ******* INT. HRS WORKED DURING ***** ELAPSED CALENDAR DAYS. PREVIOUS","DATES WERE RIF ******* AND/OR RET. *******."," "," "," "," "," "," ","1989-12-31"]
[544,"Y","TOTAL ******** HOURS NONPAY STATUS RECORDED THIS CALENDAR YEAR."," "," "," "," "," "," "," "," ","1982-09-20"]
[545,"Y","***** INT DAYS WORKED TOWARD COMPLETION OF WAITING PERIOD FOR CAREER","TENURE SINCE THE COMMENCING DATE WAS LAST REPORTED BY NFC ON *******."," "," "," "," "," "," "," ","1981-12-01"]
[546,"Y","***** INT DAYS WORKED TOWARD COMPLETION OF CURRENT WAITING PERIOD FOR WG","I  SINCE THE COMMENCING DATE LAST ADJUSTED ON *******."," "," "," "," "," "," "," ","1981-12-01"]
[547,"Y","***** INT DAYS WORKED TOWARD THE COMPLETION OF PROBATIONARY PERIOD SINCE","THE COMMENCING DATE WAS LAST ADJUSTED BY NFC ON *******."," "," "," "," "," "," "," ","1981-12-01"]
[548,"Y","***** DAYS EXCESS NONPAY STATUS RECORDED."," "," "," "," "," "," "," "," ","1981-12-01"]
[549,"Y","******** HOURS NONPAY STATUS RECORDED."," "," "," "," "," "," "," "," ","1981-12-01"]
["54C","N","POSITION APPROVED UNDER 5 USC SECTION 8336(C)."," "," "," "," "," "," "," "," ","1992-01-26"]
["54G","N","VIOLATING NGA REGULATIONS PROHIBITING THE SOLICIATION OR ACCEPTANCE OF","GIFTS, LOANS, GRATUITIES, FAVORS, ETC., FROM PERSONS, FIRMS, OR","CORPORATIONS WITH WHOM EMPLOYEES HAVE OFFICIAL RELATIONS."," "," "," "," "," "," ","1989-04-23"]
["54I","N","AS A RESULT OF THIS ACTION, YOUR RETIRMENT CODE HAS BEEN CHANGED TO"," "," "," "," "," "," "," "," ","1990-08-26"]
["54J","N","EMPLOYEE IS RETURNING FROM A TEMPORARY CHANGE TO LOWER GRADE."," "," "," "," "," "," "," "," ","1991-04-07"]
[550,"Y","******** HOURS NONPAY STATUS RECORDED."," "," "," "," "," "," "," "," ","1981-12-01"]
[551,"N","REFLECTS TOUR CHANGE FROM FULL-TIME."," "," "," "," "," "," "," "," ","1981-12-01"]
[552,"N","REFLECTS TOUR CHANGE FROM PART-TIME."," "," "," "," "," "," "," "," ","1981-12-01"]
[553,"N","REFLECTS TOUR CHANGE FROM INTERMITTENT."," "," "," "," "," "," "," "," ","1981-12-01"]
[555,"N","RETROACTIVELY ADJUSTS SCD TO REFLECT PLACEMENT IN SEASONAL STATUS IN","COMPLIANCE WITH FPM CHAPTER 340, ISSUED 5/4/84."," "," "," "," "," "," "," ","1987-08-02"]
["55C","N","EMPLOYEE WILL NOT BE PERMITTED ACCESS TO COMPUTER SYSTEMS, INTEGRITY OR","BACKGROUND INVESTIGATIONS AND OTHER SENSITIVE INFORMATION UNTIL HIS/H","ER    BACKGROUND INVESTIGATION IS SUCESSFULLY COMPLETED."," "," "," "," "," "," ","1992-01-26"]
["55G","N","VIOLATION OF NGA REGULATIONS REGARDING FINANCIAL INTEREST OR TRANSACTION","S  WHICH CONFLICT WITH OFFICIAL DUTIES AND RESPONSIBILITIES."," "," "," "," "," "," "," ","1989-04-23"]
["55I","N","NON-WORK STATUS SINCE"," "," "," "," "," "," "," "," ","1990-08-26"]
["55J","N","APPOINTMENT IS SUBJECT TO THE SUCCESSFUL COMPLETION OF A FULL-FIELD","BACKGROUND INVESTIGATION."," "," "," "," "," "," "," ","1991-04-07"]
[560,"N","STANDARD OPTIONAL INSURANCE: DECLINED."," "," "," "," "," "," "," "," ","1981-12-01"]
[561,"N","STANDARD OPTIONAL INSURANCE: NOT ELIGIBLE TO CONTINUE."," "," "," "," "," "," "," "," ","1981-12-01"]
[562,"N","STANDARD OPTIONAL INSURANCE: ELIGIBLE TO CONTINUE: COVERAGE BEGAN"," "," "," "," "," "," "," "," ","1981-12-01"]
[563,"N","CONV TO TEMPORARY APPOINTMENT NEW COMMITTEE ESTABLISHED"," "," "," "," "," "," "," "," ","1981-12-01"]
[564,"N","TERMINATE FEHB - NOT ENROLLED SINCE FIRST OPPORTUNITY."," "," "," "," "," "," "," "," ","1981-12-01"]
[565,"N","TERMINATE FEHB - NOT ENROLLED FIVE YEARS."," "," "," "," "," "," "," "," ","1981-12-01"]
[566,"N","TERMINATE FEHB - NO SURVIVOR ELIGIBLE TO CONTINUE HEALTH BENEFITS."," "," "," "," "," "," "," "," ","1981-12-01"]
[567,"N","BASIC LIFE INSURANCE: ELECTED       REDUCTION."," "," "," "," "," "," "," "," ","1981-12-01"]
[568,"N","ADDITIONAL OPTIONAL INSURANCE: DECLINED."," "," "," "," "," "," "," "," ","1981-12-01"]
[569,"N","ADDITIONAL OPTIONAL INSURANCE: ELIGIBLE TO CONTINUE: COVERAGE BEGAN","; LOWEST MULTIPLE OF SALARY DURING LAST FIVE YEARS"," "," "," "," "," "," "," ","1981-12-01"]
["56C","N","POSITION APPROVAL FOR PRIMARY/SECONDARY COVERAGE UNDER THE PROVISION OF","5 U.S.C. 8336(C)."," "," "," "," "," "," "," ","1992-01-26"]
["56G","N","KNOWINGLY MAKING FALSE STATEMENTS WHICH ARE SLANDEROUS OR DEFAMATORY ABO","UT OTHER EMPLOYEES OR OFFICIALS."," "," "," "," "," "," "," ","1989-04-23"]
["56I","N","REASON FOR LATE"," "," "," "," "," "," "," "," ","1990-08-26"]
["56J","N","CONGRATULATIONS!  THIS BONUS IS AWARDED FOR YOUR PARTICIPATION IN DEA'S","FOREIGN LANGUAGE BONUS PROGRAM.  IT IS COMPUTED ON YOUR BASE SALARY A","S     OF THE LAST FULL PAY PERIOD PRIOR TO THE END OF THE LAST FISCAL YE","AR       (SEPTEMBER 30TH)."," "," "," "," "," ","1991-04-07"]
[570,"N","ADDITIONAL OPTIONAL INSURANCE: NOT ELIGIBLE TO CONTINUE."," "," "," "," "," "," "," "," ","1981-12-01"]
[571,"N","FAMILY OPTIONAL INSURANCE: DECLINED."," "," "," "," "," "," "," "," ","1981-12-01"]
[572,"N","FAMILY OPTIONAL INSURANCE: ELIGIBLE TO CONTINUE: COVERAGE BEGAN"," "," "," "," "," "," "," "," ","1981-12-01"]
[573,"N","FAMILY OPTIONAL INSURANCE: NOT ELIGIBLE TO CONTINUE."," "," "," "," "," "," "," "," ","1981-12-01"]
[574,"N","BASIC LIFE INSURANCE WAIVED."," "," "," "," "," "," "," "," ","1998-01-01"]
["57C","N","POSITION APPROVAL FOR RIGOROUS/SECONDARY COVERAGE UNDER PROVISION OF 5","U.S.C. 8412(D)."," "," "," "," "," "," "," ","1992-01-26"]
["57G","N","THEFT OR ATTEMPTED THEFT OF GOVERNMENT OR NGA PROPERTY OR THE PROPERTY O","F  OTHER EMPLOYEES. (IN ARRIVING AT THE PENALTY, CONSIDERATION SHOULD BE","GIVENTO VALUE OF PROPERTY STOLEN AND WHETHER VOLUNTARY RESTITUTION WAS","ADE)"," "," "," "," "," ","1989-04-23"]
["57I","N","ANNUAL DATE FOR EMPLOYEE IS"," "," "," "," "," "," "," "," ","1990-08-26"]
["57J","N","EMPLOYEE HAS BEEN ADVISED THAT ASSIGNMENT TO A SUPERVISORY OR SENIOR","LITIGATION COUNSEL POSITION IS TEMPORARY AND THAT ANY RIGHTS TO A","HIGHER SUPERVISORY/SENIOR LITIGATION  COUNSEL SALARY ACCRUE ONLY S","O        LONG AS HE/SHE IS AN INCUMBENT OF SUCH A POSITION."," "," "," "," "," ","1991-04-07"]
["58G","N","UNAUTHORIZED USE OF NGA PROPERTY (OTHER THAN MOTOR VEHICLES) OR LOSS OF","OR DAMAGE TO NGA PROPERTY THROUGH CARELESSNESS OR WHEN PROPERTY INVOLVED","IS OFSMALL VALUE."," "," "," "," "," "," ","1989-04-23"]
["58I","N","ACTION LATE DUE TO ADMINISTRATIVE OVERSIGHT"," "," "," "," "," "," "," "," ","1990-08-26"]
["58J","N","EXPECTED TO WORK    HOURS PER WEEK."," "," "," "," "," "," "," "," ","1991-04-21"]
["59G","N","UNAUTHORIZED USE OF NGA PROPERTY (OTHER THAN MOTOR VEHICLES) OR LOSS OF","OR DAMAGE TO NGA PROPERTY THROUGH MALICIOUSNESS OR INTENT, OR WHEN PROPE","RTY   INVOLVED IS OF SIGNIFICANT VALUE."," "," "," "," "," "," ","1989-04-23"]
["59I","N","FROM SEASONAL TO PERMANENT"," "," "," "," "," "," "," "," ","1990-08-26"]
["59J","N","LEAVE TO BE TRANSFERRED."," "," "," "," "," "," "," "," ","1991-04-21"]
[600,"N","SCD'S FOR LEAVE AND RIF ADJUSTED BY       YEARS     MONTHS      DAYS OF","ASC COUNTY OFFICE SERVICE IN ACCORDANCE WITH PL 90-367 DATED JUNE 29,",1968," "," "," "," "," "," ","1981-12-01"]
[605,"N","PROMOTION POTENTIAL TO"," "," "," "," "," "," "," "," ","1982-12-12"]
[606,"N","THE FEDERAL GOVERNMENT CONTRIBUTES 50% OR LESS OF EMPLOYEE'S SALARY","- IPA."," "," "," "," "," "," "," ","1981-12-01"]
[607,"N","TO BE PLACED ON AGENCY'S REPROMOTION PRIORITY LIST FOR TWO YEARS."," "," "," "," "," "," "," "," ","1982-12-12"]
[608,"N","DETAILED TO AN UNCLASSIFIED POSITION"," "," "," "," "," "," "," "," ","1986-10-01"]
[609,"N","DETAILED TO                         UNDER THE INTERGOVERNMENTAL PERSONNE","L  ACT (IPA)."," "," "," "," "," "," "," ","1986-10-01"]
["60G","N","REMOVING A WEAPON FROM NGA PROPERTY."," "," "," "," "," "," "," "," ","1989-04-23"]
["60I","N","WGI PROCESSED SIMULTANEOUSLY WITH PROMOTION/REASSIGNMENT/CLG"," "," "," "," "," "," "," "," ","1990-08-26"]
[612,"N","AUTOMATIC WITHIN GRADE INCREASE AND FWS AREA INCREASE","APPLIED AS OF EFFECTIVE DATE OF THIS ACTION."," "," "," "," "," "," "," ","1981-12-01"]
[613,"N","AUTOMATIC WITHIN GRADE INCREASE APPLIED AS OF EFFECTIVE","DATE OF THIS ACTION."," "," "," "," "," "," "," ","1981-12-01"]
[614,"N","ADJUSTMENT DUE TO APPLICATION OF FWS AREA INCREASE."," "," "," "," "," "," "," "," ","1981-12-01"]
[615,"N","SALARY UNDER 44 USC 305."," "," "," "," "," "," "," "," ","2004-01-11"]
[616,"N","NFC USE ONLY"," "," "," "," "," "," "," "," ","1981-11-14"]
[617,"N","ELIGIBLE TO CONTINUE CIVIL SERVICE RETIREMENT AND CURRENT BENEFITS,","NO BREAK IN SERVICE."," "," "," "," "," "," "," ","1982-12-12"]
[619,"Y","7 1/2% RETIREMENT DISCONTINUED ******* UNDER P.L. 93-350."," "," "," "," "," "," "," "," ","1981-12-01"]
["61I","N","FROM APPROVED LWOP SINCE"," "," "," "," "," "," "," "," ","1990-08-26"]
[620,"N","COVERAGE UNDER SOCIAL SECURITY AND           RETIREMENT SYSTEM AT THE",".94% TRANSITIONAL RATE IS EFFECTIVE FROM DATE OF"," "," "," "," "," "," "," ","1984-01-01"]
[623,"N","TEMPORARY APPOINTMENT LIMITED TO           ; INELIGIBLE FOR HEALTH & LIF","E  INSURANCE BENEFITS OR CIVIL SERVICE RETIREMENT."," "," "," "," "," "," "," ","1981-12-01"]
[624,"N","THIS POSITION IS UNDER SCHEDULE C AND IS OUTSIDE THE COMPETITIVE CIVIL","SERVICE.  IN ACCEPTING THIS APPOINTMENT THE INCUMBENT UNDERSTANDS THA","T THE APPOINTMENT IS TERMINABLE UPON NOTICE THEROF."," "," "," "," "," "," ","1981-12-01"]
[626,"N","EMPLOYEE MUST NOT WORK MORE THAN 100 DAYS THIS FISCAL YEAR."," "," "," "," "," "," "," "," ","1987-04-20"]
[628,"N","BASED ON MEMORANDUM OF UNDERSTANDING BETWEEN    AND DATED",null," "," "," "," "," "," "," ","1981-12-01"]
["62I","N","20% COLA"," "," "," "," "," "," "," "," ","1990-08-26"]
[630,"N","ALT TOUR:  FT           PAY PERIODS:  PT           PAY PERIODS:  INT","PAY PERIODS."," "," "," "," "," "," "," ","1984-09-16"]
[634,"N","TEMPORARY PROMOTION - EMPLOYEE INFORMED IN ADVANCE OF THE REASONS FOR AN","D  THE CONDITIONS OF THE TEMPORARY PROMOTION."," "," "," "," "," "," "," ","1981-12-01"]
[635,"N","CAREER PROMOTION - EMPLOYEE WAS SELECTED COMPETITIVELY FOR A PREVIOUS","POSITION."," "," "," "," "," "," "," ","1981-12-01"]
["63I","N","22.5% COLA"," "," "," "," "," "," "," "," ","1990-08-26"]
[640,"N","THIS ACTION PREPARED TO REPORT THE END OF THE FEGLI 12-MONTH NONPAY STAT","US COVERAGE."," "," "," "," "," "," "," ","1981-12-01"]
["64I","N","SUBJECT TO INVESTIGATION"," "," "," "," "," "," "," "," ","1990-08-26"]
[659,"N","CODE 1 IN BLK 28 INDICATES REEMPL ANN-CSRS."," "," "," "," "," "," "," "," ","1988-11-06"]
["65I","N","CHANGE IN ORGANIZATIONAL SEGMENT CODE"," "," "," "," "," "," "," "," ","1990-08-26"]
[660,"N","CODE 2 IN BLK 28 INDICATES RET OFFICER."," "," "," "," "," "," "," "," ","1988-11-06"]
[661,"N","CODE 3 IN BLK 28 INDICATES RET ENLISTED."," "," "," "," "," "," "," "," ","1988-11-06"]
[662,"N","CODE 4 IN BLK 28 INDICATES RET OFF/REEMPL ANN-CSRS."," "," "," "," "," "," "," "," ","1988-11-06"]
[663,"N","CODE 5 IN BLK 28 INDICATES RET ENL/REEMPL ANN-CSRS."," "," "," "," "," "," "," "," ","1988-11-06"]
[664,"N","CODE 9 IN BLK 28 INDICATES NOT APPLICABLE."," "," "," "," "," "," "," "," ","1988-11-06"]
[665,"N","CODE A IN BLK 28 INDICATES REEMPL ANN-FERS."," "," "," "," "," "," "," "," ","1988-11-06"]
[666,"N","CODE B IN BLK 28 INDICATES FORMER ANN-FERS."," "," "," "," "," "," "," "," ","1988-11-06"]
[667,"N","CODE C IN BLK 28 INDICATES RET OFF/REEMPL ANN-FERS."," "," "," "," "," "," "," "," ","1988-11-06"]
[668,"N","CODE D IN BLK 28 INDICATES RET OFF/FORMER ANN-FERS."," "," "," "," "," "," "," "," ","1988-11-06"]
[669,"N","CODE E IN BLK 28 INDICATES RET ENL/REEMPL ANN-FERS."," "," "," "," "," "," "," "," ","1988-11-06"]
["66I","N","PUBLICATION 905 GIVEN TO EMPLOYEE"," "," "," "," "," "," "," "," ","1990-08-26"]
[670,"N","CODE F IN BLK 28 INDICATES RET ENL/FORMER ANN-FERS."," "," "," "," "," "," "," "," ","1988-11-06"]
["67I","N","UPON RETURN TO DUTY YOU HAVE 31 DAYS TO RE-ELECT COVERAGE"," "," "," "," "," "," "," "," ","1990-08-26"]
["68I","N","CHANGES ORIGINAL              COVERAGE"," "," "," "," "," "," "," "," ","1990-08-26"]
["69I","N","TOTAL CREDITABLE SERVICE DURING APPOINTMENT WAS    YEARS    MONTHS"," "," "," "," "," "," "," "," ","1990-08-26"]
[700,"Y","PMRS PAY CASH AWARD $*******."," "," "," "," "," "," "," "," ","1985-03-31"]
[701,"Y","PMRS PERFORMANCE AWARD $*******."," "," "," "," "," "," "," "," ","1985-03-31"]
[702,"N","SALARY BLOCK CONTAINS SEPARATION INCENTIVE AMOUNT"," "," "," "," "," "," "," "," ","1993-01-01"]
[703,"N","PAY INCREASE AUTHORIZED BY CORPORATION EMAIL MEMORANDUM DATED JANUARY 7,",2008," "," "," "," "," "," "," ","2008-01-06"]
[704,"Y","SALARY SET AT $*******; PAYMENT LIMITED TO $68,700."," "," "," "," "," "," "," "," ","1982-12-26"]
[705,"N","FEDERAL PAY INCREASE AUTHORIZED BY THE CONGRESSIONAL BUDGET AND IMPOUNDM","ENTCONTROL ACT OF 1974, AS AMENDED."," "," "," "," "," "," "," ","1998-01-04"]
[706,"N","FEDERAL PAY INCREASE DUE TO E.O. 13454 SIGNED 01/04/08. SALARY INCLUDES","A GENERAL INCREASE AND A LOCALITY PAYMENT (OR OTHER GEOGRAHIC ADJUSTMENT","APPLICABLE IN THIS AREA."," "," "," "," "," "," ","2008-01-06"]
[707,"N","SALARY INCLUDES A GENERAL INCREASE OF 2.5% ROUNDED AND A LOCALITY","PAYEMENT (OR OTHER GEOGRAPHIC ADJUSTMENT) APPLICABLE TO THIS AREA."," "," "," "," "," "," "," ","2008-01-06"]
[708,"N","PAY ADJUSTMENT REFLECTS 4.49% COST OF LIVING ALLOWANCE."," "," "," "," "," "," "," "," ","2008-01-06"]
["70I","N","VOLUNTARY WAIVER OF ALL LIFE INSURANCE COVERAGE"," "," "," "," "," "," "," "," ","1990-08-26"]
[711,"N","THIS EMPLOYEE HAS ELECTED TO PARTICIPATE IN THE MIXED-TOUR PROGRAM WITH","A PART TIME SCHEDULE TOUR OF DUTY. BASED ON THE AGENCY'S FLUCTUATING","WORKLOAD, THE EMPLOYEE WILL REVERT TO INTERMITTENT STATUS, AS NECE","SARY."," "," "," "," "," ","1985-10-13"]
[712,"N","THIS EMPLOYEE HAS ELECTED TO PARTICIPATE IN THE MIXED-TOUR PROGRAM WITH","A FULL TIME SCHEDULE TOUR OF DUTY. BASED ON THE AGENCY'S FLUCTUATING","WORKLOAD, THE EMPLOYEE WILL REVERT TO INTERMITTENT STATUS, AS NECE","SARY."," "," "," "," "," ","1985-10-13"]
[713,"N","RETIREMENT DEDUCTION RATE DECREASED BY .004"," "," "," "," "," "," "," "," ","2001-01-14"]
[714,"N","Pay Increases Authorized By The Attorney General Pursuant To 28 U.S.C.","548. Salary Includes A General Increase Of 3.8 Percent Rounded And/Or A","Locality Payment (Or Other Geographic Adjustment) Applicable In This","Area.  Locality Pay May Be Truncated To Avoid Pay Inversion Or To Comply","With Pay Ceiling."," "," "," "," ","1900-01-01"]
[715,"Y","PAY INCREASE AUTHORIZED BY FSA PM NOTICE 2629."," "," "," "," "," "," "," "," ","2008-01-06"]
[718,"N","PAY INCREASE AUTHORIZED BY PL-105-33-111-ST-251."," "," "," "," "," "," "," "," ","1999-01-03"]
[719,"N","PAY INCREASES AUTHORIZED BY THE ATTORNEY GENERAL PURSUANT TO 28 U.S.C.","548. LOCALITY PERCENTAGE INCREASED IN 2003 AND MAY BE TRUNCATED TO AVOID","PAY INVERSION OR TO COMPLY WITH THE PAY CEILING OF $133,900"," "," "," "," "," "," ","2003-01-12"]
["71I","N","FROM PERMANENT TO SEASONAL"," "," "," "," "," "," "," "," ","1990-08-26"]
[720,"N","SALARY INCLUDES A GENERAL INCREASE OF 2.5% ROUNDED AND A LOCALITY","PAYMENT (OR OTHER GEOGRAPHIC ADJUSTMENT) APPLICABLE IN THIS AREA."," "," "," "," "," "," "," ","2008-01-06"]
[721,"N","SALARY INCLUDES A SPECIAL RATE INCREASE OF 2.5 PERCENT. EMPLOYEE RECEIVE","S NO OTHER ADJUSTMENT BECAUSE SPECIAL RATE PROVIDES HIGHEST PAY ENTITLEM","ENT."," "," "," "," "," "," ","2008-01-06"]
[722,"N","SALARY INCLUDES A GS RATE (INCREASED BY 2.5 PERCENT) PLUS A SPECIAL","RATE INCREASE AS APPLICABLE."," "," "," "," "," "," "," ","2008-01-06"]
[723,"N","SALARY INCLUDES A LAW ENFORCEMENT SPECIAL BASE RATE INCREASE OF 2.5 PER","CENT AND A LOCALITY PAYMENT(OR OTHER GEOGRAPHIC ADJUSTMENT) APPLICABLE","IN THIS  AREA."," "," "," "," "," "," ","2008-01-06"]
[724,"N","EMPLOYEE IS ENTITLED TO A \"CONTINUED RATE\" UNDER 5 CFR 531.307 OR","531.703, WHICH IS BEING INCREASED BY THE DOLLAR AMOUNT OF THE 2.5","PERCENT INCREASE IN THE EMPLOYEE'S UNDERLYING GS RATE."," "," "," "," "," "," ","2008-01-06"]
[725,"N","SALARY INCLUDES A RETAINED RATE (ADJUSTED BY ONE-HALF OF THE DOLLAR AMOU","NT OF THE INCREASE IN THE MAXIMUM RATE OF BASIC PAY PAYABLE FOR THE GRAD","E OF  THE EMPLOYEE'S CURRENT POSITION) AND A LOCALITY PAYMENT (OR OTHER","GEOGRAPHIC ADJUSTMENT) APPLICABLE IN THIS AREA."," "," "," "," "," ","1995-01-08"]
[726,"N","EMPLOYEE'S CONTINUED RATE IS TERMINATED BECAUSE A HIGHER RATE IS NOW","APPLICABLE."," "," "," "," "," "," "," ","1995-01-08"]
[727,"N","SALARY WHICH INCLUDES LOCALITY-BASED PAYMENT WILL BE USED TO CALCULATE","SALARY-BASED BENEFITS ONLY."," "," "," "," "," "," "," ","1995-01-08"]
[728,"N","EMPLOYEES WHO RECEIVE AVAILABILITY PAY ARE NOT ELIGIBLE FOR AUO. ANY","ENTITLEMENT TO AUO TERMINATES UPON RECEIPT OF AVAILABILITY PAY."," "," "," "," "," "," "," ","1995-01-08"]
[729,"N","LOCALITY-BASED PAYMENT REDUCED TO AVOID PAY COMPRESSION/INVERSION."," "," "," "," "," "," "," "," ","1995-01-08"]
["72I","N","FROM INTERMITTENT TO SEASONAL"," "," "," "," "," "," "," "," ","1990-08-26"]
[730,"Y","SUBJECT TO COMPLETION OF TWO YEAR PROBATIONARY PERIOD BEGINNING *******."," "," "," "," "," "," "," "," ","1995-09-03"]
[731,"N","UNDER THE PROVISIONS OF P.L. 103-82 DATED 9-21-93 AN EMPLOYEE ACQUIRES N","ON-COMPETITIVE ELIGIBILITY FOR APPOINTMENT TO THE COMPETITIVE SERVICE UP","ON    MEETING THE APPROPRIATE CONDITIONS AS PRESCRIBED BY OPM."," "," "," "," "," "," ","1995-09-03"]
[732,"N","COMPLETED OPM REQUIREMENTS FOR NON-COMPETITIVE ELIGIBILITY FOR APPOINTME","NT IN THE COMPETITIVE SERVICE UNDER THE PROVISIONS OF P.L. 103-82."," "," "," "," "," "," "," ","1995-09-03"]
[733,"N","SERVICE CREDIT FOR RETIREMENT, AND LEAVE ACCRUAL PURPOSE CONTINUES FOR U","P  TO A MAXIMUM OF SIX MONTHS OF NONPAY STATUS TIME PER CALENDAR YEAR."," "," "," "," "," "," "," ","1999-01-03"]
[734,"N","THIS ACTION DOCUMENTS YOUR CONVERSION INTO THE CORPORATION'S ALTERNATIVE","PERSONNEL SYSTEM. AUTHORITY FOR CHANGE: P.L. 103-82 DATED 9-21-93."," "," "," "," "," "," "," ","1995-09-03"]
[735,"N","THIS DOCUMENTS YOUR GENERAL APPOINTMENT"," "," "," "," "," "," "," "," ","1995-09-03"]
[736,"N","THIS DOCUMENTS YOUR TERM APPOINTMENT"," "," "," "," "," "," "," "," ","1995-09-03"]
[737,"N","THIS DOCUMENTS YOUR DISCRETIONARY APPOINTMENT"," "," "," "," "," "," "," "," ","1995-09-03"]
[738,"N","THIS DOCUMENTS YOUR INDEFINITE APPOINTMENT"," "," "," "," "," "," "," "," ","1995-09-03"]
[739,"N","Non-Federal Employee Under Temporary Appointment."," "," "," "," "," "," "," "," ","1900-01-01"]
["73I","N","NON-PAY DAYS SINCE DATE OF LAST EQUIVALENT INCREASE"," "," "," "," "," "," "," "," ","1990-08-26"]
[740,"N","Non-Federal Employee Under Permanent Appointment."," "," "," "," "," "," "," "," ","1900-01-01"]
[742,"N","EFFECTIVE MAY 1, 2005, UNDER 5 U.S.C. 5305(H), AN EMPLOYEE'S ENTITLEMENT","TO A SPECIAL RATE IS ELIMINATED IF THE EMPLOYEE IS ENTITLED TO A HIGHER","LOCALITY RATE OF PAY UNDER 5 U.S.C.5304. SINCE YOUR LOCALITY RATE OF PAY","IS HIGHER THAN YOUR SPECIAL RATE,YOU ARE NO LONGER ENTITLED TO A SPECIAL","RATE. THE TERMINATION OF YOUR SPECIAL RATE WILL NOT RESULT IN A LOSS OF","PAY. BLOCK 20A REFLECTS YOUR NEW GENERAL SCHEDULE RATE OF PAY. BLOCK 20B","SHOWS YOUR NEW LOCALITY ADJUSTMENT. BLOCK 20C, ADJUSTED BASIC PAY,IS","NOT CHANGED BY THIS ACTION. CHANGES PAY RATE DETERMINANT CODE IN","BLOCK 29 TO 0.","2005-05-01"]
[743,"N","EFFECTIVE MAY 1, 2005, UNDER 5 U.S.C. 5305(H), AN EMPLOYEE'S ENTITLEMENT","TO A SPECIAL RATE IS ELIMINATED IF THE EMPLOYEE IS ENTITLED TO A HIGHER","LOCALITY RATE OF PAY UNDER 5 U.S.C. 5304. SINCE YOUR LOCALITY RATE OF PA","IS HIGHER THAN YOUR SPECIAL RATE, YOU ARE NO LONGER ENTITLED TO A SPECIA","RATE. THE TERMINATION OF YOUR SPECIAL RATE WILL NOT RESULT IN A LOSS OF","PAY. BLOCK 20A REFLECTS YOUR NEW RATE OF BASIC PAY UNDER TABLE 0491 FOR","$0.00 LOCALITY ADJUSTMENT. BLOCK 20C, ADJUSTED BASIC PAY, ALSO REFLECTS","YOUR NEW SPECIAL RATE"," ","2005-05-15"]
[744,"N","EFFECTIVE MAY 1, 2005, UNDER 5 U.S.C. 5305(A)(1), THE MAXIMUM SPECIAL RA","AUTHORIZED WAS INCREASED FROM THE EX-V RATE TO THE EX-IV RATE. AS A","RESULT, THE PAYABLE SPECIAL RATES FOR STEPS 08, 09, AND 10 OF GS-15 FOR","SPECIAL RATE TABLE 0576 WERE INCREASED. SINCE YOUR NEW SPECIAL RATE IS","HIGHER THAN YOUR LOCALITY RATE, YOU ARE NO LONGER ENTITLED TO A LOCALITY","PAYMENT, BLOCK 20A REFLECTS YOUR NEW SPECIAL RATE, BLOCK 20B SHOWS A","$0.00 LOCALITY ADJUSTMENT. BLOCK 20C, ADJUSTED BASIC PAY, ALSO REFLECT","YOUR NEW SPECIAL RATE"," ","2005-05-15"]
[748,"N","REASON FOR TERMINATION: ELIMINATION OF COUNTY COMMITTEE"," "," "," "," "," "," "," "," ","1994-12-11"]
["74I","N","DUE TO REORGANIZATION"," "," "," "," "," "," "," "," ","1990-08-26"]
[750,"N","REASON FOR FURLOUGH: ABSENCE OF A FY 1996 APPROPRIATION OR A CONTINUING","RESOLUTION."," "," "," "," "," "," "," ","1995-10-01"]
["75I","N","CERTIFICATION HAS BEEN MADE THAT EMPLOYEE IS EXPECTED TO WORK 6 MONTHS O","R  MORE EACH YEAR."," "," "," "," "," "," "," ","1990-08-26"]
["75J","N","BASED ON ANNUAL PAY REVIEW, INCREASE IN GRADE WITH NO INCREASE IN BASIC","PAY, DUE TO BUDGETARY CONSTRAINTS."," "," "," "," "," "," "," ","2005-05-15"]
[763,"N","FEDERAL PAY INCREASE DUE TO LETTER DATED JANUARY 6,2008 ISSUED BY THE","LIBRARIAN OF CONGRESS"," "," "," "," "," "," "," ","2008-01-06"]
[765,"N","REASON FOR TEMPORARY APPOINTMENT: TEMPORARY DISASTER EMPLOYEE."," "," "," "," "," "," "," "," ","1997-09-14"]
["76I","N","COMPETITIVE ACTION."," "," "," "," "," "," "," "," ","1990-08-26"]
[770,"N","CHANGES DATA ELEMENT IN BLOCK 35."," "," "," "," "," "," "," "," ","1994-10-16"]
[771,"N","THIS DOCUMENTS THE CORPORATION REORGANIZATION EFFECTIVE DECEMBER 1, 1994",".  AUTHORITY FOR CHANGE IS ANNOUNCEMENT OF OCTOBER 21, 1994."," "," "," "," "," "," "," ","1995-01-22"]
[772,"N","PAY INCREASE AUTHORIZED BY THE DEPUTY ATTORNEY GENERAL ON DEC. 11, 1992"," "," "," "," "," "," "," "," ","1992-12-27"]
[773,"N","THANK YOU FOR YOUR EFFORT ON BEHALF OF THE DECENNIAL CENSUS."," "," "," "," "," "," "," "," ","1991-06-30"]
[774,"N","1991 MINIMUM WAGE RATE INCREASE"," "," "," "," "," "," "," "," ","1991-03-24"]
[775,"N","I AGREE THAT THE SICK LEAVE BALANCE SHOWN IS CORRECT","EMPLOYEE SIGNATURE                       DATE"," "," "," "," "," "," "," ","1987-06-07"]
[776,"N","NON-FEDERAL EMPLOYEE"," "," "," "," "," "," "," "," ","1986-10-12"]
[777,"N","THIS ACTION REFLECTS A CHANGE IN SERVICING AGENCY UNDER WHICH OFFICE OF","PERSONNEL IS ASSUMING PERSONNEL PROCESSING FUNCTIONS."," "," "," "," "," "," "," ","1984-12-09"]
[778,"Y","FEDERAL PAY INCREASE DUE TO E.O. 13525 SIGNED 12/23/09."," "," "," "," "," "," "," "," ","2010-01-03"]
[779,"N","SPECIAL SALARY INCREASE AUTHORIZED UNDER 5 USC 5303."," "," "," "," "," "," "," "," ","1984-10-14"]
["77A","N","THIS PAY ADJUSTMENT IF EFFECTIVE RETROACTIVE TO JULY 10, 1994.  RETROACT","IVEPAYMENTS WILL BE MADE THROUGH MANUAL PROCESSING."," "," "," "," "," "," "," ","1994-07-10"]
["77I","N","EMPLOYEE INFORMED ON 00/00/00 OF ELIGIBILITY FOR COVERAGE BASED ON","DETERMINATION THAT PROBABLE PERIOD OF SERVICE WILL AMOUNT TO AT LEAST","6    MONTHS."," "," "," "," "," "," ","1990-08-26"]
[780,"N","SALARY INCLUDES AN ADJUSTMENT TO THE NEW 12/31/92 MINIMUM OF THE GRADE"," "," "," "," "," "," "," "," ","1992-12-27"]
[781,"N","YOUR SALARY WAS IN THE LOWER 1/3 OF YOUR GRADE PAY RANGE - YOUR COMPOSIT","E  RATING ENTITLED YOU TO A FULL STEP INCREASE."," "," "," "," "," "," "," ","1984-10-14"]
[782,"N","YOUR SALARY WAS IN THE UPPER 2/3 OF YOUR GRADE PAY RANGE - YOUR","COMPOSITE RATING ENTITLED YOU TO A FULL STEP INCREASE."," "," "," "," "," "," "," ","1984-10-14"]
[783,"N","YOUR SALARY WAS IN THE UPPER 2/3 OF YOUR GRADE PAY RANGE - YOUR","COMPOSITE RATING ENTITLED YOU TO HALF OF A STEP INCREASE."," "," "," "," "," "," "," ","1984-10-14"]
[784,"N","YOUR SALARY WAS IN THE UPPER 2/3 OF YOUR GRADE PAY RANGE - YOUR","COMPOSITE RATING ENTITLED YOU TO A THIRD OF A STEP INCREASE."," "," "," "," "," "," "," ","1984-10-14"]
[785,"Y","NEW SALARY INCLUDES A PERFORMANCE PAY INCREASE OF $*********"," "," "," "," "," "," "," "," ","1988-01-10"]
[786,"N","NEW SALARY INCLUDES ZERO PERFORMANCE PAY INCREASE."," "," "," "," "," "," "," "," ","1988-01-10"]
[787,"N","INELIGIBLE FOR PERFORMANCE PAY INCREASE BECAUSE SALARY IS ALREADY AT OR","ABOVE THE MAXIMUM RATE OF BASIC PAY FOR THE EMPLOYEE'S POSITION."," "," "," "," "," "," "," ","1988-01-10"]
[788,"N","THE INDIVIDUAL IS A VOLUNTEER MEMBER OF AMERICORP AND IS NOT CONSIDERED","A  FEDERAL EMPLOYEE NOR IS THIS PERSON ENTITLED TO FUTURE BENEFITS BASED","ON   THE VOLUNTEER SERVICE."," "," "," "," "," "," ","1994-09-04"]
[789,"Y","NEW SALARY INCLUDES A PERFORMANCE PAY INCREASE OF $*******  FULL","AMOUNT OF PERFORMANCE PAY INCREASE ENTITLEMENT CANNOT BE GRANTED BECAUSE","THE ENTITLEMENT WOULD CAUSE THE MAXIMUM RATE TO BE EXCEEDED."," "," "," "," "," "," ","1988-01-10"]
["78I","N","SUMMER AIDE PROGRAM. EMPLOYEE TO PERFORM SIMPLE, ROUTINE, REPETITIVE","OFFICE DUTIES. TOTAL WORK UNDER THIS APPOINTMENT MUST NOT EXCEED 700","HOURS."," "," "," "," "," "," ","1990-08-26"]
[790,"N","AWARD HOURS MUST BE USED WITHIN 1 YEAR"," "," "," "," "," "," "," "," ","1993-01-01"]
[791,"N","AWARD HOURS MUST BE USED WITHIN 1 YEAR."," "," "," "," "," "," "," "," ","1993-01-01"]
[792,"N","SALARY IN BLOCK 20 CONSISTS OF A COMBINATION OF A SPECIAL SALARY RATE AN","D  A PARTIAL LOCALITY PAYMENT.  AMOUNT OF THE LOCALITY PAYMENT IS SHOWN","IN    BLOCK 20B."," "," "," "," "," "," ","1994-04-17"]
[793,"N","NON-CASH AWARD PROCESSED IN ACCORDANCE WITH SPECIAL ANNOUNCEMENT 94-20,","DATED 06/21/94"," "," "," "," "," "," "," ","1994-01-01"]
[794,"N","SALARY BLOCK CONTAINS TOTAL CASH AWARD AMOUNT, INCLUDING TAXES WITHHELD."," "," "," "," "," "," "," "," ","1994-01-01"]
[795,"N","CHANGES POSITION SENSITIVITY CODE TO 5"," "," "," "," "," "," "," "," ","1994-05-01"]
[796,"N","CHANGES POSITION SENSITIVITY CODE TO 6"," "," "," "," "," "," "," "," ","1994-05-01"]
[797,"N","CERTIFICATION BY AGENCY HEAD EFFECTIVE 10/31/94."," "," "," "," "," "," "," "," ","1994-10-16"]
[799,"N","PINE ERROR RELEASE CODE - WHEN PRD CODE IS NOT REQUIRED"," "," "," "," "," "," "," "," ","1982-01-01"]
["79I","N","ASSIGNMENT TO A NON-CLERICAL PERSONNEL OR TRAINING POSITION."," "," "," "," "," "," "," "," ","1990-08-26"]
[800,"N","THIS ACTION CANCELS THE FOLLOWING ACTION(S) WHICH OCCURED AFTER THE","OFFICIAL TERMINATION:"," "," "," "," "," "," "," ","1977-06-21"]
[801,"N","THIS REMARK CODE HAS NO OUTPUT LANGUAGE."," "," "," "," "," "," "," "," ","1983-01-09"]
["80G","N","THIS POSITION IS COVERED UNDER THE SPECIAL LAW ENFORCEMENT RETIREMENT","PROVISIONS OF 5 USC 8336 (C) AND 5 USC 8412 (D) AS CONTROL NUMBER","(        )."," "," "," "," "," "," ","1991-06-16"]
["80I","N","ELIGIBLE TO ELECT COVERAGE UNDER FEDERAL EMPLOYEES RETIREMENT SYSTEM","(FERS) WITHIN SIX MONTH OF THE EFFECTIVE DATE OF THIS PERSONNEL ACTIO","N.    SF-3109 PROVIDED EMPLOYEE."," "," "," "," "," "," ","1992-02-23"]
[810,"N","REASSIGNMENT TO DEMONSTRATION PROJECT - ALTERNATIVE PERSONNEL MANAGEMENT","SYSTEM - AS AUTHORIZED BY NBS AUTHORIZATION ACT FOR FISCAL YEAR 1987."," "," "," "," "," "," "," ","1987-10-01"]
[811,"N","THIS ACTION INVOLVES CHANGE IN PAY SYSTEM AND POSITION NUMBERING SYSTEM.","THERE IS NO CHANGE IN APPOINTMENT OR POSITION TITLE."," "," "," "," "," "," "," ","1987-10-01"]
[812,"N","AMOUNT IN BLOCK 32 REPRESENTS A LUMP SUM PRO RATA SHARE OF THE EQUIVALEN","T  OF ANY WITHIN-GRADE INCREASE OR MERIT INCREASE WHICH WOULD HAVE BEEN","DUE."," "," "," "," "," "," ","1987-10-31"]
[813,"Y","PAYABLE SALARY LIMITED TO $********** BY P. L. 99-574, NBS DEMONSTRATION","PROJECT."," "," "," "," "," "," "," ","1990-03-25"]
["81I","N","VRA PROGRAM REVISED BY PL 102-16, MARCH 22, 1991. (PER FPM LETTER 307-15",",  DATED 06/24/91, PAGE 3, #7, ATTACHED)."," "," "," "," "," "," "," ","1992-02-23"]
[825,"N","SALARY INCLUDES INCREASE OF STEPS ON LANGUAGE PROFICIENCY IN","ACCORDANCE WITH FAS NOTICE 899 DATED 02/10/93."," "," "," "," "," "," "," ","1993-02-10"]
[830,"N","REASSIGMENT TO DEMONSTRATION PROJECT - ALTERNATIVE PERSONNEL MANAGEMENT","SYSTEM - AS AUTHORIZED BY 5 U.S.C. 4703"," "," "," "," "," "," "," ","1997-11-09"]
[888,"N","CORRECTION TO MERIT PAY SALARY OF RECORD"," "," "," "," "," "," "," "," ","1982-05-02"]
[894,"N","INELIGIBLE FOR STEP INCREASE BECAUSE SALARY IS ALREADY AT THE MAXIMUM RA","TE OF BASIC PAY FOR EMPLOYEE'S CLASS."," "," "," "," "," "," "," ","1981-01-01"]
[899,"Y","RETAINED GRADE ***** - ***** - *****, *****/***** $********* *****"," "," "," "," "," "," "," "," ","1982-04-04"]
[900,"N","CONTRIBUTIONS TO THE CIVIL SERVICE RETIREMENT FUND CEASE COB OF DAY","PRECEDING THE EFFECTIVE DATE OF THIS ACTION.  CONTRIBUTIONS TO THE","EMPLOYEE'S CREDIT IN THE CIVIL SERVICE RETIREMENT FUND TO BE TRANS","FERRED   IN ACCORDANCE WITH SECTION 805 (C)(1) OF THE FS ACT OF 1980."," "," "," "," "," ","1982-03-23"]
[901,"N","CONTRIBUTIONS TO THE FOREIGN SERVICE RETIREMENT AND DISABILITY SYSTEM TO","COMMENCE"," "," "," "," "," "," "," ","1981-12-01"]
[902,"N","NOMINATED          CONFIRMED          ATTESTED"," "," "," "," "," "," "," "," ","1981-12-01"]
[903,"N","YOU HAVE REEMPLOYMENT RIGHTS AS A CIVIL SERVICE EMPLOYEE UNDER SEC.310 O","F  FS ACT OF 1980."," "," "," "," "," "," "," ","1981-12-01"]
[904,"N","AS A CAREER CANDIDATE UNDER SECTION 306(A)(2) PRE CAREER FOREIGN SERVICE","OFFICER FOR A PERIOD NOT TO EXCEED 5 YEARS OR THE FINAL DECISION OF A","TENURING BOARD ESTABLISHED UNDER SECTION 306(B) OF THE FS ACT OF 1","980,     WHICHEVER IS SOONER."," "," "," "," "," ","1981-12-01"]
[905,"N","REEMPLOYMENT FOREIGN SERVICE ANNUITANT. RETIRED UNDER FOREIGN SERVICE","RETIREMENT SYSTEM ON SALARY AT TIME OF RETIREMENT. RECEIPT OF ANNUITY","SUBJECT TO LIMITATION OF SEC. 872 OF THE FOREIGN SERVICE ACT."," "," "," "," "," "," ","1981-12-01"]
[906,"N","AS A CAREER CANDIDATE UNDER SECTION 306 (A)(1) PRE CAREER FP FOR A PERIO","D  NOT TO EXCEED 5 YEARS, OR THE FINAL DECISION OF A TENURING BOARD","ESTABLISHED UNDER SECTION 306-B OF THE FS ACT OF 1980, WHICHEVER I","SOONER."," "," "," "," "," ","1981-12-01"]
[907,"N","AS A CAREER CANDIDATE UNDER SECTION 306(A)(2) PRE CAREER FOREIGN SERVICE","OFFICER FOR A PERIOD NOT TO EXCEED 4 YEARS, OR THE FINAL DECISION OF","A     TENURING BOARD ESTABLISHED UNDER SECTION 306(B) OF THE FS ACT OF 1","980,     WHICHEVER IS SOONER."," "," "," "," "," ","1981-12-01"]
[908,"N","EMPLOYEE HAS GUARANTEED PLACEMENT RIGHTS DURING PROBATION."," "," "," "," "," "," "," "," ","1981-12-01"]
[909,"N","APPOINTMENT LIMITED TO FIVE YEARS OR NEED OF EMPLOYEE'S SERVICES, WHICH","EVER IS LESS."," "," "," "," "," "," "," ","1981-12-01"]
[910,"N","APPOINTMENT LIMITED TO     YEARS OR NEED OF EMPLOYEE'S SERVICES, WHICHEV","ER IS LESS."," "," "," "," "," "," "," ","1981-12-01"]
[911,"N","CONVERTED FROM"," "," "," "," "," "," "," "," ","1981-12-01"]
[912,"N","APPOINTED BY THE PRESIDENT AS FSO            CONSULAR OFFICER AND","SECRETARY IN THE DIPLOMATIC SERVICE OF THE U.S.A."," "," "," "," "," "," "," ","1981-12-01"]
[913,"N","INCUMBENT CURRENTLY SERVING AS"," "," "," "," "," "," "," "," ","1981-12-01"]
[914,"N","SERVICE CREDIT FOR RETIREMENT, REDUCTION-IN-FORCE, AND LEAVE ACCURAL","PURPOSES CONTINUES FOR UP TO A MAXIMUM OF SIX MONTHS IN NONPAY STATUS","PER CALENDAR YEAR."," "," "," "," "," "," ","1981-12-01"]
[915,"N","IN CONTINUATION OF PROBATIONARY PERIOD BEGINNING          ENDING"," "," "," "," "," "," "," "," ","1981-12-01"]
[916,"N","APPOINTMENT BY THE PRESIDENT TO THE CLASS OF            IN THE SENIOR","FOREIGN SERVICE OF THE U.S.A."," "," "," "," "," "," "," ","1981-12-01"]
[917,"N","EMPLOYEE SEPARATED FROM        ON"," "," "," "," "," "," "," "," ","1981-12-01"]
[918,"N","EMPLOYEE CONTINUES TO HOLD A COMMISION AS A FOREIGN SERVICE OFFICER."," "," "," "," "," "," "," "," ","1981-12-01"]
[919,"N","TYPE OF APPOINTMENT, LEVEL, AND SALARY REMAIN UNCHANGED."," "," "," "," "," "," "," "," ","1981-12-01"]
[920,"N","EMPLOYEE IN LWOP STATUS UNTIL COB EFFECTIVE DATE OF THIS ACTION."," "," "," "," "," "," "," "," ","1981-12-01"]
[921,"N","TRANSFER FEHBA ENROLLMENT TO DEPARTMENT OF STATE"," "," "," "," "," "," "," "," ","1983-06-12"]
[922,"N","PENDING RECONFIRMATION AS A CAREER FOREIGN SERVICE OFFICER"," "," "," "," "," "," "," "," ","1983-09-04"]
[923,"N","IN ACCORDANCE WITH SECTION 403 OF THE FS ACT OF 1980, PAYABLE SALARY","LIMITED TO THE MAXIMUM RATE OF PAY PRESCRIBED FOR GS-15 OF THE GENERA","L     SCHEDULE UNDER SECTION 5332 OF TITLE 5, UNITED STATES CODE."," "," "," "," "," "," ","1984-11-11"]
[924,"N","PENDING CONFIRMATION AND ATTESTATION AS A FOREIGN SERVICE OFFICER, EMPLO","YEEIS CONVERTED TO CAREER FOREIGN SERVICE STATUS."," "," "," "," "," "," "," ","1987-01-01"]
[925,"N","EMPLOYEE ELECTED COVERAGE UNDER FSPS."," "," "," "," "," "," "," "," ","1987-07-01"]
[926,"N","EMPLOYEE IS AUTOMATICALLY COVERED UNDER FSPS"," "," "," "," "," "," "," "," ","1987-07-01"]
[927,"N","REASON FOR TEMPORARY APPOINTMENT:  1990 CENSUS"," "," "," "," "," "," "," "," ","1988-01-01"]
[928,"N","EMPLOYEE'S WORK SCHEDULE IS A MIXED TOUR WITH A (FULL-TIME/PART-TIME)","SCHEDULE TOUR OF DUTY. BASED ON THE AGENCY'S FLUCTUATING WORKLOAD, TH","E     EMPLOYEE WILL REVERT TO INTERMITTENT STATUS AS NECESSARY."," "," "," "," "," "," ","1988-01-01"]
[929,"N","THIS POSITION IS TEMPORARY NOT TO EXCEED ONE YEAR UNDER SCHEDULE A AND","IS OUTSIDE THE COMPETITIVE CIVIL SERVICE."," ","IN ACCEPTING THIS APPOINTMENT THE INCUMBENT UNDERSTANDS THAT TH","E           APPOINTMENT IS TERMINABLE UPON NOTICE THEREOF."," "," "," "," ","1988-01-01"]
[930,"N","THIS ACTION CONTINUES YOUR TEMPORARY APPOINTMENT NOT TO EXCEED THE DATE","REFLECTED IN ITEM  5B."," "," "," "," "," "," "," ","1988-07-03"]
[931,"N","THE CONDITIONS OF A TEMPORARY APPOINTMENT UNDER SCHEDULE A AS LISTED ON","YOUR ORIGINAL APPOINTMENT SF-50 REMAIN IN EFFECT."," "," "," "," "," "," "," ","1988-01-01"]
[932,"N","MIXED TOUR WORK SCHEDULE CONTINUES TO REMAIN IN EFFECT."," "," "," "," "," "," "," "," ","1988-01-01"]
[933,"N","IF PREVIOUSLY COVERED BY BENEFITS, COVERAGE CONTINUES."," "," "," "," "," "," "," "," ","1988-01-01"]
[934,"N","REASON FOR TERMINATION:  LACK OF WORK."," "," "," "," "," "," "," "," ","1988-01-01"]
[935,"N","SALARY IS SUBJECT TO CHANGE DURING PERIOD OF EMPLOYMENT UNDER THIS","AUTHORITY."," "," "," "," "," "," "," ","1988-01-01"]
[936,"N","PAY ADJUSTED TO   /  /  /        /   EFFECTIVE      ."," "," "," "," "," "," "," "," ","1988-05-08"]
[937,"N","FORWARDING ADDRESS=","           :"," "," "," "," "," "," "," ","1982-01-01"]
[938,"N","ADMINISTRATIVE CHANGE ONLY. ASSIGNMENT OF NEW IDENTIFYING NUMBER TO","EMPLOYEE'S SERVICING PERSONNEL OFFICE. WESTERN HUMAN RESOURCE","ZONE LETTER 11/8/02."," "," "," "," "," "," ","2003-09-01"]
[998,"Y","OFFICIAL WORKING TITLE IS ****************************************"," "," "," "," "," "," "," "," ","1992-05-17"]
[999,"N","FOR NFC USE - TEMPORARILY ASSIGNED REMARK CODE  WITH VARIABLE  CONTENT."," "," "," "," "," "," "," "," ","1981-12-01"]
["9A1","N","SALARY WOULD BE $          IF NOT LIMITED BY THE PAY CAP"," "," "," "," "," "," "," "," ","1986-05-30"]
["9A2","N","RESIGNED BECAUSE"," "," "," "," "," "," "," "," ","1986-05-30"]
["9A3","N","STAFF REDUCTION NOTICE DATED:"," "," "," "," "," "," "," "," ","1986-05-30"]
["9A4","N","ADVANCED STEP APPROVED BY MANAGEMENT COMMITTEE MEMBER ON   /  /  ."," "," "," "," "," "," "," "," ","1986-05-30"]
["9A5","N","AE SALARY RATE APPROVED BY THE SECRETARY ON:"," "," "," "," "," "," "," "," ","1986-05-30"]
["9A6","N","APPOINTMENT IS SUBJECT TO COMPLETION OF 6 MONTH PROBATIONARY PERIOD","BEGINNING (DATE)."," "," "," "," "," "," "," ","1986-05-30"]
["9A7","N","CHANGES SCD FROM          TO REFLECT ONLY CREDITABLE SERVICE."," "," "," "," "," "," "," "," ","1986-05-30"]
["9A8","N","TOUR OF DUTY IS THE FIRST           HOURS WITHIN THE ADMINISTRATIVE WORK","-  WEEK.  ( SSH  1200, CHAPTER 610, SECTION 3B)."," "," "," "," "," "," "," ","1986-05-30"]
["A01","N","APPOINTMENT IS ON A SEASONAL BASIS; THE EMPLOYEE IS SUBJECT TO RELEASE T","O  NONPAY STATUS AND RECALL TO DUTY TO MEET WORKLOAD REQUIREMENTS AS A","CONDITION OF EMPLOYMENT IN ACCORDANCE WITH THE ATTACHED AGREEMENT."," "," "," "," "," "," ","1982-06-28"]
["A02","N","APPOINTMENT IS ON AN ON-CALL BASIS; THE EMPLOYEE IS SUBJECT TO RELEASE T","O  NONPAY STATUS AND RECALL TO DUTY TO MEET WORKLOAD REQUIREMENTS AS A","CONDITION OF EMPLOYMENT IN ACCORDANCE WITH THE ATTACHED AGREEMENT."," "," "," "," "," "," ","1982-06-28"]
["A03","N","THIS APPOINTMENT IS INTENDED TO CONTINUE FOR TWO YEARS.  UPON SATISFACTO","RY COMPLETION OF 2-YEAR TRIAL PERIOD, YOU WILL BE NONCOMPETITIVELY CONVE","RTED  TO CAREER-CONDITIONAL OR CAREER APPOINTMENT.  IF PERFORMANCE IS NO","T        SATISFACTORY OR YOU FAIL TO SATISFACTORILY COMPLETE PROGRAM, EM","PLOYMENT    WILL BE TERMINATED."," "," "," "," ","1992-03-08"]
["A04","N","APPOINTMENT IS NTE TWO YEARS.  UPON SATISFACTORY COMPLETION OF","INTERNSHIP, YOU WILL BE NONCOMPETITIVELY CONVERTED TO CAREER OR","CAREER-CONDITIONAL APPOINTMENT.  IF YOUR PERFORMANCE IS NOT","SATISFACTORY OR IF YOU FAIL TO SATISFACTORILY COMPLETE INTERNSH","IP,         EMPLOYMENT WILL BE TERMINATED."," "," "," "," ","1981-12-01"]
["A07","Y","EMPLOYMENT UNDER THIS APPOINTMENT MUST NOT EXCEED ******** HOURS A YEAR."," "," "," "," "," "," "," "," ","1994-12-25"]
["A08","Y","EMPLOYMENT UNDER THIS AND PREVIOUS APPOINTMENT MUST NOT EXCEED ********","HOURS A YEAR."," "," "," "," "," "," "," ","1994-12-25"]
["A11","Y","EMPLOYMENT UNDER THIS APPOINTMENT MUST NOT EXCEED ********","WORKING DAYS A YEAR."," "," "," "," "," "," "," ","1982-06-01"]
["A12","Y","EMPLOYMENT UNDER THIS AND PREVIOUS APPOINTMENT MUST NOT EXCEED *****","WORKING DAYS A YEAR."," "," "," "," "," "," "," ","1981-12-01"]
["A15","N","TOTAL COMPENSATION DURING SERVICE YEAR MAY NOT EXCEED 40% OF SALARY FOR","GS-3/1; SALARY INCREASE RESULTING FROM A WITHIN GRADE INCREASE WILL N","OT    COUNT AGAINST THIS LIMITATION."," "," "," "," "," "," ","1982-06-01"]
["A17","N","AS A  REEMPLOYED ANNUITANT, YOU SERVE AT THE WILL OF THE APPOINTING","OFFICER."," "," "," "," "," "," "," ","1981-12-01"]
["A21","N","TEMP EMPLOYEES SERVE UNDER APPTS LIMITED TO 1 YEAR OR LESS & ARE SUBJEC\tT  TO TERMINATION AT ANY TIME W/O USE OF ADVERSE ACTION OR REDUCTION-IN-\tFORCE PROCEDURES.  A TEMP APPT DOES NOT CONFER ELIGIBILITY TO BE PROMOTE\tD OR     REASSIGNED TO OTHER POSITIONS, OR THE ABILITY TO BE NONCOMPETIT\tIVELY       CONVERTED TO A CAREER CONDITIONAL APPT.\t \t \t \t \t1980-01-01\r\nA22\tN\tTHIS APPOINTMENT CANNOT BE RENEWED. UPON ADMISSION TO THE BAR, YOU WILL\tBE ELIGIBLE FOR APPOINTMENT AS ATTORNEY IN ACCORDANCE WITH AGENCY APPOIN\tTMENT PROCEDURES.\t \t \t \t \t \t \t1981-12-01\r\nA24\tN\tEMPOLYEE INFORMED IN ADVANCE OF THE CONDITIONS OF APPOINTMENT UNDER THE\tPRESIDENTIAL MANAGEMENT INTERN PROGRAM.\t \t \t \t \t \t \t \t1988-01-01\r\nA25\tN\tTHIS ACTION PROVIDES RELIEF REQUIRED BY PUBLIC LAW 101-12, PENDING\tFINAL DECISION OF THE MSPB.\t \t \t \t \t \t \t \t1992-03-08\r\nA2M\tN\tCS CERT NO ______________WTO\t \t \t \t \t \t \t \t \t2003-08-01\r\nA30\tN\tTHIS APPOINTMENT DOES NOT CONFER ELIGIBILITY TO BE NONCOMPETITIVELY\tCONVERTED TO CAREER CONDITIONAL OR CAREER APPOINTMENT.\t \t \t \t \t \t \t \t1994-12-16\r\nA31\tN\tTHIS APPT IS INTENDED TO CONTINUE THRU COMPLETION OF EDUCATION & STUDY\tRELATED WORK REQMTS. AN AGENCY MAY NONCOMPETITIVELY APPOINT YOU TO A\tCAREER OR CAREER-CONDITIONAL APPT WITHIN 120 DAYS AFTER SATISFACTORY\tCOMPLETION OF YOUR EDUCATIONAL PROGRAM AND SATISFACTORY COMPLETION OF\tAT LEAST 640 HOURS OF CAREER-RELATED WORK EXPERIENCE. THE WORK\tEXPERIENCE MUST HAVE BEEN COMPLETED PRIOR TO OR CONCURRENTLY WITH THE\tCOMPLETION OF THE REQUIREMENTS OF YOUR EDUCATIONAL PROGRAM\t \t \t1994-12-16\r\nA32\tY\tTHIS APPOINTMENT IS INTENDED TO CONTINUE FOR 2 YEARS,UNLESS EXTENDED UP\tTO 1 ADDITIONAL YEAR.  UPON SATISFACTORY COMPLETION OF THE INTERNSHIP,\tYOU MAY  BE NONCOMPETITIVELY CONVERTED TO A CAREER OR CAREER-CONDITIONAL\tAPPOINTMENT.  IF YOU FAIL TO SATISFACTORILY COMPLETE THE INTERNSHIP,\tYOUR EMPLOYMENT  WILL BE TERMINATED.\t \t \t \t \t2005-04-03\r\nAC1\tN\tEMPLOYMENT IS TEMPORARY AND OF UNCERTAIN DURATION.\t \t \t \t \t \t \t \t \t1991-06-05\r\nAC2\tN\tTHIS BASIC RATE INCLUDES A 10% NIGHT SHIFT DIFFERENTIAL.\t \t \t \t \t \t \t \t \t1991-06-05\r\nAC3\tN\tSERVICE CREDIT FOR RETIREMENT AND LEAVE ACCURAL PURPOSES CONTINUES FOR\tUP TO A MAXIMUM OF 6 MONTHS IN A NONPAY STATUS PER CALENDAR YEAR.\t \t \t \t \t \t \t \t1991-06-05\r\nAC4\tY\tSALARY RATE INDICATED IN BLOCK 12 AND/OR 20 DOES NOT INCLUDE FRINGE\tBENEFITS OR SHIFT DIFFERENTIAL.  YOU ARE ENTITLED TO AN ADDITIONAL\t$***.*** PER HOUR FOR FRINGE BENEFITS. FRINGE BENEFITS ARE EXCLUDE\tD        IN THE COMPUTATION OF OVERTIME AND SHIFT DIFFERENTIAL.\t \t \t \t \t \t1991-06-05\r\nAC5\tN\tTHIS TEMPORARY APPOINTMENT SHALL REMAIN IN EFFECT UNTIL\tOTHERWISE ORDERED BY THE ARCHITECT OF THE CAPITOL.\t \t \t \t \t \t \t \t1993-01-10\r\nAC6\tN\tEMPLOYEE ELIGIBLE FOR 1% TSP GOVERNMENT CONTRIBUTION\tBEGINNING (  /  /  ).\t \t \t \t \t \t \t \t1993-01-10\r\nAF1\tN\tEMPLOYEE COVERED BY CUSTOMS OFFICER PAY REFORM ACT: P.L. 103-66.\t \t \t \t \t \t \t \t \t1993-12-26\r\nB01\tN\tCANCELLED HEALTH BENEFITS\t \t \t \t \t \t \t \t \t1981-12-01\r\nB02\tN\tELECTED NOT TO ENROLL FOR HEALTH BENEFITS.\t \t \t \t \t \t \t \t \t1981-12-01\r\nB03\tN\tINELIGIBLE FOR HEALTH BENEFITS.\t \t \t \t \t \t \t \t \t1981-12-01\r\nB04\tN\tINELIGIBLE FOR LEAVE.\t \t \t \t \t \t \t \t \t1981-12-01\r\nB30\tN\tCHANGES SCE-LEAVE FROM         UPON EMPLOYEE'S RETIREMENT FROM THE\tUNIFORMED SERVICE.\t \t \t \t \t \t \t \t2009-02-01\r\nB31\tY\tCHANGES SCD FROM *******TO REFLECT ******* HOURS WORKED UNDER        INT\tERMITTENT APPOINTMENTS(S).\t \t \t \t \t \t \t \t1989-12-31\r\nB32\tY\tCHANGES SCD FROM ******* TO REFLECT EXCESS TIME IN NONPAY STATUS DURING\tCALENDAR YEAR *****.\t \t \t \t \t \t \t \t1982-09-19\r\nB33\tY\tCHANGES SCD FROM ******* TO REFLECT SERVICE WHICH HAS BEEN RULED\tCREDITABLE.\t \t \t \t \t \t \t \t1981-12-01\r\nB34\tY\tCHANGES SCD FROM ******* TO REFLECT PREVIOUSLY UNCLAIMED SERVICE.\t \t \t \t \t \t \t \t \t1981-12-01\r\nB35\tY\tCHANGES SCD FROM ******* BECAUSE\t \t \t \t \t \t \t \t \t1981-12-01\r\nB36\tY\tCHANGES SCD FROM ******* UPON EMPLOYEE'S RECEIPT OF DISCHARGE FROM\tUNIFORMED SERVICE.\t \t \t \t \t \t \t \t1981-12-01\r\nB37\tN\tCHANGES SCD-LEAVE FROM       UPON EMPLOYEE'S RETIREMENT FROM THE\tUNIFORMED SERVICE. RECOVERY OF EXCESS ANNUAL LEAVE ACCRUED IN THE PAST\tBASED ON THE ERRONEOUS SCD-LEAVE HAS BEEN WAIVED. IF REQUIRED BY THE\tCORRECTED SCD-LEAVE, EMPLOYEE'S CURRENT ANNUAL LEAVE ACCRUAL RATE WILL\tBE CORRECTED PROSPECTIVELY.\t \t \t \t \t2009-02-01\r\nB41\tN\tHEALTH BENEFITS COVERAGE WILL CONTINUE AS LONG AS YOU PARTICIPATE IN THE\tWORK-STUDY PROGRAM IF YOU PAY THE EMPLOYEE'S SHARE OF COSTS. PAYMENT\tSHOULD BE MADE TO AGENCY, EITHER WHEN YOU RETURN TO DUTY, OR DURIN\tG        YOUR NONPAY STATUS.\t \t \t \t \t \t1983-08-21\r\nB43\tN\tGOVERNMENT SHARE OF PREMIUM FOR HEALTH BENEFITS COVERAGE WILL BE REDUCED\tBECAUSE YOU ARE WORKING PART TIME. YOU WILL HAVE TO PAY THE EMPLOYEE\tSHARE OF THE PREMIUM PLUS THE DIFFERENCE BETWEEN WHAT THE GOVERNME\tNT PAYS  FOR YOUR ENROLLMENT AND THE AMOUNT THE GOVERNMENT PAYS FOR A FU\tLL-TIME     EMPLOYEE.\t \t \t \t \t1992-08-23\r\nB44\tN\tHEALTH BENEFITS COVERAGE CONTINUES.\t \t \t \t \t \t \t \t \t1984-03-01\r\nB45\tN\tYOU MAY CHANGE HEALTH BENEFITS ENROLLMENT WITHIN 60 DAYS AFTER THE\tEFFECTIVE DATE OF THIS ACTION.\t \t \t \t \t \t \t \t1999-02-28\r\nB46\tN\tSF-2819 WAS PROVIDED. LIFE INSURANCE COVERAGE IS EXTENDED FOR 31 DAYS\tDURING WHICH YOU ARE ELIGIBLE TO CONVERT TO AN INDIVIDUAL POLICY (NON\t-     GROUP CONTRACT).\t \t \t \t \t \t \t1986-10-03\r\nB47\tN\tHEALTH BENEFITS COVERAGE IS EXTENDED FOR 31 DAYS DURING WHICH YOU ARE\tELIGIBLE TO CONVERT TO AN INDIVIDUAL POLICY (NONGROUP CONTRACT).\t \t \t \t \t \t \t \t1985-12-08\r\nB48\tN\tWILL COLLECT HEALTH BENEFITS PREMIUMS FROM YOU BASED ON THE\tTOTAL NUMBER OF HOURS YOU ARE SCHEDULED TO WORK.\t \t \t \t \t \t \t \t1985-12-08\r\nB49\tN\tWILL CONTINUE TO COLLECT HEALTH BENEFITS PREMIUMS FROM YOU.\t \t \t \t \t \t \t \t \t1985-12-08\r\nB50\tN\tFEGLI COVERAGE WILL BE BASED ON THE TOTAL OF YOUR SALARIES HERE AND IN\t.  THE PREMIUM FOR THE COVERAGE WILL BE WITHHELD FROM YOUR\tSALARY AT           .\t \t \t \t \t \t \t1985-12-08\r\nB51\tN\tBASIC LIFE INSURANCE COVERAGE AND ADDITIONAL OPTIONAL COVERAGE (IF\tELECTED) ARE BASED ON THE RATE OF ANNUAL SALARY PAYABLE TO YOU AS A\tPART-TIME EMPLOYEE, NOT THE FULL-TIME SALARY RATE SHOWN IN BLOCK 2\t0 OF     THIS SF50-B.  HOWEVER, BASIC LIFE INSURANCE COVERAGE IS ALWAYS\tAT LEAST    $10,000.\t \t \t \t \t1986-01-05\r\nB52\tN\tINELIGIBLE FOR HEALTH BENEFITS UNTIL YOU COMPLETE ONE YEAR OF CURRENT","CONTINUOUS EMPLOYMENT. THEN YOU MAY ELECT HEALTH BENEFITS FOR WHICH Y","OU    WILL BE CHARGED THE FULL PREMIUM.\""," "," "," "," "," "," ","1980-01-01"]
["B53","N","HEALTH BENEFITS COVERAGE IS EXTENDED FOR 31 DAYS DURING WHICH YOU ARE","ELIGIBLE TO CONVERT TO INDIVIDUAL POLICY (NONGROUP CONTRACT). YOU ARE","ALSO ELIGIBLE FOR TEMP CONTINUATION OF YOUR FEHB COVERAGE FOR UP T","O        18 MTHS"," "," "," "," "," ","1992-01-10"]
["B60","N","ELIGIBLE TO ELECT COVERAGE UNDER THE FEDERAL EMPLOYEES RETIREMENT","SYSTEM (FERS) WITHIN SIX MONTHS OF THE EFFECTIVE DATE OF THIS","PERSONNEL ACTION.  SF-3109 PROVIDED TO EMPLOYEE."," "," "," "," "," "," ","1991-04-07"]
["B61","N","YOU APPEAR TO BE ELIGIBLE FOR EARLY DEFERRED RETIREMENT BENEFITS","AT AGE   .  IF YOU HAVE ANY QUESTIONS, CONTACT YOUR AGENCY","RETIREMENT COUNSELOR."," "," "," "," "," "," ","1991-04-07"]
["B62","N","YOU APPEAR TO BE ELIGIBLE FOR IMMEDIATE MRA + 10 RETIREMENT ANNUITY.","IF YOU HAVE ANY QUESTIONS, CONTACT YOUR AGENCY RETIREMENT COUNSELOR."," "," "," "," "," "," "," ","1991-04-07"]
["B63","N","ELECTED TO RETAIN COVERAGE UNDER A RETIREMENT SYSTEM FOR NAF EMPLOYEES"," "," "," "," "," "," "," "," ","1992-02-09"]
["B66","N","AN EMPLOYEE SUBJECT TO THE PROVISIONS OF PL 108-375 IS ELIGIBLE FOR","CONTINUED FEHB COVERAGE UP TO 24 MONTHS WHEN CALLED TO ACTIVE DUTY AND","CERTAIN REQUIREMENTS (INCLUDING SERVING IN SUPPORT OF A CONTINGENCY","OPERATION) ARE MET. AN EMPLOYEE SUBJECT TO THE PROVISIONS OF PL 108-454","IS ELIGIBLE FOR FEHB COVERAGE FOR 24 MONTHS WHEN ABSENT BECAUSE OF","SERVICE IN THE UNIFORMED SERVICE AND CERTAIN REQUIREMENTS ARE MET."," "," "," ","2006-08-06"]
["B67","Y","ELECTED FULL LIVING BENEFITS ON         . POST ELECTION BASIC INSURANCE","AMOUNT IS $********. NOT ELIGIBLE TO ASSIGN INSURANCE."," "," "," "," "," "," "," ","1995-07-07"]
["B68","Y","ELECTED PARTIAL LIVING BENEFITS ON          . POST-ELECTION BASIC","INSURANCE AMOUNT IS $******.  NOT ELIGIBLE TO ASSIGN INSURANCE. MUST","ELECT \"NO REDUCTION\" AT RETIREMENT."," "," "," "," "," "," ","1995-07-07"]
["B69","N","Employee Has Assigned Ownership Of Life Insurance Coverage.  Assignment","Terminates 31 Days After Separation Date Unless Employee Is Entitled To","Continued Coverage Before That Date."," "," "," "," "," "," ","1900-01-01"]
["B71","N","YOU MUST ELECT TO EITHER:(1)TERMINATE YOUR ENROLLMENT,OR (2)CONTINUE IT","UP TO 365 DAYS AND AGREE TO PAY THE PREMIUM OR INCUR A DEBT. IF YOU DO","NOT ELECT TO TERMINATE OR TO CONTINUE YOUR ENROLLMENT,IT AUTOMATICALLY","TERMINATES AT THE END OF THE LAST PAY PERIOD IN WHICH YOU PAID PREMIUMS.","CONTACT YOUR SERVICING HUMAN RESOURCES OFFICE OR SEE THE FEHB HANDBOOK A","HTTP://WWW.OPM.GOV/INSURE FOR DETAILED INFORMATION."," "," "," ","2000-10-01"]
["B72","N","FEGLI COVERAGE CONTINUES UNTIL YOUR TIME IN NONPAY STATUS TOTALS 12","MONTHS. CONTACT YOUR HUMAN RESOURCES OFFICE OR SEE THE FEGLI HANDBOOK AT","HTTP://WWW.OPM.GOV/INSURE FOR DETAILED INFORMATION"," "," "," "," "," "," ","2000-10-01"]
["B73","Y","YOU ARE RECEIVING CREDIT TOWARDS YOUR SCD-LEAVE AS SHOWN IN BLOCK 31","FOR NON-FEDERAL SERVICE FROM                            TO","THIS CREDIT WILL NOT HEREAFTER","CEASE TO BE CREDITABLE UNLESS YOU FAIL TO COMPLETE 1 FULL YEAR OF","CONTINUOUS SERVICE WITH THIS AGENCY."," "," "," "," ","2005-04-28"]
["B74","Y","YOU ARE RECEIVING                                                 CREDIT","TOWARDS YOUR SCD-LEAVE AS SHOWN IN BLOCK 31 FOR ACTIVE DUTY UNIFORM","SERVICE FROM                          TO                               .","THIS CREDIT WILL NOT HEREAFTER CEASE TO BE CREDITABLE UNLESS YOU FAIL TO","COMPLETE 1 FULL YEAR OF CREDITABLE SERVICE WITH THIS AGENCY."," "," "," "," ","2005-04-28"]
["B75","Y","CHANGES SCD-LEAVE FROM                         TO","BECAUSE EMPLOYEE FAILED TO COMPLETE 1 FULL YEAR OF CONTINUOUS SERVICE","WITH THE APPOINTING AGENCY."," "," "," "," "," "," ","2005-04-28"]
["B76","N","FEGLI COV CONT AT NO COST TO YOU UNTIL YOUR TIME IN NONPAY STATUS TOTALS","12 MTHS. IF YOU ARE IN ACTIVE DUTY MIL STATUS,YOU MAY ELECT TO CONTINUE","FEGLI COVG FOR AN ADDTL 12 MTHS BY PAYING BOTH EMPL AND AGENCY PREMIUMS","(BASIC COV) AND BY PAYING THE ENTIRE COST (OPT COV).PER SECTION 1102 OF","PUBLIC LAW 110-181. YOU MUST MAKE THE ELEC BEFORE THE END OF THE FIRST","12 MNTHS IN NONPAY STATUS. CONTACT YOUR SERVICING HRMS OR FEGLI HDBK."," "," "," ","2008-12-21"]
["B77","N","HEALTH BENEFITS COVERAGE WILL CONTINUE FOR UP TO 365 DAYS IN A NONPAY","STATUS UNLESS YOU CANCEL YOUR ENROLLMENT."," "," "," "," "," "," "," ","1990-09-30"]
["BE1","N","REMOVE FROM ACTING PROGRAM IN ACCORDANCE WITH ASSESSMENT CENTER POLICY,","BUREAU PERSONNEL MANUAL CHAPTER 337. INELIGIBLE SCORE RECEIVED THROUG","H     ASSESSMENT CENTER ON   /  /  /  . PER VACANCY ANNOUNCEMENT NO.","(           ) DATED   /  /  ."," "," "," "," "," ","1993-11-28"]
["BE2","N","REMOVE FROM THE ACTING PROGRAM IN ACCORDANCE WITH BUREAU PERSONNEL MANUE","L, M-60-1, SECTION 1, \"ASSESSMENT CENTER PROGRAM.\"  EMPLOYEE DID NOT REP","ORT   FOR TESTING ON DATE SCHEDULED. PER ANNOUNCEMENT NO. (           )."," "," "," "," "," "," ","1993-11-28"]
["BE3","N","COMPLETED THE ASSESSMENT CENTER ON   /  /  . PROCESS IN ACCORDANCE WITH","ASSESSMENT CENTER POLICY, BUREAU PERSONNEL MANUAL, M-60-1, CHAPTER 33","7,    SECTION 1, DATED 12/09/91."," "," "," "," "," "," ","1993-11-28"]
["BE4","N","EMPLOYEE MAY BE PROMOTED TO THE FULLTIME SUPERVISORY POSITION WITHOUT","FURTHER COMPETITION (EXCEPT AMONGST OTHER EMPLOYEES WHO ARE ELIGIBLE","FOR   PROMOTION TO THE FULL PERFORMANCE LEVEL) AS DESCRIBED IN PARAGRAPH","6-7M    OF THE BEP MERIT PROMOTION PLAN, DATED JUNE 25, 1987."," "," "," "," "," ","1993-11-28"]
["BE5","N","SELECTED FOR ACTING POSITION IN ACCORDANCE WITH BEP BULLETIN NO. 65-50.1","8, ACTING PAY POLICY, DATED 12/10/90, APPLIED UNDER VACANCY ANNOUNCEMENT","NO.  (           ), WHICH OPENED ON   /  /   AND COMPLETED THE ASSESSME","NT       CENTER ON   /  /  ."," "," "," "," "," ","1993-11-28"]
["BE6","N","EMPLOYEE MAY SERVE IN A SUPERVISORY POSITION, AS NEEDED, FOR UP TO 120","WORKING DAYS PER YEAR. WHEN SERVING AS (","), WILL BE PAID AT THE RATE OF HIGHER GRADE (5X-08), STEP (2N",") AND    SALARY (D9.2) PER (2A)."," "," "," "," "," ","1993-11-28"]
["BE7","N","BASIC LIFE INSURANCE COVERAGE AND ADDITIONAL OPTIONAL COVERAGE (IF ELECT","ED)AND THE AMOUNT OF WITHHOLDING WILL BE BASED ON THE SALARY SHOWN IN BL","OCK 20EXCEPT DURING THOSE PP'S IN WHICH YOU ARE SERVING AS AN ACTING SUP","RVISOR."," "," "," "," "," ","1993-11-28"]
["BUP","N","AUTH:  MEMO DATED 01/24/01"," "," "," "," "," "," "," "," ","2003-08-01"]
["C02","N","EMPLOYEE FOUND TO BE ELIGIBLE FOR                 RETIREMENT."," "," "," "," "," "," "," "," ","1981-12-01"]
["C03","N","RETROACTIVE RESTORATION."," "," "," "," "," "," "," "," ","1978-09-29"]
["C04","N","RETROACTIVE RESTORATION TO INTERMEDIATE GRADE."," "," "," "," "," "," "," "," ","1981-12-01"]
["C06","N","RETROACTIVE CHANGE TO FORMER GRADE, LEVEL, OR BAND BASED ON"," "," "," "," "," "," "," "," ","2006-04-30"]
["C07","N","RETROACTIVE CHANGE TO LOWER GRADE, LEVEL, OR BAND BASED ON"," "," "," "," "," "," "," "," ","2006-04-30"]
["C08","N","ALSO CORRECTS SAME ITEM(S) ON PERSONNEL ACTION         DATED         ."," "," "," "," "," "," "," "," ","1983-12-25"]
["C09","N","ALSO CORRECTS                           EFFECTIVE          ITEM","TO ADD"," "," "," "," "," "," "," ","1981-12-01"]
["C10","N","CORRECTS DATE OF SEPARATION FROM          TO AVOID A BREAK IN SERVICE WH","EN EMPLOYEE WAS APPOINTED BY"," "," "," "," "," "," "," ","1981-12-01"]
["C11","N","CORRECTS ITEM               FROM"," "," "," "," "," "," "," "," ","1981-12-01"]
["C12","N","ALSO CORRECTS THE SAME ITEM ON ALL PREVIOUS PERSONNEL ACTIONS FROM","TO"," "," "," "," "," "," "," ","1981-12-01"]
["C13","N","ALSO CORRECTS PERSONNEL ACTION                       ,            ,","EFFECTIVE         , ITEM NUMBER                     FROM     ."," "," "," "," "," "," "," ","1981-12-01"]
["C14","N","ACTION CANCELLED BECAUSE:"," "," "," "," "," "," "," "," ","1981-12-01"]
["C15","N","THIS NOTIFICATION OF PERSONNEL ACTION REPLACES A PREVIOUSLY EXECUTED ONE","."," "," "," "," "," "," "," ","1981-12-01"]
["C16","N","THIS NOTIFICATION OF PERSONNEL ACTION PREPARED BY"," "," "," "," "," "," "," "," ","1981-12-01"]
["C17","N","COMPLETES ITEM               WHICH WAS OMITTED."," "," "," "," "," "," "," "," ","1981-12-01"]
["C18","N","CORRECTS ITEM               TO READ:"," "," "," "," "," "," "," "," ","1981-12-01"]
["C19","N","CORRECTS SALARY TO GIVE EMPLOYEE BENEFIT OF HIGHEST PREVIOUS RATE OF","BASIC PAY."," "," "," "," "," "," "," ","1982-06-28"]
["C20","N","ACTION CANCELLED IN ACCORDANCE WITH OPM LETTER DATED           .THIS SF5","0  AND THE SF50 BEING CANCELLED MUST BE RETAINED PERMANENTLY IN THE EMPL","OYEES OFFICIAL PERSONNEL FOLDER."," "," "," "," "," "," ","1982-01-01"]
["C21","N","SERVICE FROM (      ) TO (      ) MAY BE CREDITED FOR QUALIFICATIONS","PURPOSES, AND FOR LEAVE ACCRUAL AND RIF RETENTION PURPOSES, AND FOR","(                   )."," "," "," "," "," "," ","1984-03-05"]
["C27","N","ENTITLED TO BACK PAY UNDER 5 USC 5596."," "," "," "," "," "," "," "," ","1978-09-29"]
["C28","Y","ACTIVE DUTY BEGINS *******"," "," "," "," "," "," "," "," ","1978-09-29"]
["C30","N","NATURE OF ACTION AND CODE SHOWN ON ORGINAL ACTION ARE NO LONGER IN USE."," "," "," "," "," "," "," "," ","1994-07-10"]
["CC1","Y","THE WAITING PERIOD FOR YOUR NEXT STEP INCREASE IS **********"," "," "," "," "," "," "," "," ","1992-01-12"]
["CC2","N","SUCCESSFUL COMPLETION OF REQUIREMENTS FOR PROMOTION TO COMMISSIONED","NATIONAL BANK EXAMINER."," "," "," "," "," "," "," ","1992-02-23"]
["CC3","N","ACTION RESULTS IN A MERIT LUMP SUM PAYMENT OF $      ."," "," "," "," "," "," "," "," ","1992-02-23"]
["CC4","N","ACTION RESULTS IN A PROMOTION LUMP SUM PAYMENT OF $      ."," "," "," "," "," "," "," "," ","1992-02-23"]
["CC5","N","SALARY INCLUDES AN ADJUSTMENT OF $      . TO BRING SALARY UP TO THE","MINIMUM OF THE GRADE."," "," "," "," "," "," "," ","1992-02-23"]
["CC6","N","FIELD EXAMINERS ARE SUBJECT TO FREQUENT TRAVEL FOR THE PURPOSE OF BANK","EXAMINATION AND RELATED FUNCTIONS AND ARE THEREFORE AUTHORIZED TO TRA","VEL   ANYWHERE IN THE CONTINENTAL U.S. FOR THIS PURPOSE."," "," "," "," "," "," ","1992-02-23"]
["CC7","N","ANNIVERSARY DATE HAS BEEN ADJUSTED TO REFLECT EXCESSIVE TIME IN NONPAY","STATUS. NEW ANNIVERSARY DATE IS         ."," "," "," "," "," "," "," ","1992-02-23"]
["CC8","N","INCLUDES EQUITY ADJUSTMENT OF $      ."," "," "," "," "," "," "," "," ","1992-02-23"]
["CF1","N","YOUR APPOINTMENT ENTITLES YOU TO ADVERSE ACTION PROTECTIONS AFTER","COMPLETION OF 1 YEAR OF QUALIFYING SERVICE IF YOU ARE ENTITLED TO VET","ERAN  PREF, OR AFTER 2 YEARS OF QUALIFYING SERVICE IF YOU ARE NOT ENTITL","ED       TO VETERAN PREFERENCE."," "," "," "," "," ","1993-07-25"]
["CG1","N","SCD SUBJECT TO CHANGE UPON VERIFICATION OF PRIOR SERVICE"," "," "," "," "," "," "," "," ","2005-06-12"]
["CG2","N","TRANSFERRED WITHOUT A BREAK IN SERVICE OF A WORK DAY"," "," "," "," "," "," "," "," ","2005-06-12"]
["CG3","N","REGISTRATION MUST BE RECEIVED BY PERSONNEL NLT 60 DAYS FOR HEALTH BENEFI","& 31 DAYS FOR LIFE INSURANCE FROM THE EFFECTIVE DATE OF THIS ACTION"," "," "," "," "," "," "," ","2005-06-12"]
["CG4","N","PREVIOUS RET IREMENT COVERAGE: NEVER COVERED"," "," "," "," "," "," "," "," ","2005-06-12"]
["CG5","N","PREVIOUS RETIREMENT COVERAGE: PREVIOUSLY COVERED"," "," "," "," "," "," "," "," ","2005-06-12"]
["CG6","N","ELIGIBLE FOR SICK & ANNUAL LEAVE"," "," "," "," "," "," "," "," ","2005-06-12"]
["CG7","N","LUMP-SUM PAYMENT TO BE MADE FOR ANY UNUSED ANNUAL LEAVE. SF-8 ISSUED TO","EMPLOYEE"," "," "," "," "," "," "," ","2005-06-12"]
["CG8","N","SF-8 ISSUED TO EMPLOYEES"," "," "," "," "," "," "," "," ","2005-06-12"]
["CG9","N","OPF MAINTAINED BY DHS/US COAST GUARD, CG-1211HQ, 1900 HALF STREET, SW.,","WASHINGTON, DC 20593"," "," "," "," "," "," "," ","2007-07-22"]
["CGA","N","OPF MAINTAINED BY DHS/US COAST GUARD, CG-1211W, 1900 HALF STREET, SW.,","WASHINGTON, DC 20593"," "," "," "," "," "," "," ","2007-07-22"]
["CGB","N","OPF MAINTAINED BY DHS/US COAST GUARD, CG-1211SE, 4200 WILSON BLVD.,","SUITE #400, ARLINGTON, VA 22203"," "," "," "," "," "," "," ","2005-06-12"]
["CGC","N","OPF MAINTAINED BY DHS/US COAST GUARD, CG-1211NE, 2401 HAWKINS POINT ROAD","MAIL STOP 4, BALTIMORE, MD 21226"," "," "," "," "," "," "," ","2005-06-12"]
["CGD","N","THIS IS A RETROACTIVE PERSONNEL ACTION WHICH TOOK EFFECT PRIOR TO THE","USCG NFC CONVERSION DATE OF 8/21/05. THE EFFECTIVE DATE OF THE ACTION IS","(     ). THIS ACTION WILL REQUIRE A RETROACTIVE ADJUSTMENT TO BE","CALCULATED AND PAID OUT BY NFC."," "," "," "," "," ","2005-08-07"]
["CM0","N","SUBJECT TO SATISFACTORY RECORD CHECK AND INQUIRY UNDER E010450. INELIGIB","LE FOR HEALTH BENEFITS. INELIGIBLE FOR LEAVE. SELECTED FROM","DATED          CREDITABLE MILITARY SERVICE            YRS","MOS.    PREVIOUS RETIREMENT COVERAGE:                     .  THIS EMPLO","YEE HAS     ELECTED TO PARTICIPATE IN THE MIXED-TOUR PROGRAM WITH","SCHEDULE TOUR OF DUTY.  BASED ON THE AGENCY'S FLUCTUATING","SUBJECT TO SATISFACTORY RECORD CHECK AND INQUIRY UNDER E010450. INELIGIB","LE FOR HEALTH BENEFITS. INELIGIBLE FOR LEAVE. SELECTED FROM","DATED          CREDITABLE MILITARY SERVICE            YRS","1996-07-01"]
["CM1","N","YRS     MOS.  PREVIOUS RETIREMENT COVERAGE:"," "," ","SUBJECT TO SATISFACTORY RECORD CHECK AND INQUIRY UNDER EO 10450",". SELECTED  FROM                  DATED            . APPOINTMENT AFFIDAV","IT EXECUTED              . FROZEN SERVICE:     YRS      MOS. CREDITABLE","MILITARY SERVICE"," "," ","1997-04-01"]
["CM2","N","ENTITLEMENT TO DIFFERENTIAL NO LONGER APPLICABLE.  BASE PAY ADJUSTED TO","MAXIMUM RATE OF PAY RANGE."," "," "," "," "," "," "," ","1998-03-29"]
["CM3","N","BASE PAY ADJUSTED - COMPETITIVE SELECTION."," "," "," "," "," "," "," "," ","1998-03-29"]
["CM4","N","BASE PAY ADJUSTED FOR STUDENT OR FACULTY MEMBER AT COMPLETION OF AN","ACADEMIC SCHOOL YEAR OR ADDITIONAL YEAR OF TEACHING OR RESEARCH."," "," "," "," "," "," "," ","1998-03-29"]
["CM5","N","PAY INCREASE AUTHORIZED PURSUANT TO 13 USC 23(A)."," "," "," "," "," "," "," "," ","1998-03-01"]
["CM6","N","RATE OF PAY PER HOUR IS $   .  ."," "," "," "," "," "," "," "," ","1998-07-01"]
["CNC","N","NO CHANGE IN SALARY DUE TO PAY RETENTION"," "," "," "," "," "," "," "," ","2003-08-01"]
["CSR","N","NIGHT RATE DIFFERENTIAL CHANGES FROM 15% TO 12%"," "," "," "," "," "," "," "," ","2003-08-01"]
["D01","N","THIS ACTION IS PROCESSED IN ACCORDANCE WITH ASSISTANT ATTORNEY GENERAL","FOR ADMINISTRATION'S MEMORANDUM, SUBJECT: \"DELEGATION OF PERSONNEL","MANAGEMENT AUTHORITY DATED DECEMBER 17, 1996\"."," "," "," "," "," "," ","1997-03-02"]
["D02","N","THIS ACTION IS PROCESSED IN ACCORDANCE WITH ASSISTANT ATTORNEY GENERAL","FOR ADMINISTRATION'S MEMORANDUM, SUBJECT: \"DELEGATION OF PERSONNEL","MANAGEMENT AUTHORITY DATED DECEMBER 2, 1996\"."," "," "," "," "," "," ","1997-03-02"]
["D03","N","OPF MANTAINED BY: EXECUTIVE OFFICE FOR IMMIGRATION REVIEW, PERSONNEL STA","FF,5107 LEESBURG PIKE, SUITE 2300, FALLS CHURCH, VA 22041."," "," "," "," "," "," "," ","1997-03-02"]
["D04","N","YOU ARE SERVING UNDER AN EXCEPTED SERVICE APPOINTMENT. DURING THE","INITIAL PERIOD OF EMPLOYMENT IN THE EXCEPTED SERVICE, THE RIGHT TO","APPEAL AN ADVERSE ACTION IS LIMITED. UNDER THIS APPOINTMENT THAT","INITIAL PERIOD ENDS ON           ."," "," "," "," "," ","1997-09-01"]
["D05","N","SALARY SHOWN IN BOX 12A AND 20A WAS USED TO PROCESS ASSIGNMENT TO","REVISED AD GRADE AND REPRESENTS BASIC PAY PAID PRIOR TO LAST TEMPORAR","Y     PROMOTION TO A SUPERVISORY OR SENIOR LITIGATION COUNSEL POSITION.","THIS SALARY WILL NOT BE USED TO CALCULATE PAY ENTITLEMENTS."," "," "," "," "," ","1997-09-01"]
["D07","N","EMPLOYEE WILL REMAIN IN TENURE GROUP II UNTIL COMPLETION OF","3-YEAR PROBATIONARY PERIOD WHEN THEY WILL BE CONVERTED TO TENURE","GROUP I."," "," "," "," "," "," ","1992-10-04"]
["D08","N","THIS ACTION IS PROCESSED IN ACCORDANCE WITH THE ASSISTANT ATTORNEY GENER","AL FOR ADMINISTRATION'S MEMORANDUM,SUBJECT:\"DELEGATION OF PERSONNEL MANA","GEMENTAUTHORITY\" DATED MARCH 18, 1998."," "," "," "," "," "," ","1998-03-01"]
["DE0","N","CONGRATULATIONS! THIS BONUS IS AWARDED FOR YOUR PARTICIPATION IN DEA'S","FOREIGN LANGUAGE BONUS PROGRAM.  IT IS COMPUTED ON YOUR BASE SALARY A","S     OF THE LAST FULL PAY PERIOD PRIOR TO THE END OF THE LAST FISCAL YE","AR.      (SEPTEMBER 30TH). COMPUTATION BASED ON TESTED LANGUAGE PROFICIE","NCY AND     CERTIFIED USE IN SERVICE.  RESULTS OF BONUS AND AWARDS COMMI","TTEE REVIEW    AND EVALUATION PRODUCE CERTIFIED BONUS VALUE."," "," "," ","1997-12-01"]
["DIS","N","YOU ARE ELIGIBLE TO APPLY FOR DISABILITY RETIREMENT.","PLEASE CONTACT YOUR AGENCY'S RETIREMENT SECTION","_________________________  PHONE NO._______________."," "," "," "," "," "," ","2003-08-01"]
["DJ1","N","BEGINNING NOVEMBER 1, 1993, PAY PLAN CODE \"GM\" WILL IDENTIFY EMPLOYEES","COVERED  BY THE PMRS TERMINATION PROVISIONS OF PUBLIC LAW 103-89.  A","GM    EMPLOYEE WILL CONTINUE TO BE PAID AT HIS/HER CURRENT RATE OF PAY A","ND WILL  BE ELIGIBLE FOR WITHIN-GRADE INCREASES (WGI'S). THE WAITING PER","IOD         BEGINS OCTOBER 3, 1993."," "," "," "," ","1993-10-01"]
["DJ2","N","BEGINNING NOVEMBER 1, 1993, PAY PLAN CODE \"GM\" WILL IDENTIFY EMPLOYEES","COVERED BY THE PMRS TERMINATION PROVISIONS OF PUBLIC LAW 103-89.  A G","M     EMPLOYEE WILL CONTINUE TO BE PAID AT HIS/HER CURRENT RATE OF PAY A","ND WILL  BE ELIGIBLE FOR WITH-IN GRADE INCREASES (WGI'S).  THE WGI WAITI","NG PERIOD   BEGINS THE DAY THE EMPLOYEE RECEIVED HIS/HER LAST EQUIVALENT","INCREASE."," "," "," ","1993-10-01"]
["DJ3","N","THIS ACTION TERMINATES THE EMPLOYEE'S COVERAGE UNDER THE PROVISIONS OF","PL 103-89 AND THE USE OF THE GM PAY PLAN CODE."," "," "," "," "," "," "," ","1993-10-01"]
["DJ4","N","BEGINNING NOVEMBER 1, 1993, PAY PLAN CODE \"GM\" WILL IDENTIFY EMPLOYEES","COVERED BY THE PMRS TERMINATION PROVISIONS OF PUBLIC LAW 103-89.  A G","M     EMPLOYEE WILL CONTINUE TO BE PAID AT HIS/HER CURRENT RATE OF PAY A","ND WILL  BE ELIGIBLE FOR WITHIN GRADE INCREASES (WGI'S).  SINCE YOUR","SALARY IS AT OR ABOVE THE TOP OF YOUR GRADE, YOU WILL NOT BE","RECEIVING     WGI'S."," "," "," ","1993-10-01"]
["DJ5","N","SALARY IN BLOCK 20 IS \"CONTINUED PAY\" WHICH CONSISTS OF WORLDWIDE/","NATIONWIDE SPECIAL RATE PLUS AN INTERIM GEOGRAPHIC ADJUSTMENT (IGA) O","R     SPECIAL PAY ADJUSTMENT(SPA) FOR LAW ENFORCEMENT OFFICERS.  \"CONTIN","UED PAY\",AND GENERAL PAY INCREASES, ARE AUTHORIZED IN 5 CFR 531.106 AND","531.307. AS A RESULT OF THIS ACTION, BASIC PAY (BLOCK 20A) HAS INCREASED",", HOWEVER, THE CONTINUED RATE (BLOCK 20) REMAINS THE SAME. SALARY IN BLO","SALARY IN BLOCK 20 IS \"CONTINUED PAY\" WHICH CONSISTS OF WORLDWIDE/","NATIONWIDE SPECIAL RATE PLUS AN INTERIM GEOGRAPHIC ADJUSTMENT (IGA) O","R     SPECIAL PAY ADJUSTMENT(SPA) FOR LAW ENFORCEMENT OFFICERS.  \"CONTIN","1995-01-26"]
["DJ7","N","APPOINTMENT IS SUBJECT TO THE COMPLETION OF A ONE-YEAR TRIAL PERIOD","BEGINNING __________.  WHILE SERVING THE TRIAL PERIOD, YOU MAY BE REM","OVED  WITHOUT CAUSE OR THE RIGHT TO APPEAL."," "," "," "," "," "," ","1995-02-05"]
["DJ8","N","THIS TEMPORARY LIMITED APPOINTMENT MEETS THE REQUIREMENTS OF 5 CFR 316.4","01 (A)"," "," "," "," "," "," "," ","1994-11-27"]
["DJ9","N","APPOINTMENT IS SUBJECT TO THE COMPLETION OF A TWO-YEAR TRIAL PERIOD","BEGINNING __________.  WHILE SERVING THE TRIAL PERIOD, YOU MAY BE REM","OVED  WITHOUT CAUSE OR THE RIGHT TO APPEAL."," "," "," "," "," "," ","1995-02-05"]
["E01","N","APPOINTMENT IS INDEFINITE."," "," "," "," "," "," "," "," ","1982-06-28"]
["E03","N","TRIAL PERIOD COMPLETED."," "," "," "," "," "," "," "," ","1981-12-01"]
["E04","N","INITIAL PROBATIONARY PERIOD COMPLETED."," "," "," "," "," "," "," "," ","1981-12-01"]
["E05","N","DATE FOR COMPLETION OF PROBATIONARY OR TRIAL PERIOD HAS BEEN ADJUSTED TO","REFLECT EXCESS TIME IN NONPAY STATUS.  NEW ESTIMATED COMPLETION DATE","IS"," "," "," "," "," "," ","1981-12-01"]
["E06","N","DATE FOR COMPLETION OF PROBATIONARY OR TRIAL PERIOD HAS BEEN ADJUSTED TO","REFLECT CREDIT FOR SERVICE ON INTERMITTENT WORK SCHEDULE. ESTIMATED","COMPLETION DATE IS         ."," "," "," "," "," "," ","1983-12-25"]
["E07","N","YOU WILL BE IN TENURE GROUP II UNTIL YOU COMPLETE THE ONE-YEAR","PROBATIONARY PERIOD THAT BEGAN  / / ; THEN YOU WILL BE CHANGED","BACK TO TENURE GROUP I."," "," "," "," "," "," ","1991-04-07"]
["E14","N","CORRECTION TO SALARY DUE TO RETRO PAY ADJUSTMENT EFFECTIVE 01-14-01."," "," "," "," "," "," "," "," ","2003-08-01"]
["E16","N","YOUR VETERANS PREFERENCE IS NOT APPLICABLE FOR REDUCTION IN FORCE PURPOS","ES."," "," "," "," "," "," "," ","1981-12-01"]
["E18","Y","APPOINTMENT IS SUBJECT TO COMPLETION OF ONE YEAR INITIAL PROBATIONARY","PERIOD BEGINNING *******."," "," "," "," "," "," "," ","1981-12-01"]
["E19","Y","APPOINTMENT IS SUBJECT TO COMPLETION OF ONE YEAR TRIAL PERIOD BEGINNING","*******."," "," "," "," "," "," "," ","1981-12-01"]
["E21","N","YOU ARE SUBJECT TO REGULATIONS GOVERNING CONDUCT AND RESPONSIBILITIES OF","SPECIAL GOVERNMENT EMPLOYEES."," "," "," "," "," "," "," ","1981-12-01"]
["E23","N","VETERAN PREFERENCE IS NOT APPLICABLE TO THE SENIOR EXECUTIVE SERVICE."," "," "," "," "," "," "," "," ","1981-12-01"]
["E24","N","PROBATIONARY PERIOD FOR SES POSITION IS NOT REQUIRED."," "," "," "," "," "," "," "," ","1981-12-01"]
["E25","Y","SUBJECT TO SATISFACTORY COMPLETION OF 1-YEAR SES PROBATIONARY PERIOD","BEGINNING *******"," "," "," "," "," "," "," ","1990-03-25"]
["E37","N","SATISFACTORILY COMPLETED TRAINING PRESCRIBED UNDER OPM-APPROVED TRAINING","AGREEMENT. MEETS BASIC QUALIFICATIONS FOR OTHER POSITIONS IN THIS SER","IES."," "," "," "," "," "," ","1981-12-01"]
["E39","N","EMPLOYEE IS ASSIGNED TO A WORKER-TRAINEE DEVELOPMENTAL POSITION."," "," "," "," "," "," "," "," ","1981-12-01"]
["E44","N","PROBATIONARY PERIOD FOR SUPERVISORY OR MANAGERIAL POSITION NOT REQUIRED."," "," "," "," "," "," "," "," ","1981-12-01"]
["E45","N","PROBATIONARY PERIOD FOR SUPERVISORY OR MANAGERIAL POSITION COMPLETED."," "," "," "," "," "," "," "," ","1981-12-01"]
["E46","Y","SUBJECT TO COMPLETION OF ******* PROBATIONARY PERIOD FOR ASSIGNMENT TO","SUPERVISORY OR MANAGERIAL POSITION BEGINNING *******."," "," "," "," "," "," "," ","1982-09-19"]
["E51","N","EMPLOYEE HAS GUARANTEED PLACEMENT RIGHTS DURING PROBATION."," "," "," "," "," "," "," "," ","1981-12-01"]
["E54","N","EMPLOYEE ELECTS TO CONTINUE APPROPRIATE SES PROVISIONS UNDER 5 USC 3392(","C)."," "," "," "," "," "," "," ","1981-12-01"]
["E56","N","QUALIFIED FOR THIS POSITION ONLY UNDER TRAINING AGREEMENT. NOT ELIGIBLE","FOR OTHER POSITIONS IN THIS SERIES UNTIL SATISFACTORILY COMPLETES","PRESCRIBED TRAINING."," "," "," "," "," "," ","1987-08-12"]
["E58","N","APPT IS ON A PROVISIONAL BASIS. YOU ARE ELIGIBLE FOR RETIREMENT COVERAGE","& FOR FEHB AND FEGLI. IF YOUR PERFORMANCE IS SATISFACTORY, & YOU MEET A","LL    LEGAL QUALIFICATIONS & OTHER APPLICABLE REQMTS, YOU MAY BE CONVERT","ED TO A  NONTEMP APPT BEFORE THIS APPT EXPIRES."," "," "," "," "," ","1991-03-11"]
["EEE","N","SALARY WOULD BE *$________IF NOT LIMITED BY 5 U.S.C. 5308."," "," "," "," "," "," "," "," ","2003-08-01"]
["EM2","N","THIS ACTION IMPLEMENTS THE ERS REORGANIZATION OF 10/01/94."," "," "," "," "," "," "," "," ","1994-10-01"]
["EPP","N","PERFORMANCE PLAN REQUIRED DUE TO:","__________________________________________________________."," "," "," "," "," "," "," ","2003-08-01"]
["FC1","N","THE PROJECTED FULL PERFORMANCE LEVEL FOR THIS POSITION IS        , AND P","ROMOTION(S) UP TO THIS LEVEL MAY BE MADE WITHOUT FURTHER COMPETITION. PR","OMOTION(S) UP TO        QUALIFY AS CAREER LADDER PROMOTION(S)."," "," "," "," "," "," ","1996-04-01"]
["FC2","N","TIME-OFF AWARDS HOURS MUST BE USED WITHIN ONE YEAR"," "," "," "," "," "," "," "," ","1996-01-01"]
["FC3","N","YOUR INITIAL TERM APPOINTMENT IS TO WORK ON AUCTIONS, AND YOUR SALARY IS","FUNDED BY AUCTIONS REIMBURSTMENTS. YOU ARE NOT ELIGIBLE TO APPLY FOR","FCC-  WIDE ANNOUNCED VACANCIES UNLESS IT IS SPECIFICALLY NOTED ON THE VA","CANCY    ANNOUNCMENT THAT IT IS AN AUCTIONS FUNDED POSITION.  YOU ARE EL","IGIBLE TO   APPLY FOR ANY COMMISSION VACANCIES WITH AN \"ALL SOURCES\" ARE","A OF           CONSIDERATION WHICH IS OPEN TO ALL QUALIFIED CANDIDATES B","YOUR INITIAL TERM APPOINTMENT IS TO WORK ON AUCTIONS, AND YOUR SALARY IS","FUNDED BY AUCTIONS REIMBURSTMENTS. YOU ARE NOT ELIGIBLE TO APPLY FOR","FCC-  WIDE ANNOUNCED VACANCIES UNLESS IT IS SPECIFICALLY NOTED ON THE VA","1999-01-01"]
["FC4","N","Auctions Funded Position"," "," "," "," "," "," "," "," ","1900-01-01"]
["FD1","N","IN ACCORDANCE WITH THE 08/08/94 NTEU/FDIC JOINT RELEASE AND RELATED POLI","CY DECISIONS, THIS TIME-LIMITED PROMOTION WILL BE EFFECTIVE THROUGH 03/3","0/96. IF NOT SELECTED FOR A PERMANENT POSITION, THE INCUMBENT MAY RETAIN","THE     SALARY ASSOCIATED WITH THIS TIME-LIMITED PROMOTION THROUGH 01/0","4/97 OR     THROUGH THE END OF THEIR APPOINTMENT WHICHEVER DATE OCCURS F","IRST.  THIS    ASSIGNMENT MAY BE CLASSIFIED AT A LOWER GRADE LEVEL."," "," "," ","1995-10-01"]
["FD2","N","MOBILITY REQUIREMENTS: THE INCUMBENT OF THIS POSITION MAY BE REASSIGNED/","RELOCATED TO ANY GEOGRAPHICAL LOCATION WHERE THE EMPLOYEE'S SERVICES","ARE   NEEDED AS DETERMINED BY MANAGEMENT. EMPLOYEE SIGNED MOBILITY AGREE","MENT     DATED   /  /  ."," "," "," "," "," ","1995-01-22"]
["FD3","N","TO CALCULATE TOTAL COMPENSATION, MULTIPLY    % REMAINING REGIONAL PAY","DIFFERENTIAL TIMES BASIC PAY (BLOCK 20A) AND ADD TO TOTAL SALARY (BLO","CK 20)"," "," "," "," "," "," ","1995-04-30"]
["FD4","N","YOUR PERSONNEL OFFICE IDENTIFIER IN BLOCK 48 HAS CHANGED WITH THIS","PERSONNEL ACTION. YOUR NEW SERVICING PERSONNEL OFFICE IS LOCATED AT:","FEDERAL DEPOSIT INSURANCE CORPORATION","1201 W. PEACHTREE STREET, NE","ATLANTA, GA  30309-3415","(404) 817-2596"," "," "," ","1996-03-31"]
["FD5","N","YOUR PERSONNEL OFFICE IDENTIFIER IN BLOCK 48 HAS CHANGED WITH THIS","PERSONNEL ACTION. YOUR NEW SERVICING PERSONNEL OFFICE IS LOCATED AT:","FEDERAL DEPOSIT INSURANCE CORPORATION","500 W. MONROE","CHICAGO, IL 60661","(312) 382-5788"," "," "," ","1996-03-31"]
["FD6","N","YOUR PERSONNEL OFFICE IDENTIFIER IN BLOCK 48 HAS CHANGED WITH THIS","PERSONNEL ACTION. YOUR NEW SERVICING PERSONNEL OFFICE IS LOCATED AT:","FEDERAL DEPOSIT INSURANCE CORPORATION","1910 PACIFIC AVENUE, SUITE 1300","DALLAS, TX 75201","(214) 965-7933"," "," "," ","1996-03-31"]
["FD7","N","YOUR PERSONNEL OFFICE IDENTIFIER IN BLOCK 48 HAS CHANGED WITH THIS","PERSONNEL ACTION. YOUR NEW SERVICING PERSONNEL OFFICE IS LOCATED AT:","FEDERAL DEPOSIT INSURANCE CORPORATION","101 EAST RIVER DRIVE","EAST HARTFORD, CT 06108","(860) 291-4703"," "," "," ","1996-03-31"]
["FD8","N","YOUR PERSONNEL OFFICE IDENTIFIER IN BLOCK 48 HAS CHANGED WITH THIS","PERSONNEL ACTION. YOUR NEW SERVICING PERSONNEL OFFICE IS LOCATED AT:","FEDERAL DEPOSIT INSURANCE CORPORATION","FOUR PARK PLAZA","IRVINE, CA 92714","(714) 442-1107"," "," "," ","1996-03-31"]
["FD9","N","THE ACTUAL REORGANIZATION OF DIVISION FUNCTIONS OCCURRED ON 12/08/96."," "," "," "," "," "," "," "," ","1997-02-02"]
["FDA","N","THIS ACTION REFLECTS THE CONVERSION FROM GG TO CG PAY PLAN AND THE\tCONVERSION TO AN OPEN RANGE SALARY STRUCTURE."," "," "," "," "," "," "," ","1997-09-14"]
["FDB","N","THIS ACTION REFLECTS THE CONVERSION TO AN OPEN RANGE SALARY STRUCTURE."," "," "," "," "," "," "," "," ","1997-09-14"]
["FDC","N","BLOCK 20A, BASIC PAY, INCLUDES A MERIT INCREASE BASED ON THE 97-98 SUMMA","RY PERFORMANCE RATING.  WHERE APPLICABLE, THIS MERIT INCREASE WAS CALCUL","ATED  AGAINST THE SALARY LEVEL EMPLOYEES WOULD HAVE RECEIVED HAD THE FOR","MER      19-STEP SYSTEM REMAINED IN EFFECT."," "," "," "," "," ","1998-08-02"]
["FDD","N","CHANGES MASTER RECORD & INDIVIDUAL POSITION NUMBERS IN BLOCK #15."," "," "," "," "," "," "," "," ","1999-03-28"]
["FDE","N","CHANGES        TO        ."," "," "," "," "," "," "," "," ","1999-03-28"]
["FDF","N","ADMINISTRATIVE CHANGE ONLY.  TITLE, SERIES, GRADE, SALARY, AND DUTIES","ARE NOT AFFECTED."," "," "," "," "," "," "," ","1999-08-01"]
["FDG","N","YOUR PERSONNEL OFFICE IDENTIFIER IN BLOCK 48 HAS CHANGED WITH THIS","PERSONNEL ACTION.  YOUR NEW SERVICING PERSONNEL OFFICE IS LOCATED AT:","FEDERAL DEPOSIT INSURANCE CORPORATION","OFFICE OF INSPECTOR GENERAL, HUMAN RESOURCES BRANCH","801 17TH STREET, NW, ROOM 904A","WASHINGTON, DC 20434","YOUR PERSONNEL OFFICE IDENTIFIER IN BLOCK 48 HAS CHANGED WITH THIS","PERSONNEL ACTION.  YOUR NEW SERVICING PERSONNEL OFFICE IS LOCATED AT:","FEDERAL DEPOSIT INSURANCE CORPORATION","1999-09-01"]
["FDH","N","PAY ADJUSTED TO BRING BASIC PAY TO THE 2008 SALARY RANGE MINIMUM."," "," "," "," "," "," "," "," ","2008-01-06"]
["FE1","N","FEHB FAMILY COVERAGE REQUIRED BY P.L. 106-394."," "," "," "," "," "," "," "," ","2001-12-30"]
["FE2","N","EMPLOYEE'S FEHB COVERAGE IS NO LONGER SUBJECT TO P.L. 106-394."," "," "," "," "," "," "," "," ","2001-12-30"]
["FGG","N","OPEN SEASON CHANGE"," "," "," "," "," "," "," "," ","2003-08-01"]
["FM1","N","LAST SEVERANCE PAY CHECK WILL BE __/__/__"," "," "," "," "," "," "," "," ","1991-01-13"]
["FM2","N","SEVERANCE PAY ENTITLEMENT TERMINATES UPON REEMPLOYMENT.  IF YOU ARE","EMPLOYED BEFORE YOUR SEVERANCE PAY FUND IS EXHAUSTED, PLEASE NOTIFY","THE PERSONNEL OFFICE."," "," "," "," "," "," ","1991-01-13"]
["G11","N","EMPLOYEE PAID UNDER 5 U.S.C. CHAPTER 81 FROM          THROUGH          .","THE ENTIRE PERIOD SHALL BE CREDITED FOR ALL RIGHTS AND BENEFITS BASED","ON   LENGTH OF SERVICE."," "," "," "," "," "," ","1994-07-15"]
["G29","Y","INTERMITTENT EMPLOYMENT TOTALED ******* HOURS IN WORK STATUS","FROM ******* TO *******."," "," "," "," "," "," "," ","1990-01-28"]
["G30","Y","INTERMITTENT EMPLOYMENT TOTALED ******* HOURS IN PAY STATUS","FROM ******* TO *******."," "," "," "," "," "," "," ","1990-01-28"]
["G31","Y","NONPAY TIME NOT PREVIOUSLY RECORDED IN CALENDAR YEAR *****","TOTALED ******* HOURS."," "," "," "," "," "," "," ","1982-09-19"]
["G33","N","SERVICE CREDIT FOR RETIREMENT, REDUCTION-IN-FORCE, AND LEAVE ACCRUAL","PURPOSES CONTINUES FOR UP TO A MAXIMUM OF SIX MONTHS OF NONPAY STATUS","TIME PER CALENDAR YEAR."," "," "," "," "," "," ","1981-12-01"]
["GP1","N","10% NIGHT RATE"," "," "," "," "," "," "," "," ","2003-10-01"]
["GP2","N","12% NIGHT RATE"," "," "," "," "," "," "," "," ","2003-10-01"]
["GP3","N","11% NIGHT RATE."," "," "," "," "," "," "," "," ","2004-01-11"]
["GP4","N","NIGHT RATE DIFFERENTIAL CHANGED FROM 12% TO 11% EFFECTIVE 01-11-04."," "," "," "," "," "," "," "," ","2004-01-11"]
["GQS","N","NIGHT RATE DIFFERENTIAL CHANGED FROM 14% TO 12% EFFECTIVE 01-14-01."," "," "," "," "," "," "," "," ","2003-08-01"]
["H01","N","RESULT OF THE REORGANIZATION OF THE OFFICE OF HOUSING"," "," "," "," "," "," "," "," ","1995-03-05"]
["H02","N","RESULT OF THE REORGANIZATION OF THE OFFICE OF FAIR HOUSING AND EQUAL","OPPORTUNITY."," "," "," "," "," "," "," ","1995-05-08"]
["H03","N","RESULT OF THE REORGANIZATION OF THE OFFICE OF PUBLIC AND INDIAN HOUSING"," "," "," "," "," "," "," "," ","1995-05-28"]
["H04","N","RESULT OF SUCCESSFUL COMPLETION OF THE SINGLE FAMILY HOUSING TRAINING","PROGRAM."," "," "," "," "," "," "," ","1995-09-01"]
["IN1","N","TO EFFECT THE TRANSFER TO THE DEPARTMENT OF HOMELAND SECURITY (DHS)","EFFECTIVE MARCH 9, 2003, ALL IMMIGRATION AND NATURALIZATION SERVICE","EMPLOYEES ARE TEMPORARILY BEING ASSIGNED TO THE BUREAU OF IMMIGRATION","AND CUSTOMS ENFORCEMENT.  ADDITIONAL ASSIGNMENT ACTIONS WILL BE EFFECTED","AS THE DHS TRANSITION PROGRESSES."," "," "," "," ","2003-02-23"]
["J01","N","INITIAL APPOINTMENT TO A LAW ENFORCEMENT POSITION."," "," "," "," "," "," "," "," ","1995-04-05"]
["J02","N","APPOINTMENT SUBJECT TO SATISFACTORY COMPLETION OF THE INTRODUCTION TO","CORRECTIONAL TECHNIQUES COURSES IN GLYNCO, GEORGIA."," "," "," "," "," "," "," ","1995-04-05"]
["J03","N","APPOINTMENT SUBJECT TO COMPLETION OF SATISFACTORY URINALYSIS RESULTS"," "," "," "," "," "," "," "," ","1995-04-05"]
["J04","N","ASSIGNMENT TO REVISED AD GRADE."," "," "," "," "," "," "," "," ","1997-07-01"]
["J05","N","GRADE BASED ON TOTAL YEARS OF PROFESSIONAL EXPERIENCE."," "," "," "," "," "," "," "," ","1997-07-01"]
["J06","N","BASIC PAY IS GREEN-CIRCLED.  INELIGIBLE FOR INCREASES TO BASIC","PAY."," "," "," "," "," "," "," ","1997-07-01"]
["J07","N","BASIC PAY IS RED-CIRCLED AND EXCEEDS MAXIMUM FOR GRADE."," "," "," "," "," "," "," "," ","1997-07-01"]
["J08","N","BASED ON ANNUAL PAY REVIEW, INCREASE IN GRADE WITH NO INCREASE IN","BASIC PAY."," "," "," "," "," "," "," ","1997-07-01"]
["J09","N","BASED ON ANNUAL PAY REVIEW, INCREASE IN BASIC PAY, NO INCREASE IN","GRADE."," "," "," "," "," "," "," ","1997-07-01"]
["J10","N","BASED ON ANNUAL PAY REVIEW, INCREASE IN GRADE AND BASIC PAY."," "," "," "," "," "," "," "," ","1997-07-01"]
["J11","N","BASED ON ANNUAL PAY REVIEW, NO GRADE OR BASIC PAY INCREASE."," "," "," "," "," "," "," "," ","1997-07-01"]
["J12","N","ACTION CHANGES PERMANENT NON-SUPERVISORY, NON-SENIOR LITIGATION COUNSEL","(SLC) GRADE LEVEL AS A RESULT OF NEW ATTORNEY PAY SYSTEM. MEMORANDUM","OF    UNDERSTANDING RELEVENT TO SUPERVISORY/SLC POSITION REMAINS IN EFFE","T."," "," "," "," "," ","1997-07-01"]
["J13","N","PERFORMANCE BONUS PAID UNDER THE ADMINISTRATIVELY DETERMINED (AD) PAY PL","AN."," "," "," "," "," "," "," ","1998-03-01"]
["J14","N","WELCOME TO THE DEPARTMENT OF JUSTICE"," "," "," "," "," "," "," "," ","1998-10-11"]
["J15","N","CONGRATULATIONS ON YOUR PROMOTION"," "," "," "," "," "," "," "," ","1998-10-11"]
["JM8","N","EMPLOYEE CONVERTED TO CAREER COND BASED UPON NEW AMENDMENT TO THE VETERA","EMPLOYMENT OPPORTUNITIES ACT OF 1998."," "," "," "," "," "," "," ","2003-08-01"]
["K01","N","QUALIFICATION REQUIREMENTS MODIFIED BECAUSE OF GENERAL OPM AMENDMENT."," "," "," "," "," "," "," "," ","1988-01-01"]
["K02","N","QUALIFICATIONS WAIVED PER REG. 351.703."," "," "," "," "," "," "," "," ","1994-07-15"]
["K12","N","SELECTED FROM                      DATED"," "," "," "," "," "," "," "," ","1981-12-01"]
["K13","N","REMOVES TEMPORARY LIMITATION PLACED ON THE LAST ACTION."," "," "," "," "," "," "," "," ","1981-12-01"]
["K16","N","FROM PROMOTION NTE"," "," "," "," "," "," "," "," ","1981-12-01"]
["K17","N","REPROMOTION TO GRADE,LEVEL OR BAND NOT ABOVE THAT FROM WHICH DOWNGRADED","WITHOUT PERSONAL CAUSE AND NOT AT EMPLOYEE'S REQUEST."," "," "," "," "," "," "," ","2006-04-30"]
["K18","N","POSITION IS AT THE FULL PERFORMANCE LEVEL OR BAND."," "," "," "," "," "," "," "," ","2006-04-30"]
["K19","N","SUCCESSOR POSITION - EMPLOYEE RETAINED IN COMPETITIVE SERVICE."," "," "," "," "," "," "," "," ","1981-12-01"]
["K20","N","FULL PERFORMANCE LEVEL OF EMPLOYEE'S POSITION IS           ."," "," "," "," "," "," "," "," ","1994-07-10"]
["K23","N","CHANGE IS A RESULT OF A CHANGE IN CLASSIFICATION STANDARDS"," "," "," "," "," "," "," "," ","1981-12-01"]
["K26","N","RESULT OF ADDITIONAL DUTIES AND RESPONSIBILITIES."," "," "," "," "," "," "," "," ","1981-12-01"]
["K27","N","CHANGE IS A RESULT OF A POSITION REVIEW."," "," "," "," "," "," "," "," ","1981-12-01"]
["K38","N","PROMOTED OR REASSIGNED FROM                 EFFECTIVE"," "," "," "," "," "," "," "," ","1981-12-01"]
["K43","N","RESULT OF FAILURE TO SATISFACTORILY COMPLETE PROBATIONARY PERIOD FOR A","SUPERVISORY OR MANAGERIAL POSITION."," "," "," "," "," "," "," ","1981-12-01"]
["K50","Y","FROM POSITION CHANGE NTE *******"," "," "," "," "," "," "," "," ","1981-12-01"]
["K60","N","ACTION IS IN LIEU OF RIF SEPARATION OF EMPLOYEE RETAINED UNDER TEMPORARY","EXCEPTION."," "," "," "," "," "," "," ","1993-01-24"]
["L99","N","PERFORMANCE BONUS IN ACCORDANCE WITH PAY/PERFORMANCE POLICY FOR SENIOR","EXECUTIVES AT LOC"," "," "," "," "," "," "," ","1992-05-17"]
["LUP","N","POSITION/GRADE/SALARY/LOC/AGENCY CODE REMAINS UNCHANGED"," "," "," "," "," "," "," "," ","2003-08-01"]
["M01","N","APPOINTMENT AFFIDAVIT EXECUTED"," "," "," "," "," "," "," "," ","1981-12-01"]
["M02","N","YOU HAVE REEMPLOYMENT RIGHTS FOR 2 YEARS IN","GRANTED UNDER REG. 352.204 AND OPM LETTER OF"," "," "," "," "," "," "," ","1981-12-01"]
["M04","N","UNDER P.L.96.8, IS ENTITLED TO CONTINUE UNDER FEGLI AND HEALTH BENEFITS.","HAS REEMPLOYMENT RIGHTS IN USDA OR SUCCESSOR AGENCY UPON SEPARATION F","ROM   THE INSTITUTE, SUBJECT TO SUCH TIME PERIOD AND OTHER CONDITIONS AS","THE     PRESIDENT MAY PRESCRIBE."," "," "," "," "," ","1981-12-01"]
["M06","N","REASON FOR TEMPORARY APPOINTMENT:"," "," "," "," "," "," "," "," ","1985-09-01"]
["M08","N","UNIFORMED SERVICES RETIREMENT DATA:"," "," "," "," "," "," "," "," ","1986-09-24"]
["M10","N","OPF MAINTAINED BY"," "," "," "," "," "," "," "," ","1981-12-01"]
["M20","N","ACTION AT EMPLOYEE'S REQUEST."," "," "," "," "," "," "," "," ","1981-12-01"]
["M23","Y","CONTINUES PROMOTION NTE *******"," "," "," "," "," "," "," "," ","1981-12-01"]
["M24","Y","CONTINUES POSITION CHANGE NTE *******."," "," "," "," "," "," "," "," ","1981-12-01"]
["M26","N","EMPLOYEE WAS ADVISED OF OPPORTUNITY TO FILE GRIEVANCE AND ELECTED TO DO","SO."," "," "," "," "," "," "," ","1981-12-01"]
["M27","N","EMPLOYEE WAS ADVISED OF OPPORTUNITY TO FILE GRIEVANCE AND ELECTED NOT TO","DO SO."," "," "," "," "," "," "," ","1981-12-01"]
["M30","N","CHANGE FROM ON-CALL TO YEAR-ROUND EMPLOYMENT."," "," "," "," "," "," "," "," ","1984-03-01"]
["M31","N","VOLUNTARY CHANGE FROM YEAR-ROUND TO ON-CALL EMPLOYMENT."," "," "," "," "," "," "," "," ","1984-03-01"]
["M33","N","ON NONPAY STATUS IN"," "," "," "," "," "," "," "," ","1981-12-01"]
["M34","N","ON PART-TIME OR INTERMITTENT APPOINTMENT IN"," "," "," "," "," "," "," "," ","1981-12-01"]
["M36","N","CONCURRENT EMPLOYMENT:"," "," "," "," "," "," "," "," ","1986-09-24"]
["M37","N","EMPLOYEE FAILED TO MAKE AN ELECTION, COVERAGE IS FERS BY DEFAULT ON","DUE TO PL 106-265 (FERCCA)."," "," "," "," "," "," "," ","2005-03-14"]
["M38","Y","FROZEN SERVICE: ****YRS. ****MOS."," "," "," "," "," "," "," "," ","1986-09-24"]
["M39","Y","CREDITABLE MILITARY SERVICE: ****YRS. ****MOS."," "," "," "," "," "," "," "," ","1986-01-01"]
["M40","N","PREVIOUS RETIREMENT COVERAGE:"," "," "," "," "," "," "," "," ","1986-09-24"]
["M41","N","EMPLOYEE FAILED TO MAKE AN ELECTION, COVERAGE IS CSRS BY DEFAULT ON","DUE TO PL 106-265"," "," "," "," "," "," "," ","2005-03-14"]
["M42","N","APPROVED BY                        ON"," "," "," "," "," "," "," "," ","1981-12-01"]
["M43","N","ERRONEOUS CSRS, SHOULD HAVE BEEN FERS-EMPLOYEE ELECTED CSRS OFFSET","ON             CORRECTION DUE TO P.L. 106-265 (FERCCA)"," "," "," "," "," "," "," ","2005-03-14"]
["M44","N","EMPLOYEE ELECTED COVERAGE UNDER FERS."," "," "," "," "," "," "," "," ","1987-01-01"]
["M45","N","EMPLOYEE IS AUTOMATICALLY COVERED UNDER FERS."," "," "," "," "," "," "," "," ","1987-05-24"]
["M46","N","EMPLOYEE IS COVERED UNDER FERS BECAUSE OF PREVIOUS ELECTION."," "," "," "," "," "," "," "," ","1988-01-01"]
["M47","N","ERRONEOUS CSRS, SHOULD HAVE BEEN FERS-EMPLOYEE ELECTED FERS ON","CORRECTION DUE TO P.L. 106-265 (FERCCA)"," "," "," "," "," "," "," ","2005-03-14"]
["M48","N","ERRONEOUS CSRS OFFSET, SHOULD HAVE BEEN FERS - EMPLOYEE ELECTED TO","REMAIN IN CSRS OFFSET ON     CORRECTION DUE TO PL 106-265 (FERCCA)."," "," "," "," "," "," "," ","2005-03-14"]
["M49","N","ERRONEOUS CSRS OFFSET, SHOULD HAVE BEEN FERS - EMPLOYEE ELECTED FERS ON","CORRECTION DUE TO PL 106-265 (FERCCA)."," "," "," "," "," "," "," ","2005-03-14"]
["M50","Y","ERRONEOUS CSRS, SHOULD HAVE BEEN SOCIAL SECURITY ONLY -EMPLOYEE ELECTED","CSRS OFFSET ON                 CORRECTION DUE TO PL 106-265 (FERCCA)."," "," "," "," "," "," "," ","2005-03-14"]
["M51","N","ERRONEOUS CSRS, SHOULD HAVE BEEN SOCIAL SECURITY ONLY- EMPLOYEE ELECTED","SOCIAL SECURITY ONLY ON           , CORRECTION DUE TO PL 106-265 (FERCCA"," "," "," "," "," "," "," ","2005-03-14"]
["M52","N","EMPLOYEE DECLINED CONVERSION TO THE SENIOR EXECUTIVE SERVICE AND CONTINU","ES UNDER                     WITH ALL ASSOCIATED RIGHTS AND BENEFITS."," "," "," "," "," "," "," ","1981-12-01"]
["M53","N","EMPLOYEE IS TO SUFFER NO LOSS OF OR REDUCTION IN: PAY, LEAVE, CREDIT FOR","TIME OR SERVICE, OR PERFORMANCE OR EFFICIENCY RATING."," "," "," "," "," "," "," ","1981-12-01"]
["M54","N","ERRONEOUS CSRS OFFSET, SHOULD HAVE BEEN SOCIAL SECURITY ONLY - EMPLOYEE","ELECTED TO REMAIN IN CSRS OFFSET ON       , CORRECTION DUE TO PL 106-265"," "," "," "," "," "," "," ","2005-03-14"]
["M55","N","ERRONEOUS CSRS OFFSET, SHOULD HAVE BEEN SOCIAL SECURITY ONLY - EMPLOYEE","ELECTED SOCIAL SECURITY ONLY ON          ,DUE TO PL 106-265 (FERCCA)"," "," "," "," "," "," "," ","2005-03-14"]
["M56","N","ERRONEOUS FERS, SHOULD HAVE BEEN CSRS - EMPLOYEE ELECTED TO REMAIN IN","FERS ON     , CORRECTION DUE TO PL 106-265 (FERCCA)."," "," "," "," "," "," "," ","2005-03-14"]
["M57","N","ERRONEOUS FERS, SHOULD HAVE BEEN CSRS - EMPLOYEE ELECTED CSRS ON",", CORRECTION DUE TO PL 106-265 (FERCCA)."," "," "," "," "," "," "," ","2005-03-14"]
["M58","N","NO SES REINSTATEMENT RIGHTS."," "," "," "," "," "," "," "," ","1981-12-01"]
["M59","N","ERRONEOUS FERS, SHOULD HAVE BEEN CSRS OFFSET - EMPLOYEE ELECTED TO","REMAIN IN FERS ON      , CORRECTION DUE TO PL 106-265 (FERCCA)."," "," "," "," "," "," "," ","2005-03-14"]
["M60","N","INFORMATION ON POSSIBLE 5 U.S.C. CHAPTER 83, SUBCHAPTER II, CASE MAY BE","OBTAINED FROM:"," "," "," "," "," "," "," ","1981-12-01"]
["M61","N","POSSIBLE 5 U.S.C CHAPTER 83, SUBCHAPTER II, CASE."," "," "," "," "," "," "," "," ","1981-12-01"]
["M62","N","YOU HAVE REEMPLOYMENT RIGHTS IN THIS AGENCY UNDER 5 USC 3582 PROVIDED","SEPARATION IS NO LATER THAN            AFTER THE DATE OF ENTRY ON DUT","Y     IN                      AND YOU APPLY TO THIS AGENCY WITHIN 90 DAY","S FROM   DATE OF YOUR SEPARATION."," "," "," "," "," ","1981-12-01"]
["M63","N","ERRONEOUS FERS, SHOULD HAVE BEEN CSRS OFFSET - EMPLOYEE ELECTED CSRS","OFFSET ON               , CORRECTION DUE TO PL 106-265 (FERCCA)"," "," "," "," "," "," "," ","2005-03-14"]
["M64","N","YOU HAVE REEMPLOYMENT RIGHTS IN                 FOR","UNDER"," "," "," "," "," "," "," ","1981-12-01"]
["M65","N","ERRONEOUS FERS, SHOULD HAVE BEEN SOCIAL SECURITY ONLY - EMPLOYEE ELECTED","TO REMAIN IN FERS ON        , CORRECTION DUE TO PL 106-265 (FERCCA)."," "," "," "," "," "," "," ","2005-03-14"]
["M66","N","ERRONEOUS FERS, SHOULD HAVE BEEN SOCIAL SECURITY ONLY - EMPLOYEE ELECTED","SOCIAL SECURITY ONLY ON    , CORRECTION DUE TO PL 106-265 (FERCCA)."," "," "," "," "," "," "," ","2005-03-14"]
["M67","N","FORWARDING ADDRESS=","           :"," "," "," "," "," "," "," ","1980-01-01"]
["M68","N","CORRECTION IS THE RESULT OF CORRECTION MADE UNDER PL 106-265 (FERCCA)."," "," "," "," "," "," "," "," ","2005-03-14"]
["M71","N","REASON FOR PLACEMENT IN NONPAY STATUS:"," "," "," "," "," "," "," "," ","1982-05-17"]
["M72","N","REASON FOR FURLOUGH:"," "," "," "," "," "," "," "," ","1981-12-01"]
["M73","N","TO BE FURLOUGHED ON (                    ), FOR TOTAL OF (      ) HOURS."," "," "," "," "," "," "," "," ","1982-10-31"]
["M74","N","CHANGES DATA ELEMENT(S) IN BLOCK(S)"," "," "," "," "," "," "," "," ","1981-12-01"]
["M75","N","CHANGES DATA ELEMENTS IN BLOCK 37"," "," "," "," "," "," "," "," ","1997-08-31"]
["M76","N","REQUESTED, IN LIEU OF ANNUAL LEAVE, AFTER DECLINING OFFER OF"," "," "," "," "," "," "," "," ","1982-10-31"]
["M78","N","REALIGNMENT REFLECTS A CHANGE FROM THE SOUTH CENTRAL REGION TO THE","MID-ATLANTIC REGION."," "," "," "," "," "," "," ","1981-12-01"]
["M79","N","CHANGES POSITION SENSITIVITY (BLOCK 4) IN POSITION MANAGEMENT SYSTEM."," "," "," "," "," "," "," "," ","1998-05-24"]
["M80","N","VARIATIONS UNDER CS RULE 5 APPROVED BY OPM         ."," "," "," "," "," "," "," "," ","1982-09-19"]
["M81","N","CODE S IN BLOCK 32 INDICATES A PART-TIME EMPLOYEE WHO IS JOB SHARING"," "," "," "," "," "," "," "," ","1990-03-26"]
["M82","N","CODE T IN BLOCK 32 INDICATES A SEASONAL EMPLOYEE, WITH A PART-TIME","SCHEDULE, WHO IS JOB SHARING"," "," "," "," "," "," "," ","1990-03-26"]
["M83","N","THE 3-YEAR LIMIT ON ELIGIBILITY FOR REINSTATEMENT IS EXTENDED BY THE","PERIOD YOU SERVE ON EXECPTED, SES, TERM, OR TEMPORARY APPOINTMENT."," "," "," "," "," "," "," ","1992-08-23"]
["M85","N","YOU ARE SCHEDULED TO WORK A MINIMUM OF (    ) HOURS PER WEEK;","ADDITIONAL HOURS MAY BE SCHEDULED WHEN NEEDED TO COMPLETE ASSIGNMENTS","."," "," "," "," "," "," ","1992-10-18"]
["M90","N","EMPLOYEE RETAINED, ON ACCRUED ANNUAL LEAVE NTE   /  /  ,PAST RIF SEPARAT","ION OF   /  /   TO ESTABLISH ELIGIBILITY FOR ("," ","."," "," "," "," "," ","1993-10-08"]
["M91","N","EMPLOYEE RETAINED ON SICK LEAVE PAST RIF SEPARATION DATE OF   /  /  ."," "," "," "," "," "," "," "," ","1993-10-08"]
["M92","N","EMPLOYEE RETAINED PAST RIF EFFECTIVE DATE OF   /  /  TO ("," ",")."," "," "," "," "," "," ","1993-01-24"]
["M93","N","EMPLOYEE RETAINED UNDER AUTHORITY OF LIQUIDATION PROVISIONS PRIOR TO","COMPLETION OF LIQUIDATION ON RIF SEPARATION DATE OF   /  /  ."," "," "," "," "," "," "," ","1993-10-08"]
["M94","N","EMPLOYEE ELECTED DEEMED FERS COVERAGE UNDER 5 CFR 846.204 (B)(2)(I) ON"," "," "," "," "," "," "," "," ","2002-01-11"]
["M95","N","EMPLOYEE GIVEN DEEMED FERS ELECTION NOTICE ON         , AND DID NOT","RESPOND.  EMPLOYEE IS DEEMED TO HAVE ELECTED FERS COVERAGE UNDER","5 CFR 846.204 (B)(2)(I)."," "," "," "," "," "," ","2002-01-11"]
["M96","N","EMPLOYEE DECLINED FERS COVERAGE UNDER 5 CFR 846.204 (B)(2)(II) ON"," "," "," "," "," "," "," "," ","2002-01-11"]
["M97","N","SES MEMBER SUBJECT TO POST EMPLOYMENT RESTRICTIONS UNDER","18 U.S.C. 207(C)(2)(A)."," "," "," "," "," "," "," ","2004-01-11"]
["MIL","N","THE AGENCY IS NOT PAYING THE EMPLOYEE'S SHARE OF FEHB PREMIUMS. THE","EMPLOYEE MUST MAKE ARRANGEMENTS WITH THE AGENCY FOR PAYMENT AS A BILL","WILL BE GENERATED UPON THE EMPLOYEE'S RETURN TO DUTY STATUS"," "," "," "," "," "," ","2002-08-25"]
["MOM","N","SIDE ISSUE PAY MEMO APPROVED 08-06-1991."," "," "," "," "," "," "," "," ","2003-08-01"]
["N10","N","TO (OR EXPECTED TO) BE PAID UNDER 5 U.S.C CHAPTER 81."," "," "," "," "," "," "," "," ","1979-12-01"]
["N11","N","EMPLOYEE IS ENTITLED TO 45 CALENDAR DAYS OF CONTINUATION OF REGULAR PAY","UNDER 5 U.S.C., CHAPTER 81, SECTION 8118."," "," "," "," "," "," "," ","1986-03-11"]
["N12","N","EXPECTED TO BE PAID UNDER 5 U.S.C. CHAPTER 81 FOLLOWING 45 CALENDAR DAYS","COP PERIOD."," "," "," "," "," "," "," ","1986-03-11"]
["N20","N","SEVERANCE PAY PAYMENTS TO BE RESUMED BY"," "," "," "," "," "," "," "," ","1981-12-01"]
["N21","N","SEVERANCE PAY TO BE RECOMPUTED BY"," "," "," "," "," "," "," "," ","1981-12-01"]
["N22","N","ENTITLED TO          SEVERANCE PAY FUND TO BE PAID AT THE RATE OF","PER WEEK OVER     WEEKS BEGINNING"," "," "," "," "," "," "," ","1981-12-01"]
["N23","N","NOT ENTITLED TO SEVERANCE PAY."," "," "," "," "," "," "," "," ","1981-12-01"]
["N24","N","SEVERANCE PAY SUSPENDED BY       UNTIL TERMINATION OF THIS APPOINTMENT."," "," "," "," "," "," "," "," ","1981-12-01"]
["N25","N","SEVERANCE PAY DISCONTINUED.  EMPLOYEE HAS RECEIVED         WEEKS OF","SEVERANCE PAY."," "," "," "," "," "," "," ","1981-12-01"]
["N26","N","LUMP-SUM PAYMENT TO COVER          HOURS ENDING"," "," "," "," "," "," "," "," ","1981-12-01"]
["N27","N","LUMP-SUM PAYMENT TO BE MADE FOR ANY UNUSED ANNUAL LEAVE."," "," "," "," "," "," "," "," ","1982-06-01"]
["N30","N","THIS ACTION RECORDS TOTAL AMOUNT RECEIVED UNDER PRODUCTIVITY","GAINSHARING AWARD PROGRAM DURING FY__."," "," "," "," "," "," "," ","1988-07-03"]
["N31","N","FOR ADOPTION OF SUGGESTION NUMBER"," "," "," "," "," "," "," "," ","1991-04-07"]
["N32","N","FOR ADOPTION OF INVENTION NUMBER"," "," "," "," "," "," "," "," ","1991-04-07"]
["N33","N","FOR PATENT NO.                      ."," "," "," "," "," "," "," "," ","1994-07-15"]
["N59","N","OPF RETAINED BY"," "," "," "," "," "," "," "," ","1981-12-01"]
["N60","N","THIS ACTION RECORDS TOTAL TIME OFF HOURS USED DURING THE CURRENT LEAVE","YEAR."," "," "," "," "," "," "," ","1991-09-22"]
["N61","N","PER REG. 531.203(D)(2)(VI), THE RATE RECEIVED SOLELY DURING PERIOD OF","INTERIM WGI MAY NOT BE USED TO ESTABLISH HIGHEST PREVIOUS RATE."," "," "," "," "," "," "," ","1992-08-23"]
["NPF","N","AGENCY CANNOT PAY FEHB. EMPLOYEE WILL BE BILLED UPON RETURN FROM","MILITARY FURLOUGH."," "," "," "," "," "," "," ","2002-07-14"]
["OFF","N","THE CALCULATED HOURLY RATE TO BE USED FOR PAYMENT OF OFF-SET MILITARY","LEAVE IS (*$ ___.__) AS OF @        @."," "," "," "," "," "," "," ","2005-06-12"]
["P01","N","PREVIOUSLY EMPLOYED AT"," "," "," "," "," "," "," "," ","1981-12-01"]
["P02","N","PAY RATE FIXED TO INCLUDE RATE INCREASE DUE ON SAME DATE."," "," "," "," "," "," "," "," ","1981-12-01"]
["P03","N","PAY RATE SHOWN IS SUBJECT TO UPWARD RETROACTIVE ADJUSTMENT UPON","VERIFICATION OF PRIOR SERVICE."," "," "," "," "," "," "," ","1981-12-01"]
["P04","N","PAY SET USING THE SUPERIOR QUALIFICATIONS AND SPECIAL NEEDS PAY-SETTING","AUTHORITY UNDER 5 CFR 531.212."," "," "," "," "," "," "," ","2007-12-23"]
["P05","N","SPECIAL RATE UNDER 5 USC 5305."," "," "," "," "," "," "," "," ","1992-03-08"]
["P06","N","PAY RATE INCLUDES RATE CHANGES (E.G., WITHIN-GRADE INCREASES) OR OTHER","RATE CHANGES TO WHICH EMPLOYEE WOULD HAVE BEEN ENTITLED HAD HE/SHE","REMAINED CONTINUOUSLY IN FEDERAL SERVICE."," "," "," "," "," "," ","2006-04-30"]
["P08","N","ANNUAL SALARY TO BE REDUCED BY THE AMOUNT OF YOUR RETIREMENT ANNUITY AND","BY FUTURE COST OF LIVING INCREASES."," "," "," "," "," "," "," ","1981-12-01"]
["P09","N","PAY OR STEP ADJUSTED          BY"," "," "," "," "," "," "," "," ","1981-12-01"]
["P10","Y","ANNUITY AT PRESENT IS *******PA."," "," "," "," "," "," "," "," ","1981-12-01"]
["P11","N","SALARY WOULD BE $           IF NOT LIMITED BY 5 USC 5308 OR OTHER","STATUTORY AUTHORITY."," "," "," "," "," "," "," ","1981-12-01"]
["P12","N","ELIGIBILITY DATE FOR WITHIN GRADE INCREASE ADJUSTED TO REFLECT EXCESS","TIME IN NON-PAY STATUS. NEW ESTIMATED ELIGIBILITY DATE IS"," "," "," "," "," "," "," ","1981-12-01"]
["P13","N","EFFECTIVE DATE ADJUSTED DUE TO EXCESS TIME IN NONPAY STATUS OF","HOURS."," "," "," "," "," "," "," ","1983-08-21"]
["P14","N","WORK PERFORMANCE IS AT AN ACCEPTABLE LEVEL OF COMPETENCE."," "," "," "," "," "," "," "," ","1983-04-17"]
["P15","N","WITHIN GRADE INCREASE TO STEP    DENIED BECAUSE YOUR WORK IS NOT AT AN","ACCEPTABLE LEVEL OF COMPETENCE. YOU REMAIN AT GS   , STEP"," "," "," "," "," "," "," ","1981-12-01"]
["P16","N","MET ALL REQUIREMENTS FOR WGI TO          ON          DUE ON"," "," "," "," "," "," "," "," ","1981-12-01"]
["P17","Y","ENTITLED TO RETAINED OR SAVED RATE OF PAY UNTIL ******** OTHERWISE","PAY WOULD BE ******** ********."," "," "," "," "," "," "," ","1982-06-01"]
["P18","Y","RETAINED RATE PERIOD EXPIRES ******* EFFECTIVE          PAY WILL BE"," "," "," "," "," "," "," "," ","1981-12-01"]
["P19","N","SALARY INCLUDES WGI FOR WHICH EMPLOYEE BECAME ELIGIBLE ON              ."," "," "," "," "," "," "," "," ","1984-10-01"]
["P20","N","POSITION & PAY REFLECT THE FOLLOWING ACTIONS EFFECTIVE DURING EMPLOYEE'S","ABSENCE"," "," "," "," "," "," "," ","1985-09-01"]
["P21","Y","SALARY INCLUDES MERIT INCREASE OF $*******."," "," "," "," "," "," "," "," ","1981-12-01"]
["P22","N","SALARY INCLUDES A ZERO MERIT INCREASE."," "," "," "," "," "," "," "," ","1981-12-01"]
["P26","N","PAYABLE SALARY LIMITED TO $ 110,700   BY 5 USC 5303(F)"," "," "," "," "," "," "," "," ","1998-01-04"]
["P30","N","ELIGIBILITY DATE FOR WGI HAS BEEN ADJUSTED TO REFLECT CREDIT FOR SERVICE","ON INTERMITTENT WORK SCHEDULE.  ESTIMATED ELIGIBILITY DATE IS       ."," "," "," "," "," "," "," ","1983-12-25"]
["P48","N","SALARY MAY NOT BE REDUCED BELOW SALARY EARNED IMMEDIATELY PRIOR TO SES","CONVERSION WITH ANY FUTURE INVOLUNTARY ACTION WHILE CONTINUOUSLY EMPL","OYED."," "," "," "," "," "," ","1981-12-01"]
["P50","N","EXCEPTION FROM THE REDUCTION IN MILITARY RETIRED PAY PROVISIONS OF (ENTE","R: 5 USC 5332(B) OR 5 USC 5532(C) APPROVED BY OPM UNDER 5 U.S.C. 5532(G)","ON"," "," "," "," "," "," ","1992-08-23"]
["P54","N","SUPERIOR QUALIFICATIONS APPOINTMENT MADE UNDER 35 CFR 251.42"," "," "," "," "," "," "," "," ","1989-06-05"]
["P55","N","SPECIAL RATE UNDER 35 CFR 251.42"," "," "," "," "," "," "," "," ","1989-06-05"]
["P66","N","SALARY BLOCK CONTAINS CASH AWARD AMOUNT."," "," "," "," "," "," "," "," ","1985-09-15"]
["P70","Y","SALARY IN BLOCK 20 INCLUDES RETENTION ALLOWANCE OF $**********"," "," "," "," "," "," "," "," ","1991-04-07"]
["P71","Y","SALARY IN BLOCK 20 INCLUDES STAFFING DIFFERENTIAL OF $**********"," "," "," "," "," "," "," "," ","1991-04-07"]
["P72","Y","SALARY IN BLOCK 20 INCLUDES SUPERVISORY DIFFERENTIAL OF $**********"," "," "," "," "," "," "," "," ","1991-04-07"]
["P73","N","BLOCK 20 SHOWS THE PERCENT OF YOUR RATE OF ADJUSTED BASIC PAY WHICH IS","PAID TO YOU FOR THE SUBSTANTIAL, IRREGULAR OVERTIME WORK YOU PERFORM","WHICH CANNOT BE CONTROLLED ADMINISTRATIVELY."," "," "," "," "," "," ","1991-04-07"]
["P78","Y","SALARY IN BLOCK 12 INCLUDES RETENTION ALLOWANCE OF $**********"," "," "," "," "," "," "," "," ","1991-04-07"]
["P79","Y","SALARY IN BLOCK 12 INCLUDES STAFFING DIFFERENTIAL OF $**********"," "," "," "," "," "," "," "," ","1991-04-07"]
["P80","Y","SALARY IN BLOCK 12 INCLUDES SUPERVISORY DIFFERENTIAL OF $**********"," "," "," "," "," "," "," "," ","1991-04-07"]
["P81","Y","SALARY IN BLOCK 20 INCLUDES AUO OF $**********"," "," "," "," "," "," "," "," ","1991-04-07"]
["P82","Y","SALARY IN BLOCK 12 INCLUDES AUO OF $**********"," "," "," "," "," "," "," "," ","1991-04-07"]
["P83","N","MAXIMUM LOCALITY RATE OF PAY IS LIMITED TO $142,500 BY 5 U.S.C.","5304(G)(2)."," "," "," "," "," "," "," ","2003-05-18"]
["P85","Y","AMOUNT IN BLOCK 20-B INCLUDES THE SPECIAL PAY ADJUSTMENT FOR LAW ENFORCE","-  MENT OFFICERS OF $**********."," "," "," "," "," "," "," ","1993-10-08"]
["P86","N","CORRECTS ITEMS 20, 20A, 20B, 20C, AND IF APPLICABLE, 20D TO REFLECT","THE RETROACTIVE PAY INCREASE AUTHORIZED BY EXECUTIVE ORDER 13332."," "," "," "," "," "," "," ","2004-01-11"]
["P88","N","CORRECTS ITEMS 20, 20B, 20C, AND IF APPLICABLE, 20D TO REFLECT THE","RETROACTIVE LOCALITY PAY INCREASE AUTHORIZED BY EXECUTIVE ORDER 13291.","SOME EMPLOYEES MAY NOT HAVE CHANGES DUE TO A HIGHER PAY ENTITLEMENT","(E.G., SPECIAL RATE EMPLOYEES, LEO GEOGRAPHIC ADJUSTMENT, ETC.)"," "," "," "," "," ","2003-01-12"]
["P90","N","YOU ARE REQUIRED TO SUBMIT TO THE PERSONNEL OFFICE A COPY OF ANY","SUBSEQUENT NOTICE FROM OPM OF ANY CHANGE IN YOUR GROSS ANNUITY RATE."," "," "," "," "," "," "," ","1992-01-10"]
["P91","N","WITHIN-GRADE INCREASE DENIED BECAUSE YOUR WORK IS NOT AT AN ACCEPTABLE","LEVEL OF COMPETENCE. YOUR SALARY DOES NOT CHANGE."," "," "," "," "," "," "," ","1994-04-03"]
["P92","Y","SALARY INCLUDES A LOCALITY-BASED PAYMENT OF ********%."," "," "," "," "," "," "," "," ","1993-12-12"]
["P93","N","SPECIAL SALARY RATE EXCEEDS THE LOCALITY RATE OF PAY, SO EMPLOYEE","RECEIVES NO LOCALITY PAYMENT."," "," "," "," "," "," "," ","1993-12-12"]
["P95","N","SPECIAL ADJUSTED RATE FOR LAW ENFORCEMENT OFFICERS EXCEEDS LOCALITY RATE","OF PAY, SO EMPLOYEE RECEIVES NO LOCALITY PAYMENT."," "," "," "," "," "," "," ","1993-12-12"]
["P96","N","IGA CONTINUED RATE OF PAY CONTINUES UNTIL ONE OF THE TERMINATING CONDITI","ONSOF 5 CFR 531.703(G) IS SATISFIED I.E., THE EMPLOYEE'S DUTY STATION IS","NO   LONGER IN AN INTERIM GEOGRAPHIC ADJUSTMENT AREA; THE EMPLOYEE IS N","O LONGER IN A POSITION COVERED BY A NATIONWIDE OR WORLDWIDE SPECIAL SALA","RY RATE; THEEMPLOYEE IS ENTITLED TO A HIGHER RATE OF PAY UNDER ANOTHER A","UTHORITIY; OR  THE EMPLOYEE IS REDUCED IN GRADE."," "," "," ","1997-02-02"]
["P97","N","THIS ACTION TERMINATES YOUR IGA CONTINUED RATE OF PAY ."," "," "," "," "," "," "," "," ","1997-02-02"]
["P98","Y","SALARY IN BLOCK 12 INCLUDES AVAILABILITY PAY OF $*********."," "," "," "," "," "," "," "," ","1994-10-30"]
["P99","Y","SALARY IN BLOCK 20 INCLUDES AVAILABILITY PAY OF $*********."," "," "," "," "," "," "," "," ","1994-10-30"]
["R01","N","RESIGNED BECAUSE"," "," "," "," "," "," "," "," ","1985-03-01"]
["R02","N","RESIGNED BECAUSE"," "," "," "," "," "," "," "," ","1985-03-01"]
["R03","N","RESIGNED BECAUSE"," "," "," "," "," "," "," "," ","1985-03-01"]
["R04","N","RESIGNED BECAUSE"," "," "," "," "," "," "," "," ","1985-03-01"]
["R05","N","RESIGNED BECAUSE"," "," "," "," "," "," "," "," ","1985-03-01"]
["R06","N","RESIGNED BECAUSE"," "," "," "," "," "," "," "," ","1985-03-01"]
["R07","N","RESIGNED BECAUSE"," "," "," "," "," "," "," "," ","1985-03-01"]
["R08","N","RESIGNED BECAUSE"," "," "," "," "," "," "," "," ","1985-03-01"]
["R09","N","RESIGNED BECAUSE"," "," "," "," "," "," "," "," ","1985-03-01"]
["R10","N","RESIGNED BECAUSE"," "," "," "," "," "," "," "," ","1985-03-01"]
["R11","N","RESIGNED BECAUSE"," "," "," "," "," "," "," "," ","1985-03-01"]
["R12","N","RESIGNED BECAUSE"," "," "," "," "," "," "," "," ","1985-03-01"]
["R13","N","RESIGNED BECAUSE"," "," "," "," "," "," "," "," ","1985-03-01"]
["R14","N","RESIGNED BECAUSE"," "," "," "," "," "," "," "," ","1985-03-01"]
["R15","N","RESIGNED BECAUSE"," "," "," "," "," "," "," "," ","1985-03-01"]
["R16","N","RESIGNED BECAUSE"," "," "," "," "," "," "," "," ","1985-03-01"]
["R17","N","RESIGNED BECAUSE"," "," "," "," "," "," "," "," ","1985-03-01"]
["R18","N","RESIGNED BECAUSE"," "," "," "," "," "," "," "," ","1985-03-01"]
["R19","N","REASON FOR RESIGNATION:"," "," "," "," "," "," "," "," ","1981-12-01"]
["R20","N","REASON FOR RETIREMENT: TO OBTAIN RETIREMENT BENEFITS"," "," "," "," "," "," "," "," ","1986-10-08"]
["R21","N","REASON FOR RETIREMENT:"," "," "," "," "," "," "," "," ","1981-12-01"]
["R22","N","ELECTED TO RECEIVE WORKERS' COMPENSATION IN LIEU OF A RETIREMENT ANNUITY","."," "," "," "," "," "," "," ","1986-10-08"]
["R47","N","RETAINED GRADE WILL NOT BE USED FOR PURPOSES OF REDUCTION IN FORCE."," "," "," "," "," "," "," "," ","1981-06-01"]
["R52","N","REASON(S) FOR DECLINATION OF ASSIGNMENT:"," "," "," "," "," "," "," "," ","1981-12-01"]
["R53","N","REASON(S) FOR DECLINATION OF RELOCATION:"," "," "," "," "," "," "," "," ","1981-12-01"]
["R55","N","REFUSED JOB OFFER BECAUSE:"," "," "," "," "," "," "," "," ","1982-09-19"]
["S20","N","EMPLOYEE ABANDONED POSITION"," "," "," "," "," "," "," "," ","1982-09-19"]
["S23","N","AGENCY FINDING: NO OTHER INFORMATION AVAILABLE."," "," "," "," "," "," "," "," ","1981-12-01"]
["S24","N","AGENCY FINDING:"," "," "," "," "," "," "," "," ","1981-12-01"]
["S25","N","AGENCY FINDING:"," "," "," "," "," "," "," "," ","1981-12-01"]
["S28","N","AGENCY FINDING: RESIGNED AFTER RECEIVING WRITTEN NOTICE ON","OF DECISION TO SEPARATE FOR"," "," "," "," "," "," "," ","1981-12-01"]
["S29","N","AGENCY FINDING: RESIGNED AFTER RECEIVING WRITTEN NOTICE ON","OF DECISION TO DEMOTE FOR"," "," "," "," "," "," "," ","1981-12-01"]
["S30","N","AGENCY FINDING: RESIGNED AFTER RECEIVING WRITTEN NOTICE ON","OF DECISION TO SUSPEND FOR"," "," "," "," "," "," "," ","1981-12-01"]
["S31","N","AGENCY FINDING: RESIGNED AFTER RECEIVING WRITTEN NOTICE ON          OF","PROPOSAL TO SEPARATE FOR"," "," "," "," "," "," "," ","1982-06-28"]
["S32","N","AGENCY FINDING: RESIGNED AFTER RECEIVING WRITTEN NOTICE ON          OF","PROPOSAL TO DEMOTE FOR"," "," "," "," "," "," "," ","1981-12-01"]
["S33","N","AGENCY FINDING: RESIGNED AFTER RECEIVING WRITTEN NOTICE ON          OF","PROPOSAL TO SUSPEND FOR"," "," "," "," "," "," "," ","1981-12-01"]
["S34","N","AGENCY FINDING: RETIRED AFTER RECEIVING WRITTEN NOTICE ON          OF","DECISION TO SEPARATE FOR"," "," "," "," "," "," "," ","1982-06-28"]
["S35","N","AGENCY FINDING: RETIRED AFTER RECEIVING WRITTEN NOTICE ON          OF","DECISION TO DEMOTE FOR"," "," "," "," "," "," "," ","1981-12-01"]
["S36","N","AGENCY FINDING: RETIRED AFTER RECEIVING WRITTEN NOTICE ON          OF","DECISION TO SUSPEND FOR"," "," "," "," "," "," "," ","1981-12-01"]
["S37","N","AGENCY FINDING: RETIRED AFTER RECEIVING WRITTEN NOTICE ON          OF","PROPOSAL TO SEPARATE FOR"," "," "," "," "," "," "," ","1981-12-01"]
["S38","N","AGENCY FINDING: RETIRED AFTER RECEIVING WRITTEN NOTICE ON          OF","PROPOSAL TO DEMOTE FOR"," "," "," "," "," "," "," ","1981-12-01"]
["S39","N","AGENCY FINDING: RETIRED AFTER RECEIVING WRITTEN NOTICE ON          OF","PROPOSAL TO SUSPEND FOR"," "," "," "," "," "," "," ","1981-12-01"]
["S40","N","AGENCY FINDING: TERMINATED AFTER RECEIVING WRITTEN NOTICE ON          OF","PROPOSAL TO SUSPEND FOR"," "," "," "," "," "," "," ","1981-12-01"]
["S41","N","AGENCY FINDING: TERMINATED AFTER RECEIVING WRITTEN NOTICE ON          OF","PROPOSAL TO DEMOTE FOR"," "," "," "," "," "," "," ","1981-12-01"]
["S42","N","AGENCY FINDING: TERMINATED AFTER RECEIVING WRITTEN NOTICE ON          OF","PROPOSAL TO SEPARATE FOR"," "," "," "," "," "," "," ","1982-09-19"]
["S43","N","AGENCY FINDING: TERMINATED AFTER RECEIVING WRITTEN NOTICE ON          OF","DECISION TO SUSPEND FOR"," "," "," "," "," "," "," ","1982-06-28"]
["S44","N","AGENCY FINDING: TERMINATED AFTER RECEIVING WRITTEN NOTICE ON          OF","DECISION TO DEMOTE FOR"," "," "," "," "," "," "," ","1982-09-19"]
["S45","N","AGENCY FINDING: TERMINATED AFTER RECEIVING WRITTEN NOTICE ON          OF","DECISION TO SEPARATE FOR"," "," "," "," "," "," "," ","1982-06-28"]
["S46","N","SEPARATED BY ORDER OF OFFICE OF PERSONNEL MANAGEMENT DATED          FOR","VIOLATION OF CS"," "," "," "," "," "," "," ","1981-12-01"]
["S47","N","REASON(S) FOR REMOVAL:"," "," "," "," "," "," "," "," ","1981-12-01"]
["S48","N","REASON(S) FOR TERMINATION:"," "," "," "," "," "," "," "," ","1981-12-01"]
["S49","N","REASON FOR SUSPENSION:"," "," "," "," "," "," "," "," ","1981-12-01"]
["S50","N","DISPLACEMENT NOTICE DATED:"," "," "," "," "," "," "," "," ","1981-12-01"]
["S51","N","REDUCTION IN FORCE NOTICE DATED:"," "," "," "," "," "," "," "," ","1981-12-01"]
["S52","N","REASON FOR TERMINATION:  PL 99-198 ELECTION OF COUNTY COMMITTEE MEMBERS","REQUIRES NEW ELECTION PROCEDURES FOR COUNTY COMMITTEE MEMBERS."," "," "," "," "," "," "," ","1986-07-06"]
["S54","N","OFFERED JOBS OF"," "," "," "," "," "," "," "," ","1981-12-01"]
["S56","N","NO REASON GIVEN BY EMPLOYEE FOR REFUSING JOB OFFER."," "," "," "," "," "," "," "," ","1981-12-01"]
["S57","N","REFUSED EXTENSION OF APPOINTMENT."," "," "," "," "," "," "," "," ","1981-12-01"]
["S58","N","NO OTHER WORK AVAILABLE."," "," "," "," "," "," "," "," ","1981-12-01"]
["S65","N","RESIGNED DURING INITIAL APPOINTMENT PROBATIONARY PERIOD."," "," "," "," "," "," "," "," ","1982-02-09"]
["S66","N","RESIGNED DURING TRIAL PERIOD."," "," "," "," "," "," "," "," ","1982-02-09"]
["S68","N","EMPLOYEE GAVE NO REASON FOR RESIGNATION."," "," "," "," "," "," "," "," ","1982-09-19"]
["S69","N","EMPLOYEE GAVE NO REASON FOR RETIRING."," "," "," "," "," "," "," "," ","1981-12-01"]
["S73","N","SEPARATED BY ORDER OF MERIT SYSTEMS PROTECTION BOARD DATED          FOR"," "," "," "," "," "," "," "," ","1981-12-01"]
["S74","N","AGENCY FINDING: RESIGNED AFTER RECEIVING NOTICE OF PROPOSED POSITION","CHANGE AS RESULT OF FAILURE TO SATISFACTORILY COMPLETE PROBATIONARY","PERIOD FOR SUPERVISORY OR MANAGERIAL POSITION."," "," "," "," "," "," ","1982-09-19"]
["S75","N","AGENCY FINDING: RESIGNED AFTER RECEIVING NOTICE OF DECISION ON POSITION","CHANGE AS A RESULT OF FAILURE TO SATISFACTORILY COMPLETE PROBATIONARY","PERIOD FOR SUPERVISORY OR MANAGERIAL POSITION."," "," "," "," "," "," ","1981-12-01"]
["S76","N","AGENCY FINDING: RESIGNED AFTER RECEIVING NOTICE OF PROPOSED CONVERSION","FROM THE SENIOR EXECUTIVE TO A POSITION IN       SERVICE."," "," "," "," "," "," "," ","1981-12-01"]
["S77","N","SUSPENSION TO BE IMPOSED ON"," "," "," "," "," "," "," "," ","1981-12-01"]
["S78","N","EMPLOYEE IS ACCOMPANYING A US GOVERNMENT SPONSER OVERSEAS"," "," "," "," "," "," "," "," ","1982-10-19"]
["S80","N","RESIGNED AFTER RECEIVING NOTICE THAT WITHIN-GRADE INCREASE WOULD BE DENI","ED"," "," "," "," "," "," "," ","1987-07-17"]
["S81","N","AGENCY FINDING: RETIRED AFTER RECEIVING WRITTEN NOTICE ON","OF DECISION TO REMOVE FROM THE SES FOR"," "," "," "," "," "," "," ","1992-02-09"]
["S82","N","AGENCY FINDING: RESIGNED AFTER RECEIVING WRITTEN NOTICE ON   /  /   OF","PROPOSED PLACEMENT OUT OF THE SES FOR"," "," "," "," "," "," "," ","1992-02-09"]
["S83","N","THERE IS NO ANNUITY REDUCTION BASED ON AGE PER 5 USC 8339(H)"," "," "," "," "," "," "," "," ","1992-02-09"]
["S84","N","ELIGIBLE FOR AN ANNUITY SUPPLEMENT PER 5 USC 8421(A)(2)"," "," "," "," "," "," "," "," ","1992-02-09"]
["SS0","N","UNDER E.O. 11203, DATED MARCH 12, 1965, APPOINTMENT IS SUBJECT TO A TRIA","L  PERIOD PENDING CONVERSION TO THE COMPETITIVE SERVICE. EMPLOYEE MAY NO","T BE  CONVERTED TO THE COMPETITIVE SERVICE UNTIL HE/SHE COMPLETED AT LEA","ST THREE (3) YEARS OF FULL TIME CONTINUOUS SERVICE UNDER THIS APPOINTMEN","T AND       OTHERWISE MEET THE REQUIREMENTS FOR CONVERSION."," "," "," "," ","1997-12-07"]
["SS1","N","EMPLOYMENT IS TERMINATED WHEN THE LIMITATION (OR EARLIER IF MORE THAN ON","E) IS REACHED.  THERE IS NO AUTHORITY TO PAY FOR SERVICE THEREFROM WITHO","UT    APPROPRIATE PERSONNEL ACTION."," "," "," "," "," "," ","1997-12-07"]
["SS2","N","PAYMENT OF TRAVEL AND TRANSPORTATION EXPENSES OF EMPLOYEE, IMMEDIATE FAM","ILYAND HOUSEHOLD GOODS IS AUTHORIZED IN ACCORDANCE WITH THE ADMINISTRATI","VE    EXPENSES ACTION OF 1946, AS AMENDED, AND REGULATIONS ISSUED THEREU","DER."," "," "," "," "," ","1997-12-07"]
["SS3","N","SUBJECT TO PERIODIC REASSIGNMENT TO DUTY STATIONS WITHIN THE GEOGRAPHIC","JURISTICTIONS OF THE U.S. SECRET SERVICE."," "," "," "," "," "," "," ","1997-12-07"]
["SS4","N","SUBJECT TO SATISFACTORY COMPLETION OF ALL REQUIRED TRAINING."," "," "," "," "," "," "," "," ","1997-12-07"]
["SS5","N","SUBJECT TO SATISFACTORY COMPLETION OF FULL FIELD BACKGROUND INVESTIGATIO","N."," "," "," "," "," "," "," ","1997-12-07"]
["SSO","N","UNDER E.O. 11203, DATED MARCH 12, 1965, APPOINTMENT IS SUBJECT TO A TRIA","L  PERIOD PENDING CONVERSION TO THE COMPETITIVE SERVICE. EMPLOYEE MAY NO","T BE  CONVERTED TO THE COMPETITIVE SERVICE UNTIL HE/SHE COMPLETED AT LEA","ST THREE (3) YEARS OF FULL TIME CONTINUOUS SERVICE UNDER THIS APPOINTMEN","T AND       OTHERWISE MEET THE REQUIREMENTS FOR CONVERSION."," "," "," "," ","1997-12-07"]
["ST1","N","CODE 1 IN BLOCK 24 DENOTES CAREER STATUS GAINED UNDER CANAL ZONE","MERIT SYSTEM FOR EMPLOYEES IN STRI."," "," "," "," "," "," "," ","1997-08-17"]
["ST2","N","CODE 2 IN BLOCK 24 DENOTES PERMANENT APPOINTMENT FOR EMPLOYEES","IN STRI."," "," "," "," "," "," "," ","1997-08-17"]
["ST3","N","CODE 3 IN BLOCK 24 DENOTES TEMPORARY OR INDEFINITE APPOINTMENT FOR","EMPLOYEES IN STRI."," "," "," "," "," "," "," ","1997-08-17"]
["T05","N","DATE FOR CONVERSION TO CAREER TENURE HAS BEEN ADJUSTED TO REFLECT CREDIT","FOR SERVICE ON INTERMITTENT WORK SCHEDULE.  ESTIMATED CONVERSION DATE","IS         ."," "," "," "," "," "," ","1983-12-25"]
["T06","N","DATE FOR CONVERSION TO CAREER TENURE WAS ADJUSTED TO REFLECT EXCESS TIME","IN NONPAY STATUS.  NEW ESTIMATED CONVERSION DATE IS"," "," "," "," "," "," "," ","1981-12-01"]
["T07","N","COMPLETED SERVICE REQUIREMENT FOR CAREER TENURE FROM","TO           ."," "," "," "," "," "," "," ","1982-09-19"]
["T08","N","SERVICE COUNTING TOWARDS PERMANENT TENURE FROM            TO"," "," "," "," "," "," "," "," ","1982-09-19"]
["T09","Y","SERVICE COUNTING TOWARDS PERMANENT TENURE FROM *******."," "," "," "," "," "," "," "," ","1981-12-01"]
["T10","Y","SERVICE COUNTING TOWARD CAREER TENURE FROM *******."," "," "," "," "," "," "," "," ","1981-12-01"]
["T11","N","COMPLETED ONE YEAR OF CURRENT CONTINUOUS SERVICE."," "," "," "," "," "," "," "," ","1981-12-01"]
["T29","N","CHANGE IN TENURE GROUP:"," "," "," "," "," "," "," "," ","1982-09-19"]
["T30","N","REASON FOR RETROACTIVE ACTION:"," "," "," "," "," "," "," "," ","1991-04-07"]
["T55","N","TENURE AS USED FOR 5 USC 3502 IS NOT APPLICABLE TO THE SENIOR EXECUTIVE","SERVICE."," "," "," "," "," "," "," ","1981-12-01"]
["TF1","N","THE ONLY CHANGE TO YOUR CURRENT POSITION IS THE AGENCY CODE.","CURRENT DUTIES AND RESPONSIBILITIES REMAIN UNCHANGED, THEREFORE, A NEW","POSITION DESCRIPTION WILL NOT BE PROVIDED AT THIS TIME."," "," "," "," "," "," ","2003-01-12"]
["TOP","N","REORGANIZATION"," "," "," "," "," "," "," "," ","2003-08-01"]
["TR0","N","UNDER EXECUTIVE ORDER 11203, DATED MARCH 12, 1965, APPOINTMENT IS SUBJEC","T  TO A TRAIL PERIOD PENDING CONVERSION TO THE COMPETITIVE SERVICE. EMPL","OYEE  MAY NOT BE CONVERTED TO THE COMPETITIVE SERVICE UNTIL HE/SHE HAS C","OMPLETED AT LEAST THREE YEARS FO FULL-TIME CONTINUOUS SERVICE UNDER THIS","APPOINTMENTAND OTHERWISE MEETS THE REQUIREMENTS FOR CONVERSION."," "," "," "," ","1996-09-03"]
["TR1","N","AMOUNT IN BLOCK 20B CONTAINS THE LOCALITY ADJUSTMENT AMOUNT AND TECHNICI","AN PAY OF $810 PER ANNUM."," "," "," "," "," "," "," ","1997-10-12"]
["TSD","N","THIS IS A RETROACTIVE PERSONNEL ACTION WHICH TOOK EFFECT PRIOR TO THE","TSA NFC CONVERSION DATE OF 8/21/05. THE EFFECTIVE DATE OF THE ACTION IS","(     ). THIS ACTION WILL REQUIRE A RETROACTIVE ADJUSTMENT TO BE","CALCULATED AND PAID OUT BY NFC."," "," "," "," "," ","2005-08-07"]
["U01","N","THIS ACTION REFLECTS A CAREER PROGRESSION PROMOTION."," "," "," "," "," "," "," "," ","2006-08-20"]
["U02","N","SEPARATION THROUGH INVOLUNTARY WORKFORCE REDUCTION AUTHORIZED UNDER","TSA'S HUB-SPOKE REALIGNMENT."," "," "," "," "," "," "," ","2006-08-20"]
["U03","N","PASS PERFORMANCE SALARY INCREASE FOR ROLE MODEL OF EXCELLENCE."," "," "," "," "," "," "," "," ","2006-11-26"]
["U04","N","PASS PERFORMANCE SALARY INCREASE FOR EXCEEDS STANDARDS"," "," "," "," "," "," "," "," ","2006-11-26"]
["U05","N","ACTION APPROVED BY TSA AUTHORITY P.L. 107-71"," "," "," "," "," "," "," "," ","2006-11-26"]
["U07","N","PAY ADJUSTMENT REFLECTS THE PASS PERFORMANCE INCREASE.  BASE SALARY NOW","REFLECTS THE COMPARABILITY EQUIVALENT INCREASE AND THE PASS PERFORMANCE","INCREASE."," "," "," "," "," "," ","2006-11-26"]
["U08","Y","ACTION IS THE RESULT OF THE PHASE 2 PT FEHB PILOT."," "," "," "," "," "," "," "," ","2007-03-18"]
["U09","Y","ACTION IS THE RESULT OF THE SPLIT SHIFT INCENTIVE."," "," "," "," "," "," "," "," ","2007-03-18"]
["U10","Y","ACTION IS THE RESULT OF THE FT TO PT INCENTIVE."," "," "," "," "," "," "," "," ","2007-03-18"]
["U11","Y","ELIGIBLE FOR RETURN RIGHTS AT THE COMPLETION OF THE FOREIGN TOUR OF DUTY","UNDER THE PROVISIONS OF TSA MANAGEMENT DIRECTIVE 1100.30-16."," "," "," "," "," "," "," ","2007-04-01"]
["U12","Y","TSA FORM 1142, FOREIGN DUTY SERVICE AGREEMENT, WAS SIGNED ON"," "," "," "," "," "," "," "," ","2007-04-01"]
["U13","Y","ELIGIBLE FOR PAY RETENTION UNDER THE PROVISIONS OF TSA MANAGEMENT","DIRECTIVE 1100.30-16, FOREIGN DUTY ASSIGNMENTS AND RETURN RIGHTS"," "," "," "," "," "," "," ","2007-04-01"]
["U14","Y","PAY INCREASE IS DUE TO ADJUSTMENT OF TSA'S PAY BANDS."," "," "," "," "," "," "," "," ","2007-06-24"]
["VGL","N","VGL 5 USC 4703"," "," "," "," "," "," "," "," ","1998-03-29"]
["W01","Y","FEDERAL EMPLOYEES' HEALTH BENEFITS (FEHB): YOU HAVE 60 DAYS FROM THE","DATE OF HIRE TO ENROLL. SEND YOUR COMPLETED SF-2809 TO:","TO COMPARE PLANS AND GET MORE INFORMATION, VISIT  WWW.OPM.GOV/INSURE."," "," "," "," "]
["W02","Y","FEDERAL EMPLOYEES' GROUP LIFE INSURANCE (FEGLI):  YOU ARE AUTOMATICALLY","ENROLLED IN BASIC COVERAGE. YOU HAVE 60 DAYS FROM THE DATE OF HIRE","TO ELECT OPTIONAL COVERAGE. SEND YOUR COMPLETED SF-2817 TO:","TO GET MORE INFORMATION AND USE THE FEGLI CALCULATOR, VISIT","HTTP://WWW.OPM.GOV/INSURE/LIFE."," "," "]
["W03","N","FLEXIBLE SPENDING ACCOUNT(FSA):  YOU HAVE 60 DAYS FROM THE DATE OF","HIRE BUT NO LATER THAN OCT 1ST TO ENROLL IN A HEALTH CARE OR DEPENDENT","CARE FSA. IF HIRED ON/AFTER OCT 1ST YOU WILL BE ELIGIBLE TO ENROLL","DURING THE FSA OPEN SEASON. TO GET MORE INFORMATION AND ENROLL","ONLINE, VISIT WWW.FSAFED.COM. ONLINE ENROLLMENT IS MANDATORY."," "," "]
["W04","N","FEDERAL DENTAL AND VISION PROGRAM (FEDVIP):  YOU HAVE 60 DAYS FROM THE","DATE OF HIRE TO ENROLL IN A SUPPLEMENTAL DENTAL AND/OR VISION PLAN. TO","GET MORE INFORMATION AND ENROLL ONLINE, VISIT WWW.BENEFEDS.COM ONLINE","ENROLLMENT IS MANDATORY."," "," "," "]
["W05","Y","THRIFT SAVINGS PLAN (TSP):  YOU ARE ELIGIBLE TO CONTRIBUTE TO TSP.   YOU","ARE AUTOMATICALLY ENROLLED AT THE RATE OF 3%. TO INCREASE OR DECREASE","YOUR CONTRIBUTION AMOUNT, COMPLETE A TSP-1 AND SEND IT TO:","FERS EMPLOYEES ONLY: YOU WILL IMMEDIATELY RECEIVE AN AGENCY AUTOMATIC","CONTRIBUTION OF 1% OF YOUR PAY AND QUALIFY FOR UP TO 4% MATCHING.","TO GET INFORMATION, VISIT WWW.TSP.GOV/FORMS/TSPBK08.PDF"," "]
["W06","N","FEDERAL LONG TERM CARE INSURANCE PROGRAM (FLTCIP)","YOU HAVE 60 DAYS FROM THE DATE OF HIRE TO APPLY FOR COVERAGE","USING THE ABBREVIATED UNDERWRITING APPLICATION. TO GET MORE","INFORMATION AND APPLY ONLINE, VISIT WWW.LTCFEDS.COM. YOU MAY","APPLY ONLINE OR DOWNLOAD AN APPLICATION."," "," "]
["W07","Y","CREDITABLE MILITARY SERVICE:","IF YOU HAVE HONORABLE, ACTIVE DUTY MILITARY SERVICE AND WANT TO","RECEIVE LEAVE AND RETIREMENT CREDIT, PLEASE CONTACT A BENEFITS","SPECIALIST AT:"," "," "," "]
["W08","N","YOU ARE NOW ELIGIBLE FOR HEALTH INSURANCE BUT YOU MUST PAY 100%","OF THE PREMIUM. YOU HAVE 60 CALENDAR DAYS FROM THE DATE OF THIS","NOTICE TO ENROLL. GET MORE INFORMATION FROM YOUR HUMAN","RESOURCES POC OR ONLINE AT HTTP://WWW.OPM.GOV/INSURE."," "," "," "]
["X35","N","THE RETAINED PAY PLAN AND GRADE       IS EQUIVALENT TO       ,THE POSITI","ON FROM WHICH REDUCED."," "," "," "," "," "," "," ","1981-12-01"]
["X36","N","GRADE RETENTION ENTITLEMENT TERMINATED. NO FURTHER ENTITLEMENT TO GRADE","OR PAY RETENTION."," "," "," "," "," "," "," ","1981-12-01"]
["X37","Y","EMPLOYEE IS ENTITLED TO RETAIN GRADE OF ***** ***** THROUGH *********."," "," "," "," "," "," "," "," ","1982-09-19"]
["X38","N","ON        EMPLOYEE WILL BE ENTITLED TO RETAIN GRADE OF         THROUGH","PROVIDED THE PRECEDING PERIOD OF GRADE RETENTION IS NOT TERMI","NATED EARLIER."," "," "," "," "," "," ","1982-06-01"]
["X39","N","EMPLOYEE ELECTED TO TERMINATE GRADE RETENTION ENTITLEMENT."," "," "," "," "," "," "," "," ","1981-12-01"]
["X40","N","EMPLOYEE IS ENTITLED TO PAY RETENTION."," "," "," "," "," "," "," "," ","1981-12-01"]
["X41","N","SALARY IS 150% OF MAXIMUM RATE OF GRADE TO WHICH ASSIGNED."," "," "," "," "," "," "," "," ","1981-12-01"]
["X42","N","PAY RETENTION ENTITLEMENT TERMINATED."," "," "," "," "," "," "," "," ","1981-12-01"]
["X43","Y","EXPIRATION OF GRADE RETENTION PERIOD AS ***** *****."," "," "," "," "," "," "," "," ","1981-12-01"]
["X44","Y","RATE IS STEP ***** OF ***** *****, RETAINED GRADE."," "," "," "," "," "," "," "," ","1981-12-01"]
["X45","N","RETAINED GRADE WILL BE USED TO DETERMINE EMPLOYEE'S PAY, RETIREMENT, AND","INSURANCE BENEFITS, AND PROMOTION AND TRAINING ELIGIBILITY."," "," "," "," "," "," "," ","1981-12-01"]
["X46","Y","ACTION GIVES EMPLOYEE WITHIN GRADE INCREASE/QUALITY INCREASE TO","STEP ***** OF ***** *****, RETAINED GRADE."," "," "," "," "," "," "," ","1982-09-19"]
["X47","Y","ACTION DENIES WITHIN GRADE INCREASE TO STEP ***** OF EMPLOYEE'S RETAINED","GRADE."," "," "," "," "," "," "," ","1981-12-01"]
["X48","N","DECLINED OFFER OF"," "," "," "," "," "," "," "," ","1981-12-01"]
["X49","N","CHANGE TO LOWER GRADE, LEVEL, OR BAND  IS FOR PERSONAL CAUSE."," "," "," "," "," "," "," "," ","2006-04-30"]
["X50","N","FAILED TO COMPLY WITH PRIORITY PLACEMENT PROGRAM REQUIREMENTS."," "," "," "," "," "," "," "," ","1981-12-01"]
["X61","N","RETAINED GRADE WILL NOT BE USED FOR PURPOSE OF REDUCTION-IN-FORCE."," "," "," "," "," "," "," "," ","1981-12-01"]
["X62","N","ACTION GRANTS WITHIN-GRADE INCREASE IN EMPLOYEE'S RETAINED GRADE OF","(PAY PLAN AND GRADE)."," "," "," "," "," "," "," ","1994-04-03"]
["X63","N","ACTION DENIES WITHIN-GRADE INCREASE IN EMPLOYEE'S RETAINED GRADE OF","(PAY PLAN AND GRADE)."," "," "," "," "," "," "," ","1994-04-03"]
["X65","N","GRADE RETENTION ENTITLEMENT IS TERMINATED."," "," "," "," "," "," "," "," ","1993-10-08"]
["X74","N","CHANGE DATA ELEMENT IN BLOCK 29."," "," "," "," "," "," "," "," ","1992-01-12"]
["Y28","Y","THIS ACTION IS STRICTLY TEMPORARY AND IS NOT TO EXCEED *******. WHEN","YOUR SERVICES ARE NO LONGER NEEDED IN THIS TEMPORARY ASSIGNMENT, YOU WIL","L  BE REVERTED BACK TO YOUR LAST PERMANENT LEVEL (    -     TENURE GROUP",") WHERE YOU WILL BE GRANTED ALL RIGHTS AND PRIVLEGES AS I","F YOU HAD   NOT BEEN TEMPORARILY CHANGED"," "," "," "," ","1988-01-01"]
["Y29","N","CODE A IN BLOCK 28 INDICATES REEMPL. ANN-FERS"," "," "," "," "," "," "," "," ","1988-07-03"]
["Y30","N","CODE B IN BLOCK 28 INDICATES FORMER ANN-FERS"," "," "," "," "," "," "," "," ","1988-07-03"]
["Y31","N","CODE C IN BLOCK 28 INDICATES RETIRED OFF/REEMPL. ANN FERS"," "," "," "," "," "," "," "," ","1988-07-03"]
["Y32","N","CODE D IN BLOCK 28 INDICATES RETIRED OFF/FORMER  ANN FERS"," "," "," "," "," "," "," "," ","1988-07-03"]
["Y33","N","CODE E IN BLOCK 28 INDICATES RETIRED ENLISTED/REEMPL. ANN-FERS"," "," "," "," "," "," "," "," ","1988-07-03"]
["Y34","N","CODE F IN BLOCK 28 INDICATES RETIRED ENLISTED/FORMER ANN-FERS"," "," "," "," "," "," "," "," ","1988-07-03"]
["Y40","N",0," "," "," "," "," "," "," "," ","1989-10-22"]
["Y41","N",0," "," "," "," "," "," "," "," ","1989-10-22"]
["Y42","N",0," "," "," "," "," "," "," "," ","1989-10-22"]
["Y43","N",0," "," "," "," "," "," "," "," ","1989-10-22"]
["Y44","N",0," "," "," "," "," "," "," "," ","1989-10-22"]
["Y45","N",0," "," "," "," "," "," "," "," ","1989-10-22"]
["Y46","N",0," "," "," "," "," "," "," "," ","1989-10-22"]
["Y47","N",0," "," "," "," "," "," "," "," ","1989-10-22"]
["Y48","N",0," "," "," "," "," "," "," "," ","1989-10-22"]
["Y49","N",0," "," "," "," "," "," "," "," ","1989-10-22"]
["Y50","N",0," "," "," "," "," "," "," "," ","1989-10-22"]
["Y51","N",0," "," "," "," "," "," "," "," ","1989-10-22"]
["Y52","N",0," "," "," "," "," "," "," "," ","1989-10-22"]
["Y53","N",0," "," "," "," "," "," "," "," ","1989-10-22"]
["Y54","N",0," "," "," "," "," "," "," "," ","1989-10-22"]
["Y55","N",0," "," "," "," "," "," "," "," ","1989-10-22"]
["Y56","N",0," "," "," "," "," "," "," "," ","1989-10-22"]
["Y57","N",0," "," "," "," "," "," "," "," ","1989-10-22"]
["Y58","N",0," "," "," "," "," "," "," "," ","1989-10-22"]
["Y59","N",0," "," "," "," "," "," "," "," ","1989-10-22"]
["Y60","N",0," "," "," "," "," "," "," "," ","1989-10-22"]
["Y61","N",0," "," "," "," "," "," "," "," ","1989-10-22"]
["Y62","N",0," "," "," "," "," "," "," "," ","1989-10-22"]
["Y63","N",0," "," "," "," "," "," "," "," ","1989-10-22"]
["Y64","N",0," "," "," "," "," "," "," "," ","1989-10-22"]
["Y65","N",0," "," "," "," "," "," "," "," ","1989-10-22"]
["Y66","N",0," "," "," "," "," "," "," "," ","1989-10-22"]
["Y67","N",0," "," "," "," "," "," "," "," ","1989-10-22"]
["Y68","N",0," "," "," "," "," "," "," "," ","1989-10-22"]
["Y69","N",0," "," "," "," "," "," "," "," ","1989-10-22"]
["Y70","N",0," "," "," "," "," "," "," "," ","1989-10-22"]
["Y71","N",0," "," "," "," "," "," "," "," ","1989-10-22"]
["Y72","N",0," "," "," "," "," "," "," "," ","1989-10-22"]
["Y73","N",0," "," "," "," "," "," "," "," ","1989-10-22"]
["Y74","N",0," "," "," "," "," "," "," "," ","1989-10-22"]
["Y75","N",0," "," "," "," "," "," "," "," ","1989-10-22"]
["Y76","N",0," "," "," "," "," "," "," "," ","1989-10-22"]
["Y77","N",0," "," "," "," "," "," "," "," ","1989-10-22"]
["Y78","N",0," "," "," "," "," "," "," "," ","1989-10-22"]
["Y79","N",0," "," "," "," "," "," "," "," ","1989-10-22"]
["Y80","N",0," "," "," "," "," "," "," "," ","1989-10-22"]
["Y81","N",0," "," "," "," "," "," "," "," ","1989-10-22"]
["Y82","N",0," "," "," "," "," "," "," "," ","1989-10-22"]
["Y83","N",0," "," "," "," "," "," "," "," ","1989-10-22"]
["Y85","N",0," "," "," "," "," "," "," "," ","1989-10-22"]
["Y86","N",0," "," "," "," "," "," "," "," ","1989-10-22"]
["Y87","N",0," "," "," "," "," "," "," "," ","1989-10-22"]
["Y88","N",0," "," "," "," "," "," "," "," ","1989-10-22"]
["Y89","N",0," "," "," "," "," "," "," "," ","1989-10-22"]
["Y90","N",0," "," "," "," "," "," "," "," ","1989-10-22"]
["Y91","N",0," "," "," "," "," "," "," "," ","1989-10-22"]
["Y92","N",0," "," "," "," "," "," "," "," ","1989-10-22"]
["Y93","N",0," "," "," "," "," "," "," "," ","1980-01-01"]
["Y94","N",0," "," "," "," "," "," "," "," ","1989-10-22"]
["Y95","N",0," "," "," "," "," "," "," "," ","1989-10-22"]
["Y98","N",0," "," "," "," "," "," "," "," ","1997-01-01"]
["Y99","N","COOPERATIVE EDUCATION PROGRAM PARTICIPANT COVERED BY SPECIAL SALARY RATE","S  PER AN OPM LETTER DATED 07/14/89."," "," "," "," "," "," "," ","1989-07-16"]
["Z10","N","SUBJECT TO SATISFACTORY INVESTIGATION."," "," "," "," "," "," "," "," ","1991-03-10"]
["Z14","N","MUST BE ABLE TO HOLD TOP SECRET CLEARANCE."," "," "," "," "," "," "," "," ","1988-01-03"]
["Z21","N","INITIAL APPOINTMENT UNDER SEC 7(A)(2) OF THE PEACE CORPS ACT,PL 87-293 A","S  AMENDED,BEGAN ON         ."," "," "," "," "," "," "," ","1999-01-01"]
["Z23","N","EXTENSION BEYOND THE FIVE YEAR LIMIT APPROVED BY THE PEACE CORPS DIRECTO","R  ON          ."," "," "," "," "," "," "," ","1999-01-01"]
["Z26","N","EXCEPTED APPOINTED NTE          OR SUBJECT TO THE NEEDS OF PEACE CORPS."," "," "," "," "," "," "," "," ","1999-01-01"]
["Z27","N","PEACE CORPS ACT,PL 87-239 AS AMMENDED, PROVIDES THAT THIS EMPLOYMENT DOE","S  NOT AFFECT ANNUITIES OR RETIRED STATUS"," "," "," "," "," "," "," ","1999-01-01"]
["Z28","N","SERVES AS SUB-CASHIER DURING TENURE AT THIS DUTY STATION."," "," "," "," "," "," "," "," ","1999-01-01"]
["Z29","N","ACCESS TO CLASSIFIED INFORMATION IS NOT PERMITTED UNTIL A SECURITY","CLEARENCE IS GRANTED."," "," "," "," "," "," "," ","1999-01-01"]
["Z33","N","ACTION REFLECTS THE ESTABLISHMENT UNDER SECTION 104 OF FEPCA OF 1990","(P.L. 101-509) OF A SEPARATE PAY SYSTEM FOR ADMINISTRATIVE LAW JUDGE","POSITIONS FORMERLY AT GS-15, 16, 17, AND 18."," "," "," "," "," "," ","1991-02-10"]
["Z34","N","ACTION REFLECTS THE ESTABLISHMENT UNDER SECTION 104 OF THE FEPCA OF 1990","(P.L. 101-509) OF A SEPARATE PAY SYSTEM FOR AGENCY BOARD OF CONTRACT","APPEALS POSITIONS FORMERLY AT GS-16, 17, AND 18."," "," "," "," "," "," ","1991-02-10"]
["Z36","N","ELIGIBLE FOR PAYMENT OF TRAVEL EXPENSES AND PER DIEM IN LIEU OF SUBSISTE","NCEWHEN AWAY FROM HOME OR REGULAR PLACE OF BUSINESS"," "," "," "," "," "," "," ","1999-01-01"]
["Z37","N","EXECPTION TO THE MERIT PROMOTION PLAN."," "," "," "," "," "," "," "," ","1999-01-01"]
["Z38","N","FORMER PEACE CORPS VOLUNTEER IN                FROM","."," "," "," "," "," "," "," ","1999-01-01"]
["Z39","N","RESIDENT HIRE.  NO TRAVEL INVOLVED.","."," "," "," "," "," "," "," ","1999-01-01"]
["Z40","Y","WGI BEGINS/BEGAN: *******"," "," "," "," "," "," "," "," ","1988-01-03"]
["Z41","Y","LEAVE CATEGORY: ***"," "," "," "," "," "," "," "," ","1988-01-03"]
["Z42","N","APPOINTMENT ABOVE MINIMUM RATE BASED ON SUPERIOR QUALIFICATIONS."," "," "," "," "," "," "," "," ","1988-01-03"]
["Z43","N","THIS IS NOT A CAREER LADDER POSITION.                                  ."," "," "," "," "," "," "," "," ","1999-01-01"]
["Z44","N","COMPLETION OF A LIMITED APPOINTMENT DOES NOT CONSTITUTE A BASIS FOR","ENTITLEMENT TO SEVERANCE PAY."," "," "," "," "," "," "," ","1999-01-01"]
["Z47","N","CAREER PROMOTION."," "," "," "," "," "," "," "," ","1988-01-03"]
["Z52","N","QUALIFIED FOR THIS POSITION ONLY UNDER AN APPROVED TRAINING AGREEMENT.","NOT EIGIBLE FOR OTHER POSITIONS IN THIS SERIES UNTIL EMPLOYEE","SATIFACTORILY COMPLETES PRESCRIBED TRAINING."," "," "," "," "," "," ","1988-01-03"]
["Z53","N","SATISFACTORILY COMPLETED TRAINING PRESCRIBED UNDER AN APPROVED TRAINING","AGREEMENT. MEETS BASIC QUALIFICATIONS FOR OTHER POSITONS IN THIS SERI","ES."," "," "," "," "," "," ","1988-01-03"]
["Z54","N","THIS DETAIL MAY NOT EXCEED 120 DAYS FOLLOWING THE COMPETITIVE SELECTION","PROCEDURES  SPECIFIED IN GAO ORDER 2335.1."," "," "," "," "," "," "," ","1988-01-03"]
["Z55","N","SALARY PAID ONLY FOR TIME WORKED AND WHILE IN AN AUTHORIZED TRAVEL STATU","S."," "," "," "," "," "," "," ","1988-01-03"]
["Z56","N","WGI DUE:"," "," "," "," "," "," "," "," ","1988-01-03"]
["Z57","N","SENATE PUBLIC FINANCIAL DISCLOSURE REPORT WAIVED--EMPLOYMENT LIMITED TO","LESS THAN 60 WORKDAYS THIS CALENDAR YEAR."," "," "," "," "," "," "," ","1988-01-03"]
["Z71","N","MERITORIOUS INCREASE IS BASED ON EMPLOYEE'S SUSTANINED HIGH QUALITY","PERFORMANCE."," "," "," "," "," "," "," ","1999-01-01"]
["Z72","N","INCREASE IS BASED ON EMPLOYEE'S LANGUAGE PROFICIENCY IN         ."," "," "," "," "," "," "," "," ","1999-01-01"]
["Z73","N","GRADUAL ACCRETION OF DUTIES DUE TO POSITION REVIEW."," "," "," "," "," "," "," "," ","1999-01-01"]
["Z74","N","EMPLOYEE IS PARTICIPATING IN THE STUDENT AIDE PROGRAM. CONTINUED","EMPLOYMENT UNDER THIS APPOINTMENT IS DEPENDENT UPON MAINTAINING AN","ACCEPTABLE SCHOOL STANDING."," "," "," "," "," "," ","1999-01-01"]
["Z75","N","EMPLOYEE MAY NOT EXCEED 40 HOURS IN ANY CALENDAR WEEK."," "," "," "," "," "," "," "," ","1999-01-01"]
["Z76","N","SUNDAY THROUGH THURSDAY.  SUNDAY DIFFERENTIAL AUTHORIZED."," "," "," "," "," "," "," "," ","1999-01-01"]
["Z77","N","EMPLOYEE MUST NOT WORK MORE THAN 130 DAYS IN A SERVICE YEAR. SERVICE YEA","R  BEGAN          ."," "," "," "," "," "," "," ","1999-01-01"]
["Z78","N","EMPLOYEE IS A RETIRED CIVIL SERVICE ANNUITANT FROM            .EFFECTIVE","DATE OF RETIREMENT WAS          .DUE TO EMPLOYMENT UNDER SECTION 13(A",") OF  THE PEACE CORPS ACT,PL 87-293 AS AMMENDED,THIS EMPLOYMENT DOES NOT","AFFECT  ANNUITIES OR RETIRED STATUS."," "," "," "," "," ","1999-01-01"]
["Z79","N","THIS IS A CONFIDENTIAL POLICY MAKING POSITION SERVING AT THE PLEASURE OF","THE PEACE CORPS DIRECTOR."," "," "," "," "," "," "," ","1999-01-01"]
["Z80","N","THIS IS A NON-COMPETITIVE APPOINTMENT SERVING AT THE PLEASURE OF THE PEA","CE CORPS DIRECTOR."," "," "," "," "," "," "," ","1999-01-01"]
["Z81","N","APPOINTMENT IS SUBJECT TO SATISFACTORY COMPLETION OF A 6 MONTH TRIAL PER","OIDCOMMENCING:"," "," "," "," "," "," "," ","1999-01-01"]
["Z82","N","ANNUAL/SICK LEAVE,HEALTH BENEFITS, AND RETIREMENT TO BE TRANSFERRED."," "," "," "," "," "," "," "," ","1999-01-01"]
["Z83","N","SF-8,SF-2810,SF-2821,PC-1800 ISSUED."," "," "," "," "," "," "," "," ","1999-01-01"]
["Z84","N","CHANGE FEGLI DUE TO ELECTION WITHIN 31 DAYS OF EFFECTIVE DATE OF","APPOINTMENT."," "," "," "," "," "," "," ","1999-01-01"]
["Z85","N","FROM LWOP NTE:"," "," "," "," "," "," "," "," ","1999-01-01"]
["Z86","N","CHECK; WAITING PERIOD FOR WGI BEGAN:"," "," "," "," "," "," "," "," ","1999-01-01"]
["Z87","N","STATEMENT OF FINANCIAL INTEREST REQUIRED"," "," "," "," "," "," "," "," ","1999-01-01"]
["Z88","N","TIMEKEEPER, PLEASE MAKE RETROACTIVE ADJUSTMENT TO ELAVE ACCURAL TO REFLE","CT LEAVE CATAGORY            FROM           ."," "," "," "," "," "," "," ","1999-01-01"]
["Z91","N","THIS APPOINTMENT IS INTENDED TO CONTINUE FOR TWO YEARS.  UPON SATISFACTO","RY COMPLETION OF PROGRAM, YOU WILL BE NON-COMPETITIVETLY CONVERTED TO","EXCEPTED-CONDITIONAL OR EXCEPTED APPOINTMENT.  IF PERFORMANCE IS N","OT       SATISFACTORY OR IF YOU FAIL TO SATISFACTORILY COMPLETE PROGRAM,","EMPLOYMENT WILL BE TERMINATED."," "," "," "," ","1988-01-03"]
["Z92","N","APPOINTMENT IS NTE TWO YEARS.  UPON SATISFACTORY COMPLETION OF INTERNSHI","P  YOU MAY BE NONCOMPETITIVELY CONVERTED TO EXCEPTED OR EXCEPTED-CONDITI","ONAL  APPOINTMENT. IF YOUR PERFORMANCE IS NOT","SATISFACTORY OR IF YOU FAIL TO SATISFACTORILY COMPLETE INTERSHI","P,          EMPLOYMENT WILL BE TERMINATED."," "," "," "," ","1988-01-03"]
["Z93","N","THIS APPOINTMENT IS INTENDED TO CONTINUE THROUGH THE COMPLETION OF THE","REQUIREMENTS FOR GRADUATION FROM THE DEGREE PROGRAM THAT QUALIFIES YO","U     FOR THE APPOINTMENT. WITHIN 120 DAYS OF SATISFACTORY COMPLETION OF","THE     DEGREE PROGRAM.  THIS AGENCY MAY NON-COMPETITIVELY CONVERT YOU","TO EXCEPTED OR EXCEPTED-CONDITIONAL APPOINTMENT. IF YOUR PERFORMANCE IS","NOT            SATISFACTORY OR IF YOU YOU FAIL TO SATISFACTORILY COMPLET","THIS APPOINTMENT IS INTENDED TO CONTINUE THROUGH THE COMPLETION OF THE","REQUIREMENTS FOR GRADUATION FROM THE DEGREE PROGRAM THAT QUALIFIES YO","U     FOR THE APPOINTMENT. WITHIN 120 DAYS OF SATISFACTORY COMPLETION OF","1988-01-01"]
["Z94","N","SF-85 NOT SUBMITTED--EMPLOYMENT NTE 30 WORKDAYS IN A SERVICE YEAR."," "," "," "," "," "," "," "," ","1988-01-01"]
["Z95","N","EQUIVALENT TO GS-   STEP   ."," "," "," "," "," "," "," "," ","1988-01-03"]
["Z97","N","YOU HAVE REEMPLOYMENT RIGHTS FOR TWO YEARS IN GAO GRANTED UNDER A LETTER","OF AUTHORITY BY THE COMPTROLLER GENERAL DATED         AND UNDER GAO O","RDER  2351.1."," "," "," "," "," "," ","1988-01-03"]
["Z98","N","SALARY IS $        PH, NTE $         PER DAY, OR $           BIWEEKLY."," "," "," "," "," "," "," "," ","1988-01-03"]
["Z99","N","INTERMITTENT EMPLOYMENT TOTALED     DAYS IN PAY STATUS FROM","TO          ."," "," "," "," "," "," "," ","1988-01-03"]
["ZA1","N","SPECIAL RATE UNDER GAO ORDER 2531.2."," "," "," "," "," "," "," "," ","1988-01-03"]
["ZA2","N","PAY RATE AUTHORIZED UNDER GAO ORDER 2531.2--SUPERVISES PREVAILING RATE","EMPLOYEES PAID $           PER ANNUM."," "," "," "," "," "," "," ","1988-01-03"]
["ZA3","Y","SERVICE COUNTING TOWARDS EXCEPTED TENURE FROM ******* TO        ."," "," "," "," "," "," "," "," ","1988-01-03"]
["ZA4","Y","SERVICE COUNTING TOWARDS EXCEPTED TENURE FROM *********."," "," ","SERVICE COUNTING TOWARDS EXCEPTED TENURE FROM          ."," "," "," "," "," ","1988-01-03"]
["ZA5","N","SF-52#:                    ."," "," "," "," "," "," "," "," ","1988-01-03"]
["ZA6","N","THIS IS A COMPTROLLER GENERAL'S CAREER APPIONTMENT AND THE EMPLOYEE IS N","OT ELIGIBLE FOR NONCOMPETITIVE APPOINTMENT TO AN EXECUTIVE BRANCH CAREER","RESERVE POSITION."," "," "," "," "," "," ","1988-01-03"]
["ZA8","N","SELECTED FROM EXECUTIVE CANDIDATE DEVELOPMENT POOL."," "," "," "," "," "," "," "," ","1988-01-03"]
["ZB1","N","HIGHEST PREVIOUS RATE RULE WILL BE APPLIED IN SETTING SALARY UPON","SUBSEQUENT PROMOTIONS."," "," "," "," "," "," "," ","1988-01-03"]
["ZB2","N","TERM PROMOTION."," "," "," "," "," "," "," "," ","1988-01-03"]
["ZB3","N","SATISFACTORILY COMPLETED UPWARD MOBILITY PROGRAM."," "," "," "," "," "," "," "," ","1988-01-03"]
["ZB5","N","DATE FOR CONVERSION TO EXCEPTED TENURE HAS BEEN ADJUSTED TO REFLECT","EXCESS TIME IN NONPAY STATUS.  NEW ESTIMATED CONVERSION DATE IS","."," "," "," "," "," "," ","1988-01-03"]
["ZB6","N","COMPLETED SERVICE REQUIREMENT FOR EXCEPTED TENURE FROM","TO"," "," "," "," "," "," "," ","1988-01-03"]
["ZB7","N","REMOVAL BY ORDER OF THE COMPTROLLER GENERAL DATED           FOR","VIOLATION OF"," "," "," "," "," "," "," ","1988-01-03"]
["ZB8","N","REMOVAL BY ORDER OF GAO PERSONNEL APPEALS BOARD DATED","FOR"," "," "," "," "," "," "," ","1988-01-03"]
["ZC1","N","CASH-IN-A-FLASH AWARD"," "," "," "," "," "," "," "," ","1991-02-24"]
["ZC7","N","DETAILED TO HIGHER GRADED POSITION.DUTIES EQUIVALENT TO          ."," "," "," "," "," "," "," "," ","1988-01-03"]
["ZC8","N","THIS IS A REIMBURSABLE DETAIL: EMPLOYEE TO BE PAID BY"," "," "," "," "," "," "," "," ","1988-01-03"]
["ZF1","N","EMPLOYEE MUST MEET UPWARD MOBILITY PROGRAM REQUIREMENTS TO CONVERT","TO THE TARGET POSITION. IF PERFORMANCE IS NOT SATISFACTORY OR IF PROG","RAM   REQUIREMENTS ARE NOT MET, EMPLOYEE WILL BE REMOVED FROM THE PROGRA","."," "," "," "," "," ","1988-01-03"]
["ZF2","N","THE TARGET POSITION IS                              ."," "," "," "," "," "," "," "," ","1988-01-03"]
["ZF3","N","EMPLOYEE HAS NOT MET THE PROVISIONS OF 31 USC 732(G) FOR","ACQUIRING COMPETITIVE STATUS FOR APPOINTMENT TO THE COMPETITIVE","SERVICE."," "," "," "," "," "," ","1988-01-03"]
["ZF4","N","THIS APPOINTMENT IS MADE THROUGH THE PRESIDENT'S COMMISSION ON","EXECUTIVE EXCHANGE."," "," "," "," "," "," "," ","1988-01-03"]
["ZF5","N","NO PERMANENT OFFER OF EMPLOYMENT CAN BE MADE DURING THE EXCHANGE YEAR","OR UPON COMPLETION OF THE ASSIGNMENT. THIS RESTRICTION REMAINS IN","EFFECT FOR 36 MONTHS AFTER THE APPOINTEE LEAVES THE FEDERAL GOVERN","ENT."," "," "," "," "," ","1988-01-03"]
["ZF6","N","ALL INFORMATION SUBJECT TO VERIFICATION UPON RECEIPT OF THE MERGED","RECORDS PERSONNEL FOLDER."," "," "," "," "," "," "," ","1988-01-03"]
["ZF7","N","INITIAL PROBATIONARY PERIOD WAIVED."," "," "," "," "," "," "," "," ","1988-01-03"]
["ZF8","N","PROBATIONARY PERIOD FOR SUPERVISORY OR MANAGERIAL POSITION WAIVED."," "," "," "," "," "," "," "," ","1988-01-03"]
["ZF9","N","UNDER THE PROVISIONS OF 31 USC 732 (G) AN EMPLOYEE ACQUIRES COMPETITIVE","STATUS FOR APPOINTMENT TO THE COMPETITIVE SERVICE BASED ON ONE YEAR O","F     CONTINUOUS SERVICE UNDER A NONTEMPORARY APPOINTMENT."," "," "," "," "," "," ","1988-01-03"]
["ZG1","N","COMPLETED SERVICE REQUIREMENTS FOR CAREER TENURE FROM","TO            IN THE COMPETITIVE SERVICE."," "," "," "," "," "," "," ","1988-01-03"]
["ZG2","N","ACTION CANCELLED IN ACCORDANCE WITH DIRECTOR OF PERSONNEL LETTER OR","INSTRUCTIONS DATED           . THIS SF-50 AND THE SF-50 BEING","CANCELLED MUST BE RETAINED PERMANENTLY IN THE EMPLOYEE'S MERGED","RECORDS PERSONNEL FOLDER."," "," "," "," "," ","1988-01-03"]
["ZG3","N","OVERSEAS ASSIGNMENT WILL BE FOR TWO YEARS. BY MUTUAL AGREEMENT BETWEEN","THE OVERSEAS MANAGER AND THE STAFF MEMBER, ALL ASSIGNMENTS MAY BE","EXTENDED FOR UP TO TWO ADDITIONAL YEARS AT THE SAME GEOGRAPHIC LOC","TION."," "," "," "," "," ","1988-01-03"]
["ZG4","N","EMPLOYMENT IS NTE 120 DAYS FOLLOWING COMPLETION OF REQUIREMENTS FOR","GRADUATION FROM THE DEGREE PROGRAM WHICH QUALIFIES YOU FOR THIS","APPOINTMENT, AND MUST NOT EXCEED 1040 HOURS IN A SERVICE YEAR.","IF YOUR PERFORMANCE IS NOT SATISFACTORY OR IF YOU FAIL TO COMPL","ETE         THE PROGRAM, EMPLOYMENT WILL BE TERMINATED."," ","."," "," ","1988-01-03"]
["ZG5","N","EMPLOYEE IS NO LONGER ENTITLED TO PER DIEM ALLOWANCE FOR TRAVEL","BETWEEN HOME AND DUTY STATION FOR THE REMAINDER OF THIS SERVICE","YEAR."," "," "," "," "," "," ","1988-01-03"]
["ZG6","N","SUBJECT TO COMPLETION OF A FAVORABLE BACKGROUND INVESTIGATION."," "," "," "," "," "," "," "," ","1988-01-03"]
["ZG7","N","THIS APPOINTMENT CANNOT BE RENEWED OR EXTENDED. UPON SATISFACTORY","PERFORMANCE YOU MAY BE NONCOMPETITIVELY CONVERTED TO EXCEPTED","OR EXCEPTED-CONDITIONAL APPOINTMENT IN ACCORDANCE WITH PROCEDURES","OUTLINED IN GAO ORDER 2213.1(Y), OUTSTANDING SCHOLAR."," "," "," "," "," ","1988-01-03"]
["ZG8","N","COMPLETED SERVICE REQUIREMENTS FOR CAREER TENURE FROM            TO","IN THE COMPETITIVE SERVICE PRIOR TO GAO'S CONVERSION","UNDER 31 USC 732(G) TO EXCEPTED SERVICE ON OCTOBER 1,1980."," "," "," "," "," "," ","1988-01-03"]
["ZG9","N","COMPLETED ONE YEAR OF CONTINUOUS SERVICE UNDER A NON-TEMPORARY","APPOINTMENT. EMPLOYEE HAS COMPETITIVE STATUS FOR APPOINTMENT IN","THE COMPETITIVE SERVICE UNDER THE PROVISION OF 31 USC 732(G)."," "," "," "," "," "," ","1988-01-03"]
["ZH1","N","YOU HAVE REEMPLOYMENT RIGHTS IN GAO UNDER                PROVIDED","SEPARATION IS NO LATER THAN            AFTER THE DATE OF ENTRY","ON DUTY IN                  AND YOU APPLY TO THIS AGENCY","WITHIN            FROM DATE OF YOUR SEPARATION."," "," "," "," "," ","1988-01-03"]
["ZH2","N","MERGED RECORDS PERSONNEL FOLDER MAINTAINED BY","."," "," "," "," "," "," "," ","1988-01-03"]
["ZH3","N","THIS IS A NON-REIMBURSABLE DETAIL"," "," "," "," "," "," "," "," ","1988-01-03"]
["ZH4","Y","PFP BONUS AWARD $*******."," "," "," "," "," "," "," "," ","1989-06-18"]
["ZH5","N","EMPLOYEE IS SUBJECT TO PAY FOR PERFORMANCE SYSTEM."," "," "," "," "," "," "," "," ","1989-06-18"]
["ZH6","N","SALARY RATE IN BLOCK 20 INCLUDES FULL OR PARTIAL WITHIN-GRADE INCREASE","WHICH WOULD HAVE BEEN DUE IF EMPLOYEE REMAINED IN THE GS."," "," "," "," "," "," "," ","1989-06-18"]
["ZH7","N","EMPLOYEE IS ENTITLED TO PFP PAY PROTECTION IN ACCORDANCE WITH GAO ORDER","2540.1 OR 2540.2, AS APPROPRIATE."," "," "," "," "," "," "," ","1989-06-18"]
["ZH8","N","EMPLOYEE IS NO LONGER ENTITLED TO PFP PAY PROTECTION PROVISIONS."," "," "," "," "," "," "," "," ","1989-06-18"]
["ZH9","N","PFP PAY PROTECTION PROVISIONS ARE NOT APPLICABLE."," "," "," "," "," "," "," "," ","1989-06-18"]
["ZJ1","N","PAY PROTECTION PROVISIONS APPLIED IN DETERMINING SALARY."," "," "," "," "," "," "," "," ","1989-06-18"]
["ZJ2","Y","SALARY INCLUDES PFP INCREASE OF $*******."," "," "," "," "," "," "," "," ","1989-06-18"]
["ZJ3","Y","APPOINTMENT IS SUBJECT TO COMPLETION OF A 2 YEAR TRIAL/PROBATIONARY PERI","OD BEGINNING *******."," "," "," "," "," "," "," ","1989-06-18"]
["ZJ4","N","SALARY ADJUSTED DUE TO CHANGE IN MINIMUM ENTRY RATE UNDER PFP."," "," "," "," "," "," "," "," ","1989-06-18"]
["ZJ5","N","PFP SALARY SET IN ACCORDANCE WITH SPECIAL RATES AUTHORIZED UNDER GAO 250",0.1," "," "," "," "," "," "," ","1989-06-18"]
["ZJ6","N","FULL PERFORMANCE LEVEL IS BAND IF"," "," "," "," "," "," "," "," ","1989-06-18"]
["ZJ7","N","SALARY ADJUSTED DUE TO CHANGE IN PAY SYSTEM."," "," "," "," "," "," "," "," ","1989-06-18"]
["ZJ8","N","SPECIAL EXPERIMENTAL PAY RATE AUTHORIZED UNDER NEW YORK'S ADMINISTRATIVE","PERFORMANCE & PAY INITIATIVE (NYAPPI)"," "," "," "," "," "," "," ","1990-01-01"]
["ZJ9","N","PAY ADJUSTMENT BASED ON SALARY RATES APPROVED UNDER"," "," "," "," "," "," "," "," ","1990-01-01"]
["ZK1","N","FULL AMOUNT OF THE PFP MERIT INCREASE ENTITLEMENT CANNOT BE GRANTED","BECAUSE THE ENTITLEMENT WOULD CAUSE THE MAXIMUM RATE TO BE EXCEEDED."," "," "," "," "," "," "," ","1990-01-14"]
["ZK2","N","AUTOMATIC PFP MERIT INCREASE OF 2% GRANTED IN ACCORDANCE WITH GAO ORDER","2540.1. CHAPTER 3-1B(4)."," "," "," "," "," "," "," ","1990-01-14"]
["ZK3","N","SALARY RECALCULATED TO INCLUDE PFP MERIT INCREASE."," "," "," "," "," "," "," "," ","1990-01-14"]
["ZK4","N","PAY SET BASED ON HIGHEST PREVIOUS RATE OF $"," "," "," "," "," "," "," "," ","1991-06-02"]
["ZK5","N","PAY SET BASED ON AUTHORITY TO PAY UP TO 6.67% INCREASE WHEN REASSIGNED."," "," "," "," "," "," "," "," ","1991-06-02"]
["ZK6","Y","COMPLETED SERVICE REQUIREMENT FOR EXCEPTED TENURE FROM *******","TO *******."," "," "," "," "," "," "," ","1991-06-30"]
["ZK7","N","EMPLOYEE IS AUTHORIZED TO RECEIVE SEPARATION INCENTIVE PAY. REEMPLOYMENT","WITHIN 5 YEARS AFTER THE SEPARATION DATE IS SUBJECT TO REPAYMENT OF","SEPARATION PAY TO GAO IN ACCORDANCE WITH GAO INTERIM NOTICE 2551.1","(A-95)."," "," "," "," "," ","1995-07-23"]

{"sheet":"Required & Optional Fields","index":7,"n_rows":228,"n_cols":155,"rows_kept":228,"cut":false,"hidden":false,"merged":[]}
["Element Number","1","2","3","4","5","6","7","8","9","10","11","12","13","14","15","16","17","18","19","20","21","22","23","24","25","26","27","28","29","30","31","32","33","34","35","36","37","38","39","40","41","42","43","44","45","46","47","48","49","50","51","52","53","54","55","56","57","58","59","60","61","62","63","64","65","66","67","68","69","70","71","72","73","74","75","76","77","78","79","80","81","82","83","84","85","86","87","88","89","90","91","92","93","94","95","96","97","98","99","100","101","102","103","104","105","106","107","108","109","110","111","112","113","114","115","116","117","118","119","120","121","122","123","124","125","126","127","128","129","130","131","132","133","134","135","136","137","138","139","140","141","142","143","144","145","146","147","148","149","150","151","152","153","154"]
["NOA CODE","SSNO\n001","DEPARTMENT-CODE\n002","AGCY-CODE\n003","EMPLOYING-OFFICE-CODE\n004","PAY-PERIOD-NUMBER\n005","PP-DATE-PRES-ACTN-EFF\n006","ENTRY-OPER-CODE\n007","NAT-ACT-1ST-3-POS\n008","CSC-AUTH-CODE-1ST-NOA\n009","CSC-AUTH-2ND-CODE-1ST-NOA\n010","NAT-ACT-2ND-3-POS\n011","CSC-AUTH-CODE-2ND-NOA\n012","CSC-AUTH-2ND-CODE-2ND-NOA\n013","ACTION-CODE-350\n014","NAME-EMPLOYEE-LAST\n015","NAME-EMPLOYEE-FIRST\n016","NAME-EMPLOYEE-MIDDLE\n017","SEX-CODE\n018","DATE-OF-BIRTH\n019","EDUCATION-LEVEL\n020","VETERAN-PREF-CODE\n021","PREVIOUS-AGENCY-CODE","DATE-LAST-PAY-STAT-RET","DATE-SICK-LEAVE-EXP-RET","TENURE-GROUP","DATE-SCD-LEAVE","PHYSICAL-HANDICAP-CODE","FEGLI-COVERAGE-CODE","LI-COVERAGE-AMOUNT","FEHB-COVERAGE-CODE","RETIREMENT-COVERAGE-CODE","NAT-ACT-PREV-3-POS","CSC-AUTH-CODE-PREV-NOA","CSC-AUTH-2ND-CODE-PREV-NOA","DATE-CORR-NATURE-ACTN","DATE-NTE-SF50","DATE-PERS-ACTN-EFF","GAIN-LOSE-DEPT-NON-USDA","CSC-OTHER-LEGAL-AUTH","CSC-OTHER-LEGAL-AUTH-2ND","APPNT-LIMIT-DOLR-TOTAL","APPNT-LIMIT-HOURS-TOTAL","APPNT-LIMIT-DAYS-TOTAL","APPNT-LIMIT-DOLR-BALANCE","APPNT-LIMIT-HOURS-BALANCE","APPNT-LIMIT-DAYS-BALANCE","DATE-SERVICE-YEAR-START","PMSO-DEPT","PMSO-AGCY","PMSO-SON","MASTER-RECORD-NUMBER","GRADE","POSITION-NUMBER","POSITION-CLASSIF-CODE","RNO-CODE","PAY-PLAN","STEP","BASE-CONTRACT-SALARY","SALARY-RATE-CODE","PAY-RAISE-VERIFY-SALARY","PAY-RAISE-STALE-ACTN-SAL","PAY-RATE-DETERMINANT-CODE","DATE-RETAIN-RATE-EXPIR","DATE-SCD-CSR","DATE-SCD-RIF","DATE-SCD-WGI","DATE-SUPV-MGR-PROB","POSITION-STATUS-CSC","ANNUITANT-INDICATOR","SPEC-EMPLOYMENT-PGMS-CODE","REMARK-CODE","DATE-PROB-PERIOD-START","DATE-CAR-ERM-TEN-START","ANNUAL-LEAVE-CATEGORY","ANNUAL-LEAVE-45-DAY-CODE","LEAVE-EARNING-STATUS-PP","DATE-ENTERED-PRES-GRADE","TSP-ELIGIBILITY-CODE","VETERAN-STATUS","NAME-CORRECTION-CODE","SSNO-OLD","TOUR-OF-DUTY-HOURS","PROMOTION-PLAN-CODE","TYPE-APPOINTMENT-CODE","SPECIAL-EMPLOYEE-CODE","CITIZENSHIP-CODE","COLA-POST-DIFF-CODE","WAGE-BOARD-SHIFT-RATE-VAR","COOP-ANNUIT-SHARE-CODE","COOP-STATE-SHARE-SALARY","ANNUITANT SHARE AMT","COOP-EMT-OT RATE-FURNISHED","COOP-EMP-HOLRATE-FURNISHED","QUARTERS-DEDUCTION-RATE","QUARTERS-DEDUCTION-CODE","FMHA-COMMITTEE-TRAV-ALLOW","DATE-DEGREE-RCVD-CTR-YR","INSTRUCTIONAL-PROGRAM","AGENCY-USE","DATE-TSP-VESTED","UNIFORM-SERVICE-STATUS","FROZEN-CSRS-SERVICE","CSRS-COVERAGE-AT-APPNT","CRED-MILITARY-SERVICE","DATE-RETIRED-MILITARY","VETERAN-PREF-RIF","WORK SCHEDULE","RELOCATION-BONUS","RECRUITMENT-BONUS","SUPVY-PERCENT","RETENTION-PERCENT","PRES-STATUS-CODE","AWARDS-CASE-NUMBER","DATE-CASH-AWARD-FROM-MO","DATE-CASH-AWARD-TO-MO","CASH-AWARD-CODE","TANGIBLE BENEFITS","FIRST-YEAR-SAVINGS","INTANGIBLE-BENEFITS","NO-PERSONS-CASH-AWARD","CURRENT-CASH-AWARD","ELEMENT7-1","AMT-PD-EXTERNAL-SOURCE","CASH-AWARD-PAY-CODE","ACCTG-DISTRIBUTION","CASH-AWARD-AGCY-CHARGED","CASH-AWARD-ACCT-STA-CHG","CHECK-MAIL-ADDR-IND","SUPERVISORY/MANAGERIAL PROBATIONARY PERIOD REQUIRED","PAY-RAISE-STALE-ACTN-SAL","SAV-GR-GRADE","SAV-GR-PAY-PLAN","SAV-GR-OCC-SERIES","SAV-GR-OCC-SER-FUN-CODE","CASH-AWARD-TYPE-CODE",null,"STORED-ACCTG-IND","ADDRESS LINE 1","ADDRESS LINE 2","ADDRESS CITY NAME","ADDRESS STATE NAME","POSTAL CODE 5","POSTAL CODE 4","DESIGNATED AGENT","AWARD HOURS","VERIFY AWARD HOURS","CSRS-PREV-COV-IND","FERS-PREV-COV-IND","LV-CEIL-REASON","ERI-CODE","DATE-CBPO-RET-SCD","SPECIAL-POSITION-CD","VAR-FT-REG-TOD-PT-EMP","FEGLI-COURT-ORDER"]
["NOAC","SSN","DEPT","AGCY-CODE","POI","EFF PAY PERIOD","AUTH DATE","OPER INIT","1ST NOA CODE","1A AUTH CODE","1B AUTH CODE","2ND NOA CODE","2A AUTH CODE","2B AUTH CODE","ACTION CODE","NAME LAST","NAME FIRST","NAME MIDDLE","SEX","BIRTHDAY","EDUCATION LEVEL","VETERAN PREF","PREVIOUS AGENCY","LAST DAY IN PAY","PROJECTED SICK LV","TENURE GROUP","SCD LEAVE","HANDICAP","FEGLI COVERAGE","FEGLI AMT","FEHB COVERAGE","RETIREMENT COVERAGE","NOA","AUTH","2ND AUTH","CORR DATE","NTE DATE","EFFECTIVE DATE","LOSE/GAIN DEPT","LEGAL AUTHORITY 1ST","LEGAL AUTHORITY 2ND","FULL (DOLLARS)","FULL (HOURS)","FULL (DAYS)","BALANCE (DOLLARS)","BALANCE (HOURS)","BALANCE (DAYS)","COMMENCING DATE OF SERVICE YEAR","PMSO DEPARTMENT","PMSO AGCY","PMSO POI","PMSO MR","PMSO GRADE","PMSO IP","CLASSIFICATION ACTION","RNO","PAY PLAN","STEP","BASE SALARY","SALARY RATE CD","VERIFY SALARY","MERIT INCREASE","PAY RATE DETERMINANT CODE","GRADE RETENTION DATE","SCD RET","SCD RIF","SCD WGI","SUPV/MGRL PROB PERIOD","POSITION OCCUPIED","ANNUITANT INDICATOR","SPECIAL EMPLOYMENT PGMS CODE","REMARKS","PROBATIONARY/TRIAL DATE","CAREER TENURE DATE","AL CATEGORY","45 DAYS - A/L","LEAVE EARNING STATUS","DATE LAST ENTERED GRADE","TSP ELIG","VETERANS STATUS","NAME CORR","PREVIOUS SSN","DUTY HOURS","PROMOTION PLAN","TYPE APPT","SPECIAL EMPLOYEE CODE","CITIZENSHIP STATUS","COLA AND/OR POST DIFF CODE","SHIFT RATE","SALARY SHARE CODE","SALARY SHARE AMT","ANNUITANT SHARE AMT","COOP OVERTIME RATE","COOP HOLIDAY RATE","QUARTERS DED AMT","QUARTERS DED CODE","TRAVEL ALLOW/ENVIRON DIFF","YR DEGR/CERT RECEIVED","INSTRUCTIONAL PGM","AGENCY USE","SCD TSP","UNIFORM SERVICE","FROZEN SERVICE","PREV RET COVERAGE","CREDITABLE MILITARY SVS","DATE RETIRED MILITARY","VETERANS PREF RIF","WORK SCHEDULE","BONUS AMT","BONUS AMT","SUPVY PCT","ALLOWANCE PCT","STATUS","CASE NUMBER","PERIOD COVERED FROM DATE","PERIOD COVERED TO DATE","AWARD CODE","TANGIBLE BENEFITS","FIRST YR SAVINGS","INTANGIBLE BENEFITS","NO PERSONS RECEVING AWD","AMOUNT OF AWARD","VERIFY AMOUNT OF AWARD","AMT PD BY NON GOVT SOURCE","GENERATE PAYMENT","ACCOUNTING CODE","AGENCY-CHARGED","ACCOUNTING STAT CHARGED","ADDRESS INDICATOR","SUP MGR PROB PER REQ","ADJ SALARY","OCCUPIED GRADE","OCCUPIED PAYPLAN","OCCUPIED OCC-SERIES-CD","OCCUPIED OCC-FUNC-CD","CASH AWD TYPE CD",null,"STORED ACCTG IND","ADDRESS","ADDRESS 2","CITY","STATE","POSTAL","ZIP+4","DESIGNATED AGENT","AWARD HOURS","VERIFY AWARD HOURS","CSRS COV PRIOR TO APPT","FERS COV PRIOR TO APPT","REASON FOR PERSONAL AL CEILING","ETHNICITY-RACE INDICATOR CODES","SCD FOR CBPO RETIREMENT","SPECIAL POPULATION CODE","POSITION TOD IF PT EMPLOYEE WORKED FT","FEGLI COVERAGE ORDERED BY COURTS"]
["006","R","R","R","R","R","R","R","R","O","O","O","O","O","S","R","R","O"," "," ","O"," "," "," "," "," "," ","O"," ","O"," "," "," "," "," "," "," ","R"," ","O","O","O","O","O","O","O","O","O"," "," "," "," "," "," "," "," "," "," "," "," "," "," "," ","O","O","O","O","O"," "," ","O"," ","O","O","O","O"," "," "," "," "," "," "," "," "," ","O","O","O"," ","O","O"," "," "," ","O","O"," ","O","O"," "," ","O","O"," ","O","O"," "," "," "," "," "," ","R"," "," "," "," "," "," "," "," "," "," "," "," "," "," "," "," "," "," "," "," "," "," "," "," "," "," "," "," "," "," "," "," "," "," "," "," "," "," "," "," "," "," "]
["100","R","R","R","R","R","R","R","R","O","O","O","O","O","S","R","R","O","R","R","R","R"," "," "," ","R","R","R","R","O","R","R"," "," "," "," "," ","R","R","O","O"," "," "," "," "," "," "," ","R","R","R","R","R","R"," "," ","R","R","R","O","R"," ","R"," ","R","O","O","O"," ","R","O","O","O","O","R","R","R","R","R","R"," "," ","O"," ","R","R","R","R"," ","O","O","O","O","O","O","O"," ","O","O","O","O","R","O","R","O","O","R","R"," "," "," "," ","R"," "," "," "," "," "," "," "," "," "," "," "," "," "," "," "," ","O","O"," "," "," "," "," "," "," "," "," "," "," "," "," "," "," "," ","R","R","O","R","O","O","O"," "]
["101","R","R","R","R","R","R","R","R","O","O","O","O","O","S","R","R","O","R","R","R","R"," "," "," ","R","R","R","R","O","R","R"," "," "," "," "," ","R","R","O","O"," "," "," "," "," "," "," ","R","R","R","R","R","R"," "," ","R","R","R","O","R"," ","R"," ","R","O","O","O"," ","R","O","O","R","O","R","R","R","R","R","R"," "," ","O"," ","R","R","R","R"," ","O","O","O","O","O","O","O"," ","O","O","O","O","R","O","R","O","O","R","R"," "," "," "," ","R"," "," "," "," "," "," "," "," "," "," "," "," "," "," "," "," ","O","O"," "," "," "," "," "," "," "," "," "," "," "," "," "," "," "," ","R","R","O","R","O","O","O"," "]
["102","R","R","R","R","R","R","R","R","O","O","O","O","O","S","R","R","O","R","R","R","R"," "," "," ","R","R","R","R","O","R","R"," "," "," "," "," ","R","R","O","O"," "," "," "," "," "," "," ","R","R","R","R","R","R"," ","R","R","R","R","O","O"," ","R"," ","R","O","R","O"," ","O","R","O","O"," ","R","R","R","O","R","R"," "," ","O"," ","R","R","R","R"," ","O","O","O","O","O","O","O"," ","O","O","O","O","R","O","R","O","O","R","R"," "," "," "," ","R"," "," "," "," "," "," "," "," "," "," "," "," "," "," "," "," ","O","O"," "," "," "," "," "," "," "," "," "," "," "," "," "," "," "," "," "," "," "," "," "," "," "," "]
["103","R","R","R","R","R","R","R","R","O","O","O","O","O","S","R","R","O","R","R","R","R"," "," "," ","R","R","R","R","O","R","R"," "," "," "," "," ","R","R","O","O"," "," "," "," "," "," "," ","R","R","R","R","R","R"," ","R","R","R","R","O","O"," ","R"," ","O","O","O","O"," ","O","R","O","O","R","R","R","R","O","R","R"," "," ","O"," ","R","R","R","R"," ","O","O","O","O","O","O","O"," ","O","O","O","O","O","O","R","O","O","R","R"," "," "," "," ","R"," "," "," "," "," "," "," "," "," "," "," "," "," "," "," "," "," ","O"," "," "," "," "," "," "," "," "," "," "," "," "," "," "," "," "," "," "," "," "," "," "," "," "]
["104","R","R","R","R","R","R","R","R","O","O","O","O","O","S","R","R","O","R","R","R","R"," "," "," ","R","R","R","R","O","R","R"," "," "," "," "," ","R","R","O","O"," "," "," "," "," "," "," ","R","R","R","R","R","R"," ","R","R","R","R","O","O"," ","R"," ","R","O","R","O"," ","O","R","S"," "," ","S","S","S","S","S","S"," "," ","O"," ","R","R","R","R"," ","O","O","O"," "," ","O","O"," ","O","O","O"," ","O","O","R","O","O","R","R"," "," "," "," ","R"," "," "," "," "," "," "," "," "," "," "," "," "," "," "," "," "," ","O"," "," "," "," "," "," "," "," "," "," "," "," "," "," "," "," "," "," "," "," "," "," "," "," "]
["107","R","R","R","R","R","R","R","R","O","O","O","O","O","S","R","R","O","R","R","R","R"," "," "," ","R","R","R","R"," ","R","R"," "," "," "," "," ","R","R","O","O"," "," "," "," "," "," "," ","R","R","R","R","R","R"," "," ","R","R","R","O","R"," ","R"," ","O","O","O","O"," ","R","O","O"," ","O","R","R","R","R","R","R"," "," ","O"," ","R","R","R","R"," ","O","O","O"," "," ","O","O"," ","O","O","O","O","R","O","R","O","O","R","R"," "," "," "," ","R"," "," "," "," "," "," "," "," "," "," "," "," "," "," "," "," ","O","O"," "," "," "," "," "," "," "," "," "," "," "," "," "," "," "," ","R","R","O","R","O","O","O"," "]
["108","R","R","R","R","R","R","R","R","O","O","O","O","O","S","R","R","O","R","R","R","R"," "," "," ","R","R","R","R"," ","R","R"," "," "," "," ","R","R","R","O","O","O","O","O","O","O","O","O","R","R","R","R","R","R"," "," ","R","R","R","O","R"," ","R"," ","O","O","O","O"," ","R","O","O","O","O","R","R","R","R","R","R"," "," ","O"," ","R","R","R","R"," ","O","O","O"," "," ","O","O"," ","O","O","O","O","R","O","R","O","O","R","R"," "," "," "," ","R"," "," "," "," "," "," "," "," "," "," "," "," "," "," "," "," ","O","O"," "," "," "," "," "," "," "," "," "," "," "," "," "," "," "," ","R","R","O","R","O","O","O"," "]
["112","R","R","R","R","R","R","R","R","O","O","O","O","O","S","R","R","O","R","R","R","R"," "," "," ","R","R","R","R","O","R","R"," "," "," "," "," ","R","R","O","O"," "," "," "," "," "," "," ","R","R","R","R","R","R"," "," ","R","R","R","O","R"," ","R"," ","O","O","O","O"," ","R","O","O"," ","O","R","R","R","R","R","R"," "," ","O"," ","R","R","R","R"," ","O","O","O","O","O","O","O"," ","O","O","O"," ","R","O","R","O","O","R","R"," "," "," "," ","R"," "," "," "," "," "," "," "," "," "," "," "," "," "," "," "," ","O","O"," "," "," "," "," "," "," "," "," "," "," "," "," "," "," "," ","R","R","O","R","O","O","O"," "]
["115","R","R","R","R","R","R","R","R","O","O","O","O","O","S","R","R","O","R","R","R","R"," "," "," ","R","R","R","R","O","R","R"," "," "," "," ","R","R","R","O","O","O","O","O","O","O","O","O","R","R","R","R","R","R"," "," ","R","R","R","O","R"," ","R"," ","O","O","O","O"," ","R","O","O","O","O","R","R","O","R","R","R"," "," ","O"," ","R","R","R","R"," ","O","O","O"," "," ","O","O"," ","O","O","O"," ","R","O","R","O","O","R","R"," "," "," "," ","R"," "," "," "," "," "," "," "," "," "," "," "," "," "," "," "," ","O","O"," "," "," "," "," "," "," "," "," "," "," "," "," "," "," "," ","R","R","O","R","O","O","O"," "]
["117","R","R","R","R","R","R","R","R","O","O","O","O","O","S","R","R","O","R","R","R","R"," "," "," ","R","R","R","R","O","R","R"," "," "," "," ","R","R","R","O","O","O","O","O","O","O","O","O","R","R","R","R","R","R"," ","R","R","R","R","O","R"," ","R"," ","O","O"," "," "," ","R","O","O"," ","O","R","R","R","R","R","R"," "," ","O"," ","R","R","R","R"," ","O","O","O"," "," ","O","O"," ","O","O","O"," ","R","O","R","O","O","R","R"," "," "," "," ","R"," "," "," "," "," "," "," "," "," "," "," "," "," "," "," "," "," ","O"," "," "," "," "," "," "," "," "," "," "," "," "," "," "," "," "," "," "," "," "," "," "," "," "]
["120","R","R","R","R","R","R","R","R","O","O","O","O","O","S","R","R","O","R","R","R","R"," "," "," ","R","R","R","R","O","R","R"," "," "," "," "," ","R","R","O","O","O","O","O","O","O","O","O","R","R","R","R","R","R"," "," ","R","R","R","O","R"," ","R"," ","O","O","O","O"," ","R","O","O","R","O","R","R","R","R","R","R"," "," ","O"," ","R","R","R","R"," ","O","O","O"," "," ","O","O"," ","O","O","O"," ","R","O","R","O","O","R","R"," "," "," "," ","R"," "," "," "," "," "," "," "," "," "," "," "," "," "," "," "," ","O","O"," "," "," "," "," "," "," "," "," "," "," "," "," "," "," "," ","R","R","O","R","O","O","O"," "]
["122","R","R","R","R","R","R","R","R","O","O","O","O","O","S","R","R","O","R","R","R","R"," "," "," ","R","R","R","R","O","R","O"," "," "," "," ","O","R","O","O","O","O","O","O","O","O","O","O","R","R","R","R","R","R"," "," ","R","R","R","O","R"," ","R"," ","O","O","O","O"," ","O","O","O","O","O","R","R","R","R","R","R"," "," ","O"," ","R","R","R","R"," ","O","O","O"," "," ","O","O"," ","O","O","O"," ","R","O","R","O","O","R","R"," "," "," "," ","R"," "," "," "," "," "," "," "," "," "," "," "," "," "," "," "," ","O","O"," "," "," "," "," "," "," "," "," "," "," "," "," "," "," "," ","R","R","O","R","O","O","O"," "]
["124","R","R","R","R","R","R","R","R","O","O","O","O","O","S","R","R","O","R","R","R","R"," "," "," ","R","R","R","R","O","R","R"," "," "," "," "," ","R","R","O","O"," "," "," "," "," "," "," ","R","R","R","R","R","R"," "," ","R","R","R","O","R"," ","R"," ","O","O","O","O"," ","R","O","O"," ","O","R","R","R","R","R","R"," "," ","O"," ","R","R","R","R"," ","O","O","O","O","O","O","O"," ","O","O","O"," ","R","O","R","O","O","R","R"," "," "," "," ","R"," "," "," "," "," "," "," "," "," "," "," "," "," "," "," "," ","O","O"," "," "," "," "," "," "," "," "," "," "," "," "," "," "," "," ","R","R","O","R","O","O","O"," "]
["128","R","R","R","R","R","R","R","R","O","O","O","O","O","S","R","R","O","R","R","R","R"," "," "," ","R","R","R","R"," ","R","R"," "," "," "," "," ","R","R","O","O"," "," "," "," "," "," "," ","R","R","R","R","R","R"," ","R","R","R","R","O","O"," ","R"," ","R","O","R"," "," ","O","R","O","O"," ","R","R","R","O","R","R"," "," ","O"," ","R","R","R","R"," ","O","O","O"," "," ","O","O"," ","O","O","O"," ","R","O","R","O","O","R","R"," "," "," "," ","R"," "," "," "," "," "," "," "," "," "," "," "," "," "," "," "," "," ","O"," "," "," "," "," "," "," "," "," "," "," "," "," "," "," "," "," "," "," "," "," "," "," "," "]
["130","R","R","R","R","R","R","R","R","O","O","O","O","O","S","R","R","O","R","R","R","R"," "," "," ","R","R","R","R","O","R","R"," "," "," "," "," ","R","R","O","O"," "," "," "," "," "," "," ","R","R","R","R","R","R"," "," ","R","R","R","O","R"," ","R"," ","R","O","O","O"," ","R","O","O","O","O","R","R","R","R","R","R"," "," ","O"," ","R","R","R","R"," ","O","O","O"," "," ","O","O"," ","O","O","O","O","R","O","R","O","O","R","R"," "," "," "," ","R"," "," "," "," "," "," "," "," "," "," "," "," "," "," "," "," ","O","O"," "," "," "," "," "," "," "," "," "," "," "," "," "," "," "," ","R","R","O","R","O","O","O"," "]
["132","R","R","R","R","R","R","R","R","O","O","O","O","O","S","R","R","O","R","R","R","R"," "," "," ","R","R","R","R","O","R","R"," "," "," "," "," ","R","R","O","O","O","O","O","O","O","O","O","R","R","R","R","R","R"," "," ","R","R","R","O","R"," ","R","O","R","O","O","O","O","R","O","O","R","O","R","R","R","R","R","R"," "," ","O"," ","R","R","R","R"," ","O","O","O","O","O","O","O"," ","O","O","O","O","R","R","R","O","O","R","R"," "," "," "," ","R"," "," "," "," "," "," "," "," "," "," "," "," "," "," "," "," ","O","O"," "," "," "," "," "," "," "," "," "," "," "," "," "," "," "," ","R","R","O","R","O","O","O"," "]
["140","R","R","R","R","R","R","R","R","O","O","O","O","O","S","R","R","O","R","R","R","R"," "," "," ","R","R","R","R","O","R","R"," "," "," "," "," ","R","R","O","O"," "," "," "," "," "," "," ","R","R","R","R","R","R"," "," ","R","R","R","O","R"," ","R"," ","R","O","O","O"," ","R","O","O","O","O","R","R","R","R","R","R"," "," ","O"," ","R","R","R","R"," ","O","O","O"," "," ","O","O"," ","O","O","O","O","R","O","R","O","O","R","R"," "," "," "," ","R"," "," "," "," "," "," "," "," "," "," "," "," "," "," "," "," ","O","O"," "," "," "," "," "," "," "," "," "," "," "," "," "," "," "," ","R","R","O","R","O","O","O"," "]
["141","R","R","R","R","R","R","R","R","O","O","O","O","O","S","R","R","O","R","R","R","R"," "," "," ","R","R","R","R","O","R","R"," "," "," "," "," ","R","R","O","O"," "," "," "," "," "," "," ","R","R","R","R","R","R"," "," ","R","R","R","O","R"," ","R"," ","R","O","O","O"," ","O","O","O","O","O","R","R","R","O","R","R"," "," ","O"," ","R","O","R","R"," ","O","O","O","O","O","O","O"," ","O","O","O","O","R","O","R","O","O","R","R"," "," "," "," ","R"," "," "," "," "," "," "," "," "," "," "," "," "," "," "," "," ","O","O"," "," "," "," "," "," "," "," "," "," "," "," "," "," "," "," ","R","R","O","R","O","O","O"," "]
["142","R","R","R","R","R","R","R","R","O","O","O","O","O","S","R","R","O","R","R","R","R"," "," "," ","R","R","R","R","O","R","R"," "," "," "," "," ","R","R","O","O"," "," "," "," "," "," "," ","R","R","R","R","R","R"," "," ","R","R","R","O","R"," ","R"," ","R","O"," ","O","R","R","O","O","O","O","R","R","R","R","R","R"," "," ","O"," ","R","R","R","R"," ","O","O","O"," "," ","O","O"," ","O","O","O","O","R","O","R","O","O","R","R"," "," "," "," ","R"," "," "," "," "," "," "," "," "," "," "," "," "," "," "," "," ","O","O"," "," "," "," "," "," "," "," "," "," "," "," "," "," "," "," ","R","R","O","R"," ","O","O"," "]
["143","R","R","R","R","R","R","R","R","O","O","O","O","O","S","R","R","O","R","R","R","R"," "," "," ","R","R","R","R","O","R","R"," "," "," "," "," ","R","R","O","O"," "," "," "," "," "," "," ","R","R","R","R","R","R"," "," ","R","R","R","O","R"," ","R"," ","R","O"," ","O","R","R","O","O","O","O","R","R","R","R","R","R"," "," ","O"," ","R","R","R","R"," ","O","O","O"," "," ","O","O"," ","O","O","O","O","R","O","R","O","O","R","R"," "," "," "," ","R"," "," "," "," "," "," "," "," "," "," "," "," "," "," "," "," ","O","O"," "," "," "," "," "," "," "," "," "," "," "," "," "," "," "," ","R","R","O","R"," ","O","O"," "]
["145","R","R","R","R","R","R","R","R","O","O","O","O","O","S","R","R","O","R","R","R","R"," "," "," ","R","R","R","R","O","R","R"," "," "," "," "," ","R","R","O","O"," "," "," "," "," "," "," ","R","R","R","R","R","R"," "," ","R","R","R","O","R"," ","R"," ","R","O"," ","O","R","R","O","O","O","O","R","R","R","R","R","R"," "," ","O"," ","R","R","R","R"," ","O","O"," "," "," ","O","O"," ","O","O","O","O","R","O","R","O","O","R","R"," "," "," "," ","R"," "," "," "," "," "," "," "," "," "," "," "," "," "," "," "," ","O","O"," "," "," "," "," "," "," "," "," "," "," "," "," "," "," "," ","R","R","O","R"," ","O","O"," "]
["146","R","R","R","R","R","R","R","R","O","O","O","O","O","S","R","R","O","R","R","R","R"," "," "," ","R","R","R","R","O","R","R"," "," "," "," "," ","R","R","O","O"," "," "," "," "," "," "," ","R","R","R","R","R","R"," "," ","R","R","R","O","R"," ","R"," ","R"," "," ","O","R","R","O","O","O","O","R","R","O","R","R","R"," "," ","O"," ","R","R","R","R"," ","O"," "," "," "," ","O","O"," ","O","O","O","O","R","O","R","O","O","R","R"," "," "," "," ","R"," "," "," "," "," "," "," "," "," "," "," "," "," "," "," "," ","O","O"," "," "," "," "," "," "," "," "," "," "," "," "," "," "," "," ","R","R","O","R"," ","O","O"," "]
["147","R","R","R","R","R","R","R","R","O","O","O","O","O","S","R","R","O","R","R","R","R"," "," "," ","R","R","R","R","O","R","R"," "," "," "," "," ","R","R","O","O"," "," "," "," "," "," "," ","R","R","R","R","R","R"," "," ","R","R","R","O","R"," ","R"," ","R"," "," ","O","R","R","O","O","O","O","R","R","R","R","R","R"," "," ","O"," ","R","R","R","R"," ","O","O"," "," "," ","O","O"," ","O","O","O","O","R","O","R","O","O","R","R"," "," "," "," ","R"," "," "," "," "," "," "," "," "," "," "," "," "," "," "," "," ","O","O"," "," "," "," "," "," "," "," "," "," "," "," "," "," "," "," ","R","R","O","R"," ","O","O"," "]
["148","R","R","R","R","R","R","R","R","O","O","O","O","O","S","R","R","O","R","R","R","R"," "," "," ","R","R","R","R","O","R","R"," "," "," "," ","R","R","R","O","O","O","O","O","O","O","O"," ","R","R","R","R","R","R"," "," ","R","R","R","O","R"," ","R"," ","O"," "," ","O","R","R","O","O"," ","O","R","R","R","R","R","R"," "," ","O"," ","R","R","R","R"," ","O","O","O"," "," ","O","O"," ","O","O","O","O","R","O","R","O","O","R","R"," "," "," "," ","R"," "," "," "," "," "," "," "," "," "," "," "," "," "," "," "," ","O","O"," "," "," "," "," "," "," "," "," "," "," "," "," "," "," "," ","R","R","O","R"," ","O","O"," "]
["149","R","R","R","R","R","R","R","R","O","O","O","O","O","S","R","R","O","R","R","R","R"," "," "," ","R","R","R","R","O","R","R"," "," "," "," ","R","R","R","O","O","O","O","O","O","O","O"," ","R","R","R","R","R","R"," "," ","R","R","R","O","R"," ","R"," ","O"," "," ","O","R","R","O","O"," ","O","R","R","R","R","R","R"," "," ","O"," ","R","R","R","R"," ","O","O","O"," "," ","O","O"," ","O","O","O","O","R","O","R","O","O","R","R"," "," "," "," ","R"," "," "," "," "," "," "," "," "," "," "," "," "," "," "," "," ","O","O"," "," "," "," "," "," "," "," "," "," "," "," "," "," "," "," ","R","R","O","R"," ","O","O"," "]
["170","R","R","R","R","R","R","R","R","O","O","O","O","O","S","R","R","O","R","R","R","R"," "," "," ","R","R","R","R","O","R","R"," "," "," "," "," ","R","R","O","O","O","O","O","O","O","O","O","R","R","R","R","R","R"," "," ","R","R","R","O","R"," ","R"," ","O","O","O","O"," ","R","O","O","O","O","R","R","R","R","R","R"," "," ","O"," ","R","R","R","R"," ","O","O","O","O","O","O","O"," ","O","O","O","O","R","O","R","O","O","R","R"," "," "," "," ","R"," "," "," "," "," "," "," "," "," "," "," "," "," "," "," "," ","O","O"," "," "," "," "," "," "," "," "," "," "," "," "," "," "," "," ","R","R","O","R","O","O","O"," "]
["171","R","R","R","R","R","R","R","R","O","O","O","O","O","S","R","R","O","R","R","R","R"," "," "," ","R","R","R","R","O","R","R"," "," "," "," ","R","R","R","O","O","O","O","O","O","O","O","O","R","R","R","R","R","R"," "," ","R","R","R","O","O"," ","R"," ","O","O","O","O"," ","R","O","O","O","O","R","R","R","R","R","R"," "," ","O"," ","R","R","R","R"," ","O","O","O","O","O","O","O"," ","O","O","O","O","R","O","R","O","O","R","R"," "," "," "," ","R"," "," "," "," "," "," "," "," "," "," "," "," "," "," "," "," ","O","O"," "," "," "," "," "," "," "," "," "," "," "," "," "," "," "," ","R","R","O","R","O","O","O"," "]
["172","R","R","R","R","R","R","R","R","O","O","O","O","O","S","R","R","O","R","R","R","R"," "," "," ","R","R","R","R","R","R","R"," "," "," "," "," ","R","R","O","O","O","O","O","O","O","O"," ","R","R","R","R","R","R"," ","R","R","R","R","O","R"," ","R"," ","R","O","O","O"," ","R","O","O"," ","O","R","R","R","R","R","R"," "," ","O"," ","R","R","R","R"," ","O","O","O","O","O","O","O"," ","O","O","O","O","R","O","R","O","O","R","R"," "," "," "," ","R"," "," "," "," "," "," "," "," "," "," "," "," "," "," "," "," ","O","O"," "," "," "," "," "," "," "," "," "," "," "," "," "," "," "," "," "," "," "," "," "," "," "," "]
["173","R","R","R","R","R","R","R","R","O","O","O","O","O","S","R","R","O","R","R","R","R"," "," "," ","R","R","R","R","O","R","R"," "," "," "," ","O","R","R","O","O"," "," "," "," "," "," "," ","R","R","R","R","R","R"," "," ","R","R","R","O","R"," ","R"," ","R","O","R","O"," ","R","O","O","R","R","R","R","R","R","R","R"," "," ","O"," ","R","R","R","R"," ","O","O","O","O","O","O","O"," ","O","O","O","O","R","O","R","O","O","R","R"," "," "," "," ","R"," "," "," "," "," "," "," "," "," "," "," "," "," "," "," "," ","O","O"," "," "," "," "," "," "," "," "," "," "," "," "," "," "," "," ","R","R","O","R","O","O","O"," "]
["190","R","R","R","R","R","R","R","R","O","O","O","O","O","S","R","R","O","R","R","R","R"," "," "," ","R","R","R","R","O","R","R"," "," "," "," ","R","R","R","O","O"," "," "," "," "," "," "," ","R","R","R","R","R","R"," "," ","R","R","R","O","R"," ","R"," ","R","O","O","O","R","R","O","O","R","R","R","R","R","R","R","R"," "," ","O"," ","R","R","R","R"," ","O","O","O","O","O","O","O"," ","O","O","O","O","R","O","R","O","O","R","R"," "," "," "," ","R"," "," "," "," "," "," "," "," "," "," "," "," "," "," "," "," ","O","O"," "," "," "," "," "," "," "," "," "," "," "," "," "," "," "," ","R","R","O","R","O","O","O"," "]
["198","R","R","R","R","R","R","R","R","O","O","O","O","O","S","R","R","O","R","R","R","R"," "," "," ","R","R","R","R","O","R","R"," "," "," "," "," ","R","R","O","O"," "," "," "," "," "," "," ","R","R","R","R","R","R"," "," ","R","R","R","O","R"," ","R"," ","O","O","R","O","O","R","O","O","O","O","R","R","R","R","R","R"," "," ","O"," ","R","R","R","R"," ","O","O"," "," "," ","O","O"," ","O","O","O","O","R"," "," "," "," ","R","R"," "," "," "," ","R"," "," "," "," "," "," "," "," "," "," "," "," "," "," "," "," ","O","O"," "," "," "," "," "," "," "," "," "," "," "," "," "," "," "," ","R","R","O","R","O","O","O"," "]
["199","R","R","R","R","R","R","R","R","O","O","O","O","O","S","R","R","O","R","R","R","R"," "," "," ","R","R","R","R","O","R","R"," "," "," "," "," ","R","R","O","O"," "," "," "," "," "," "," ","R","R","R","R","R","R"," "," ","R","R","R","R","R"," ","R"," ","R","O","R"," "," ","R","O","O"," ","O","R","R","R","R","R","R"," "," ","O"," ","R","R","R","R"," ","O","O"," "," "," ","O","O"," ","O","O","O","O","R"," "," "," "," ","R","R"," "," "," "," ","R"," "," "," "," "," "," "," "," "," "," "," "," "," "," "," "," ","O","O"," "," "," "," "," "," "," "," "," "," "," "," "," "," "," "," ","R","R","O","R","O","O","O"," "]
["280","R","R","R","R","R","R","R","R","O","O","O","O","O","S","R","R","O"," "," "," "," "," "," "," "," ","O"," ","O","O"," "," "," "," "," "," "," ","R"," ","O","O"," "," "," "," "," "," "," "," "," "," "," "," "," "," "," ","R"," ","O"," ","O"," ","O"," ","O","O"," "," "," "," "," ","O"," "," "," "," ","O","O"," "," "," "," "," "," "," "," "," "," "," "," "," "," "," "," "," "," "," "," "," ","O"," "," "," "," "," "," "," "," "," "," "," "," ","R"," "," "," "," "," "," "," "," "," "," "," "," "," "," "," "," "," ","O"," "," "," "," "," "," "," "," "," "," "," "," "," "," "," "," "," "," "," "," "," "," "," "," "]
["292","R","R","R","R","R","R","R","R","O","O","O","O","O","S","R","R","O"," "," ","O"," "," "," "," "," ","O"," ","O","O"," "," "," "," "," "," "," ","R"," ","O","O"," "," "," "," "," "," "," "," "," "," "," "," "," "," "," "," "," "," "," "," "," "," "," ","O","O"," "," "," "," "," ","O"," "," "," "," ","O","O"," "," "," "," ","O"," "," "," "," "," "," "," "," "," "," "," "," "," "," ","O","O","O"," "," "," "," "," "," "," ","O"," "," "," "," ","R"," "," "," "," "," "," "," "," "," "," "," "," "," "," "," "," "," "," "," "," "," "," "," "," "," "," "," "," "," "," "," "," "," "," "," "," "," "," "," "," "," "," "]
["293","R","R","R","R","R","R","R","R","O","O","O","O","O","S","R","R","O"," "," "," "," "," "," "," "," ","O"," ","O","O"," "," "," "," "," "," "," ","R"," ","O","O"," "," "," "," "," "," "," ","R","R","R","R","R","R"," "," "," "," ","R"," ","R"," ","O"," ","O","O"," "," "," "," "," ","O"," "," "," "," ","O","O"," "," "," "," "," "," "," "," "," "," "," "," "," "," "," "," "," "," "," "," "," ","O"," "," "," "," "," "," "," "," "," "," "," "," ","R"," "," "," "," "," "," "," "," "," "," "," "," "," "," "," "," "," ","O"," "," "," "," "," "," "," "," "," "," "," "," "," "," "," "," "," "," "," "," "," "," "," "," "]
["300","R","R","R","R","R","R","R","R","O","O","O","O","O","S","R","R","O"," "," "," "," "," ","R","O"," "," "," "," "," "," "," "," "," "," "," "," ","R","R","O","O"," "," "," "," "," "," "," "," "," "," "," "," "," ","R"," "," "," "," "," "," "," "," "," "," "," "," "," "," "," "," ","O"," "," "," "," ","O"," "," "," "," "," "," "," "," "," "," "," "," "," "," "," "," "," "," "," "," "," "," ","O"," "," "," "," "," "," "," "," "," "," "," "," ","R"," "," "," "," "," "," "," "," "," "," "," "," "," "," "," "," "," "," "," "," "," "," "," "," "," "," "," "," "," "," "," "," "," "," "," "," "," "," "," "," "," ","O"]
["301","R","R","R","R","R","R","R","R","O","O","O","O","O","S","R","R","O"," "," "," "," "," ","R","O"," "," "," "," "," "," "," "," "," "," "," "," ","R","R","O","O"," "," "," "," "," "," "," "," "," "," "," "," "," ","R"," "," "," "," "," "," "," "," "," "," "," "," "," "," "," "," ","O"," "," "," "," ","O"," "," "," "," "," "," "," "," "," "," "," "," "," "," "," "," "," "," "," "," "," "," ","O"," "," "," "," "," "," "," "," "," "," "," "," ","R"," "," "," "," "," "," "," "," "," "," "," "," "," "," "," "," "," "," "," "," "," "," "," "," "," "," "," "," "," "," "," "," "," "," "," "," "," "," "," "," "," ","O"]
["302","R","R","R","R","R","R","R","R","O","O","O","O","O","S","R","R","O"," "," "," "," "," ","R","O"," "," "," "," "," "," "," "," "," "," "," "," ","R","R","O","O"," "," "," "," "," "," "," "," "," "," "," "," "," ","R"," "," "," "," "," "," "," "," "," "," "," "," "," "," "," "," ","O"," "," "," "," ","O"," "," "," "," "," "," "," "," "," "," "," "," "," "," "," "," "," "," "," "," "," "," ","O"," "," "," "," "," "," "," "," "," "," "," "," ","R"," "," "," "," "," "," "," "," "," "," "," "," "," "," "," "," "," "," "," "," "," "," "," "," "," "," "," "," "," "," "," "," "," "," "," "," "," "," "," "," "," ","O"]
["303","R","R","R","R","R","R","R","R","O","O","O","O","O","S","R","R","O"," "," "," "," "," ","R","O"," "," "," "," "," "," "," "," "," "," "," "," ","R","R","O","O"," "," "," "," "," "," "," "," "," "," "," "," "," ","R"," "," "," "," "," "," "," "," "," "," "," "," "," "," "," "," ","O"," "," "," "," ","O"," "," "," "," "," "," "," "," "," "," "," "," "," "," "," "," "," "," "," "," "," "," ","R"," "," "," "," "," "," "," "," "," "," "," "," ","R"," "," "," "," "," "," "," "," "," "," "," "," "," "," "," "," "," "," "," "," "," "," "," "," "," "," "," "," "," "," "," "," "," "," "," "," "," "," "," "," "," ","O"]
["304","R","R","R","R","R","R","R","R","O","O","O","O","O","S","R","R","O"," "," "," "," "," ","R","O"," "," "," "," "," "," "," "," "," "," "," "," ","R","R","O","O"," "," "," "," "," "," "," "," "," "," "," "," "," ","R"," "," "," "," "," "," "," "," "," "," "," "," "," "," "," "," ","O"," "," "," "," ","O"," "," "," "," "," "," "," "," "," "," "," "," "," "," "," "," "," "," "," "," "," "," ","O"," "," "," "," "," "," "," "," "," "," "," "," ","R"," "," "," "," "," "," "," "," "," "," "," "," "," "," "," "," "," "," "," "," "," "," "," "," "," "," "," "," "," "," "," "," "," "," "," "," "," "," "," "," "," ","O"]
["312","R","R","R","R","R","R","R","R","O","O","O","O","O","S","R","R","O"," "," "," "," "," "," "," "," "," "," "," "," "," "," "," "," "," "," "," ","R","R","O","O"," "," "," "," "," "," "," "," "," "," "," "," "," ","R"," "," "," "," "," "," "," "," "," "," "," "," "," "," "," "," "," "," "," "," "," ","O"," "," "," "," "," "," "," "," "," "," "," "," "," "," "," "," "," "," "," "," "," "," ","O"," "," "," "," "," "," "," "," "," "," "," "," ","R"," "," "," "," "," "," "," "," "," "," "," "," "," "," "," "," "," "," "," "," "," "," "," "," "," "," "," "," "," "," "," "," "," "," "," "," "," "," "," "," "," "," "]
["317","R","R","R","R","R","R","R","R","O","O","O","O","O","S","R","R","O"," "," "," "," "," "," "," "," "," "," "," "," "," "," "," "," "," "," "," ","R","R","O","O"," "," "," "," "," "," "," "," "," "," "," "," "," ","R"," "," "," "," "," "," "," "," "," "," "," "," "," "," "," "," ","O"," "," "," "," ","O"," "," "," "," "," "," "," "," "," "," "," "," "," "," "," "," "," "," "," "," "," "," ","O"," "," "," "," "," "," "," "," "," "," "," "," ","R"," "," "," "," "," "," "," "," "," "," "," "," "," "," "," "," "," "," "," "," "," "," "," "," "," "," "," "," "," "," "," "," "," "," "," "," "," "," "," "," "," "," "]
["330","R","R","R","R","R","R","R","R","O","O","O","O","O","S","R","R","O"," "," "," "," "," "," "," "," "," "," "," "," "," "," "," "," "," "," "," ","R","R","O","O"," "," "," "," "," "," "," "," "," "," "," "," "," ","R"," "," "," "," "," "," "," "," "," "," "," "," "," "," "," "," ","O"," "," "," "," ","O"," "," "," "," "," "," "," "," "," "," "," "," "," "," "," "," "," "," "," "," "," "," ","O"," "," "," "," "," "," "," "," "," "," "," "," ","R"," "," "," "," "," "," "," "," "," "," "," "," "," "," "," "," "," "," "," "," "," "," "," "," "," "," "," "," "," "," "," "," "," "," "," "," "," "," "," "," "," "," "]
["350","R","R","R","R","R","R","R","R","O","O","O","O","O","S","R","R","O"," "," "," "," "," ","R","O"," "," "," "," "," "," "," "," "," "," "," "," ","R"," ","O","O"," "," "," "," "," "," "," "," "," "," "," "," "," ","R"," "," "," "," "," "," "," "," "," "," "," "," "," "," "," "," ","R"," "," "," "," ","O"," "," "," "," "," "," "," "," "," "," "," "," "," "," "," "," "," "," "," "," "," "," ","O"," "," "," "," "," "," "," "," "," "," "," "," ","R"," "," "," "," "," "," "," "," "," "," "," "," "," "," "," "," "," "," "," "," "," "," "," "," "," "," "," "," "," "," "," "," "," "," "," "," "," "," "," "," "," ","O"]
["352","R","R","R","R","R","R","R","R","O","O","O","O","O","S","R","R","O"," "," "," "," "," "," "," "," "," "," "," "," "," "," "," "," "," "," "," ","R","R","O","O"," "," "," "," "," "," "," "," "," "," "," "," "," ","R"," "," "," "," "," "," "," "," "," "," "," "," "," "," "," "," ","O"," "," "," "," ","O"," "," "," "," "," "," "," "," "," "," "," "," "," "," "," "," "," "," "," "," "," "," ","O"," "," "," "," "," "," "," "," "," "," "," "," ","R"," "," "," "," "," "," "," "," "," "," "," "," "," "," "," "," "," "," "," "," "," "," "," "," "," "," "," "," "," "," "," "," "," "," "," "," "," "," "," "," "," "," "]
["353","R","R","R","R","R","R","R","R","O","O","O","O","O","S","R","R","O"," "," "," "," "," "," "," "," "," "," "," "," "," "," "," "," "," "," "," ","R","R","O","O"," "," "," "," "," "," "," "," "," "," "," "," "," ","R"," "," "," "," "," "," "," "," "," "," "," "," "," "," "," "," ","O"," "," "," "," ","O"," "," "," "," "," "," "," "," "," "," "," "," "," "," "," "," "," "," "," "," "," "," ","O"," "," "," "," "," "," "," "," "," "," "," "," ","R"," "," "," "," "," "," "," "," "," "," "," "," "," "," "," "," "," "," "," "," "," "," "," "," "," "," "," "," "," "," "," "," "," "," "," "," "," "," "," "," "," "," "]
["354","R","R","R","R","R","R","R","R","O","O","O","O","O","S","R","R","O"," "," "," "," "," "," "," "," "," "," "," "," "," "," "," "," "," "," "," ","R","R","O","O"," "," "," "," "," "," "," "," "," "," "," "," "," ","R"," "," "," "," "," "," "," "," "," "," "," "," "," "," "," "," ","O"," "," "," "," ","O"," "," "," "," "," "," "," "," "," "," "," "," "," "," "," "," "," "," "," "," "," "," ","O"," "," "," "," "," "," "," "," "," "," "," "," ","R"," "," "," "," "," "," "," "," "," "," "," "," "," "," "," "," "," "," "," "," "," "," "," "," "," "," "," "," "," "," "," "," "," "," "," "," "," "," "," "," "," "," "]
["355","R","R","R","R","R","R","R","R","O","O","O","O","O","S","R","R","O"," "," "," "," "," "," "," "," "," "," "," "," "," "," "," "," "," "," "," ","R","R","O","O"," "," "," "," "," "," "," "," "," "," "," "," "," ","R"," "," "," "," "," "," "," "," "," "," "," "," "," "," "," "," ","O"," "," "," "," ","O"," "," "," "," "," "," "," "," "," "," "," "," "," "," "," "," "," "," "," "," "," "," ","O"," "," "," "," "," "," "," "," "," "," "," "," ","R"," "," "," "," "," "," "," "," "," "," "," "," "," "," "," "," "," "," "," "," "," "," "," "," "," "," "," "," "," "," "," "," "," "," "," "," "," "," "," "," "," "," "]
["356","R","R","R","R","R","R","R","R","O","O","O","O","O","S","R","R","O"," "," "," "," "," "," "," "," "," "," "," "," "," "," "," "," "," "," "," ","R","R","O","O"," "," "," "," "," "," "," "," "," "," "," "," "," ","R"," "," "," "," "," "," "," "," "," "," "," "," "," "," "," "," ","O"," "," "," "," ","O"," "," "," "," "," "," "," "," "," "," "," "," "," "," "," "," "," "," "," "," "," "," ","O"," "," "," "," "," "," "," "," "," "," "," "," ","R"," "," "," "," "," "," "," "," "," "," "," "," "," "," "," "," "," "," "," "," "," "," "," "," "," "," "," "," "," "," "," "," "," "," "," "," "," "," "," "," "," "," "]
["357","R","R","R","R","R","R","R","R","O","O","O","O","O","S","R","R","O"," "," "," "," "," "," "," "," "," "," "," "," "," "," "," "," "," "," "," ","R","R","O","O"," "," "," "," "," "," "," "," "," "," "," "," "," ","R"," "," "," "," "," "," "," "," "," "," "," "," "," "," "," "," ","O"," "," "," "," ","O"," "," "," "," "," "," "," "," "," "," "," "," "," "," "," "," "," "," "," "," "," "," ","O"," "," "," "," "," "," "," "," "," "," "," "," ","R"," "," "," "," "," "," "," "," "," "," "," "," "," "," "," "," "," "," "," "," "," "," "," "," "," "," "," "," "," "," "," "," "," "," "," "," "," "," "," "," "," "," "]
["385","R","R","R","R","R","R","R","R","O","O","O","O","O","S","R","R","O"," "," "," "," "," "," "," "," "," "," "," "," "," "," "," "," "," "," "," ","R","R","O","O"," "," "," "," "," "," "," "," "," "," "," "," "," ","R"," "," "," "," "," "," "," "," "," "," "," "," "," "," "," "," ","O"," "," "," "," ","O"," "," "," "," "," "," "," "," "," "," "," "," "," "," "," "," "," "," "," "," "," "," ","O"," "," "," "," "," "," "," "," "," "," "," "," ","R"," "," "," "," "," "," "," "," "," "," "," "," "," "," "," "," "," "," "," "," "," "," "," "," "," "," "," "," "," "," "," "," "," "," "," "," "," "," "," "," "," "," "]
["386","R","R","R","R","R","R","R","R","O","O","O","O","O","S","R","R","O"," "," "," "," "," "," "," "," "," "," "," "," "," "," "," "," "," "," "," ","R","R","O","O"," "," "," "," "," "," "," "," "," "," "," "," "," ","R"," "," "," "," "," "," "," "," "," "," "," "," "," "," "," "," ","O"," "," "," "," ","O"," "," "," "," "," "," "," "," "," "," "," "," "," "," "," "," "," "," "," "," "," "," "," "," "," "," "," "," "," "," "," "," "," "," "," ","R"," "," "," "," "," "," "," "," "," "," "," "," "," "," "," "," "," "," "," "," "," "," "," "," "," "," "," "," "," "," "," "," "," "," "," "," "," "," "," "," "," "," "]
["390","R","R","R","R","R","R","R","R","O","O","O","O","O","S","R","R","O"," "," "," "," "," "," "," "," "," "," "," "," "," "," "," "," "," "," "," ","R","R","O","O"," "," "," "," "," "," "," ","R","R","O","R","R","R","R"," "," "," "," "," "," "," "," "," "," "," "," "," "," "," "," ","O"," "," "," "," ","O"," "," "," "," "," "," "," "," "," "," "," "," "," "," "," "," "," "," "," "," "," "," ","O"," "," "," "," "," "," "," "," "," "," "," "," ","R"," "," "," "," "," "," "," "," "," "," "," "," "," "," "," "," "," "," "," "," "," "," "," "," "," "," "," "," "," "," "," "," "," "," "," "," "," "," "," "," "," "," "]
["430","R","R","R","R","R","R","R","R","O","O","O","O","O","S","R","R","O"," "," "," "," "," "," "," "," "," "," "," "," "," "," "," "," "," "," "," ","R"," ","O","O"," "," "," "," "," "," "," "," "," "," "," "," "," "," "," "," "," "," "," "," "," "," "," "," "," "," "," "," "," "," ","O"," "," "," "," "," "," "," "," "," "," "," "," "," "," "," "," "," "," "," "," "," "," "," "," "," "," "," ","O"," "," "," "," "," "," "," "," "," "," "," "," ","R"," "," "," "," "," "," "," "," "," "," "," "," "," "," "," "," "," "," "," "," "," "," "," "," "," "," "," "," "," "," "," "," "," "," "," "," "," "," "," "," "," "," "]
["450","R","R","R","R","R","R","R","R","O","O","O","O","O","S","R","R","O"," "," "," "," "," "," "," "," "," "," "," "," "," "," "," "," "," "," ","R","R"," ","O","O"," "," "," "," "," "," "," "," "," "," "," "," "," "," "," "," "," "," "," "," "," "," "," "," "," "," "," "," "," "," ","O"," "," "," "," ","O"," "," "," "," "," "," "," "," "," "," "," "," "," "," "," "," "," "," "," "," "," "," ","O"," "," "," "," "," "," "," "," "," "," "," "," ","R"," "," "," "," "," "," "," "," "," "," "," "," "," "," "," "," "," "," "," "," "," "," "," "," "," "," "," "," "," "," "," "," "," "," "," "," "," "," "," "," "," "," "]
["452","R","R","R","R","R","R","R","R","O","O","O","O","O","S","R","R","O"," "," "," "," "," "," "," "," "," "," "," "," "," "," "," "," "," "," "," ","R"," ","O","O"," "," "," "," "," "," "," "," "," "," "," "," "," "," "," "," "," "," "," "," "," "," "," "," "," "," "," "," "," "," ","O"," "," "," "," "," "," "," "," "," "," "," "," "," "," "," "," "," "," "," "," "," "," "," "," "," "," "," ","O"," "," "," "," "," "," "," "," "," "," "," "," ","R"," "," "," "," "," "," "," "," "," "," "," "," "," "," "," "," "," "," "," "," "," "," "," "," "," "," "," "," "," "," "," "," "," "," "," "," "," "," "," "," "," "," "]
["460","R","R","R","R","R","R","R","R","O","O","O","O","O","S","R","R","O"," "," "," "," "," "," "," "," "," "," "," "," "," "," "," "," "," "," ","R","R"," ","O","O"," "," "," "," "," "," "," "," "," "," "," "," "," "," "," "," "," "," "," "," "," "," "," "," "," "," "," "," "," "," ","O"," "," "," "," ","O"," "," "," "," "," "," "," "," "," "," "," "," "," "," "," "," "," "," "," "," "," "," ","O"," "," "," "," "," "," "," "," "," "," "," "," ","R"," "," "," "," "," "," "," "," "," "," "," "," "," "," "," "," "," "," "," "," "," "," "," "," "," "," "," "," "," "," "," "," "," "," "," "," "," "," "," "," "," "," "]
["462","R","R","R","R","R","R","R","R","O","O","O","O","O","S","R","R","O"," "," "," "," "," "," "," "," ","O"," "," "," ","O"," "," "," "," "," ","R","R"," ","O","O"," "," "," "," "," "," "," "," "," "," "," "," "," "," "," "," "," "," "," "," "," "," "," "," "," "," "," "," "," "," ","O"," "," "," "," ","O"," "," "," "," "," "," "," "," "," "," "," "," "," "," "," "," "," "," "," "," "," "," ","O"," "," "," "," "," "," "," "," "," "," "," "," ","R"," "," "," "," "," "," "," "," "," "," "," "," "," "," "," "," "," "," "," "," "," "," "," "," "," "," "," "," "," "," "," "," "," "," "," "," "," "," "," "," "," "," "]
["471","R","R","R","R","R","R","R","R","O","O","O","O","O","S","R","R","O"," "," "," "," "," "," "," "," "," "," "," "," "," "," "," "," "," "," "," ","R"," ","O","O"," "," "," "," "," "," "," "," "," "," "," "," "," "," "," "," "," "," "," "," "," "," "," "," "," "," "," "," "," "," ","O"," "," "," "," "," "," "," "," "," "," "," "," "," "," "," "," "," "," "," "," "," "," "," "," "," "," "," ","O"," "," "," "," "," "," "," "," "," "," "," "," ","R"," "," "," "," "," "," "," "," "," "," "," "," "," "," "," "," "," "," "," "," "," "," "," "," "," "," "," "," "," "," "," "," "," "," "," "," "," "," "," "," "," "," "]
["472","R","R","R","R","R","R","R","R","O","O","O","O","O","S","R","R","O"," "," "," "," "," "," "," "," "," "," "," "," "," "," "," "," "," "," ","R","R"," ","O","O"," "," "," "," "," "," "," "," "," "," "," "," "," "," "," "," "," "," "," "," "," "," "," "," "," "," "," "," "," "," ","O"," "," "," "," ","O"," "," "," "," "," "," "," "," "," "," "," "," "," "," "," "," "," "," "," "," "," "," ","O"," "," "," "," "," "," "," "," "," "," "," "," ","R"," "," "," "," "," "," "," "," "," "," "," "," "," "," "," "," "," "," "," "," "," "," "," "," "," "," "," "," "," "," "," "," "," "," "," "," "," "," "," "," "," "," "]
["473","R","R","R","R","R","R","R","R","O","O","O","O","O","S","R","R","O"," "," "," "," "," "," "," "," "," "," "," "," "," "," "," "," "," "," "," ","R"," ","O","O"," "," "," "," "," "," "," "," "," "," "," "," "," "," "," "," "," "," "," "," "," "," "," "," "," "," "," "," "," "," ","O"," "," "," "," "," "," "," "," "," "," "," "," "," "," "," "," "," "," "," "," "," "," "," "," "," "," "," ","O"," "," "," "," "," "," "," "," "," "," "," "," ","R"," "," "," "," "," "," "," "," "," "," "," "," "," "," "," "," "," "," "," "," "," "," "," "," "," "," "," "," "," "," "," "," "," "," "," "," "," "," "," "," "," "," "]
["480","R","R","R","R","R","R","R","R","O","O","O","O","O","S","R","R","O"," "," "," "," "," "," "," "," "," "," "," "," "," "," "," "," "," "," ","R","R"," ","O","O"," "," "," "," "," "," "," "," "," "," "," "," "," "," "," "," "," "," "," "," "," "," "," "," "," "," "," "," "," "," ","R"," "," "," "," ","R"," "," "," "," "," "," "," "," "," "," "," "," "," "," "," "," "," "," "," "," "," "," ","O"," "," "," "," "," "," "," "," "," "," "," "," ","R"," "," "," "," "," "," "," "," "," "," "," "," "," "," "," "," "," "," "," "," "," "," "," "," "," "," "," "," "," "," "," "," "," "," "," "," "," "," "," "," "," "," "]
["500","R","R","R","R","R","R","R","R","O","O","O","O","O","S","R","R","O"," "," ","O"," ","O"," "," ","R","O"," ","O","O","O","O"," "," "," "," "," ","R"," ","O","O"," "," "," "," "," "," ","O","R","R","R","R","R","R","O","O","R","R","R","O","R"," ","O"," ","R","O","O","O"," "," ","O","O","O","O","O","O","O","O","O"," "," "," ","O"," ","R","O"," ","R"," ","O","O","O"," "," ","O","O"," ","O","O","O","O"," ","O","R"," "," "," ","O"," "," "," "," ","R"," "," "," "," "," "," "," "," "," "," "," "," "," "," "," "," ","O","O","O","O","O","O"," "," "," "," "," "," "," "," "," "," "," "," ","R","R","O","O","O","O","O"," "]
["501","R","R","R","R","R","R","R","R","O","O","O","O","O","S","R","R","O"," "," ","O"," ","O"," "," ","R","O"," ","O","O","O","O"," "," "," "," "," ","R"," ","O","O"," "," "," "," "," "," ","O","R","R","R","R","R","R","O","O","R","R","R","O","R"," ","O"," ","R","O","O","O"," "," ","O","O","O","O","O","O","O","O","O"," "," "," ","O"," ","R","O"," ","R"," ","O","O","O","O","O","O","O"," ","O","O","O","O","O","O","R"," ","O"," ","O"," "," "," "," ","R"," "," "," "," "," "," "," "," "," "," "," "," "," "," "," "," ","O"," ","O","O","O","O"," "," "," "," "," "," "," "," "," "," "," "," ","R","R","O","O","O","O","O"," "]
["502","R","R","R","R","R","R","R","R","O","O","O","O","O","S","R","R","O"," "," "," "," ","O"," "," ","R"," "," ","O"," ","O"," "," "," "," "," "," ","R"," ","O","O"," "," "," "," "," "," "," ","R","R","R","R","O","R","O"," ","R","O","O","O","O"," "," "," ","R"," ","O"," "," "," ","R","O"," ","O"," "," "," "," ","O"," "," "," ","O"," ","R","R"," "," "," "," "," "," "," "," "," "," "," "," "," ","O","O"," "," ","R"," "," "," ","O"," "," "," "," ","R"," "," "," "," "," "," "," "," "," "," "," "," "," "," "," "," "," "," ","O","O","O","O"," "," "," "," "," "," "," "," "," "," "," "," "," "," "," "," "," "," "," "," "]
["503","R","R","R","R","R","R","R","R","O","O","O","O","O","S","R","R","O"," "," "," "," ","O"," "," ","O","O"," ","O","O","O","O"," "," "," "," "," ","R"," ","O","O"," "," "," "," "," "," "," ","R","R","R","R","O","R","O"," ","R","O","R","O","O"," "," "," ","R","O","O","O"," "," ","R","O","O","R","O","O","O"," ","O"," "," "," ","O"," ","R","O"," ","O"," "," "," "," "," "," ","O","O"," "," "," ","O","O"," ","O","R"," "," "," ","O"," "," "," "," ","R"," "," "," "," "," "," "," "," "," "," "," "," "," "," "," "," "," "," ","O","O","O","O"," "," "," "," "," "," "," "," "," "," "," "," "," "," "," "," "," "," "," "," "]
["504","R","R","R","R","R","R","R","R","O","O","O","O","O","S","R","R","O"," "," "," "," ","O"," "," ","O"," "," ","O"," ","O","O"," "," "," "," "," ","R"," ","O","O"," "," "," "," "," "," "," ","R","R","R","R","O","R","O"," ","O","O","R","O","O"," "," "," ","O"," ","O","O"," "," ","R","O","O","O","O","O"," "," ","O"," "," "," ","O"," ","R","O"," ","O"," "," "," "," "," "," ","O","O"," "," "," ","O","O"," "," ","R"," "," "," ","O"," "," "," "," ","R"," "," "," "," "," "," "," "," "," "," "," "," "," "," "," "," "," "," ","O","O","O","O"," "," "," "," "," "," "," "," "," "," "," "," "," "," "," "," "," "," "," "," "]
["507","R","R","R","R","R","R","R","R","O","O","O","O","O","S","R","R","O"," "," "," "," ","O"," "," "," "," "," ","O","O","O","O"," "," "," "," ","O","R"," ","O","O"," "," "," "," "," "," ","O","R","R","R","R","R","R","R"," ","R","O","R","O","O"," ","O"," ","O"," ","O","O"," "," ","O","O"," "," ","O","O","O","O","O"," "," "," ","O"," ","O","O"," ","R"," ","O","O","O"," "," ","O","O"," "," "," ","O","O"," "," ","R"," "," "," ","O"," "," "," "," ","R"," "," "," "," "," "," "," "," "," "," "," "," "," "," "," "," ","O","O","O","O","O","O"," "," "," "," "," "," "," "," "," "," "," "," ","R","R","O","O","O","O","O"," "]
["508","R","R","R","R","R","R","R","R","O","O","O","O","O","S","R","R","O"," "," ","O"," ","O"," "," ","R"," "," ","O","O","O","O"," "," "," "," ","R","R"," ","O","O","O","O","O","O","O","O","O","R","R","R","R","R","R","O","O","R","O","R","O","R"," ","O"," ","O","O","O","O","O"," ","O","O","O","O","O","O","O","O","O"," "," "," ","O"," ","O","O"," ","R"," ","O","O","O"," "," ","O","O"," ","O","O","O","O"," ","O","R"," "," "," ","O"," "," "," "," ","R"," "," "," "," "," "," "," "," "," "," "," "," "," "," "," "," ","O","O","O","O","O","O"," "," "," "," "," "," "," "," "," "," "," "," ","R","R","O","O","O","O","O"," "]
["512","R","R","R","R","R","R","R","R","O","O","O","O","O","S","R","R","O"," "," ","O"," ","O"," "," ","R","O"," ","O","O","O","O"," "," "," "," ","R","R"," ","O","O"," "," "," "," "," "," "," ","R","R","R","R","R","R","O"," ","R","R","R","O","R"," ","O"," ","O","O","O","O"," "," ","O","O","O","O","O","O","O","O","O"," "," "," ","O"," ","O","O"," ","R"," ","O","O","O"," "," ","O","O"," ","O","O","O","O"," "," ","R"," "," "," ","O"," "," "," "," ","R"," "," "," "," "," "," "," "," "," "," "," "," "," "," "," "," ","O","O","O","O","O","O"," "," "," "," "," "," "," "," "," "," "," "," ","R","R","O","O","O","O","O"," "]
["515","R","R","R","R","R","R","R","R","O","O","O","O","O","S","R","R","O"," "," "," ","O","O"," "," ","R"," "," ","O","O","O","O"," "," "," "," ","R","R"," ","O","O","O","O","O","O","O","O","O","R","R","R","R","O","R","O"," ","O","O","R","O","R"," ","O"," ","O","O","O","O"," ","O","O","O","O","O","O","O","O","O","O"," "," "," ","O"," ","O","O"," ","R"," ","O","O","O"," "," ","O","O"," "," "," ","O","O"," "," ","O"," "," "," ","O"," "," "," "," ","R"," "," "," "," "," "," "," "," "," "," "," "," "," "," "," "," ","O","O","O","O","O","O"," "," "," "," "," "," "," "," "," "," "," "," ","R","R","O","O","O","O","O"," "]
["517","R","R","R","R","R","R","R","R","O","O","O","O","O","S","R","R","O"," "," ","R"," ","O"," "," ","R","O"," ","O"," ","O","O"," "," "," "," ","R","R"," ","O","O","O","O","O","O","O","O","O","R","R","R","R","O","R","O"," ","R","O","R","O","R"," ","O"," ","O"," "," "," "," "," ","O","O"," ","O","O","O","O","O","O"," "," "," "," "," ","R","O"," ","R"," "," "," "," "," "," ","O","O"," ","O","O","O","O"," "," ","R"," "," "," ","O"," "," "," "," ","R"," "," "," "," "," "," "," "," "," "," "," "," "," "," "," "," "," ","O","O","O","O","O"," "," "," "," "," "," "," "," "," "," "," "," "," "," "," "," "," "," "," "," "]
["520","R","R","R","R","R","R","R","R","O","O","O","O","O","S","R","R","O"," "," "," "," ","O"," "," ","R"," "," ","R","O","O","R"," "," "," "," "," ","R"," ","O","O"," "," "," "," "," "," ","O","R","R","R","R","R","R","O"," ","R","R","R","O","R"," ","O","O","O"," ","O","O"," "," ","O","O"," ","O","O","O"," ","O","O"," "," "," ","O"," ","R","O"," ","R"," ","O","O","O"," "," ","O","O"," "," "," ","O","O"," ","O","O"," "," "," ","O"," "," "," "," ","R"," "," "," "," "," "," "," "," "," "," "," "," "," "," "," "," ","O","O","O","O","O","O"," "," "," "," "," "," "," "," "," "," "," "," ","R","R","O","O","O","O","O"," "]
["522","R","R","R","R","R","R","R","R","O","O","O","O","O","S","R","R","O"," "," "," "," ","O"," "," ","R"," "," ","O","O","O","O"," "," "," "," ","R","R","O","O","O"," "," "," "," "," "," ","O","R","R","R","R","R","R","O"," ","R","R","R","O","R"," ","O","O","O"," ","O","O"," "," ","O","O"," ","O","O","O"," ","O","O"," "," "," ","O"," ","R","O"," ","R"," ","O","O","O"," "," ","O","O"," "," "," ","O","O"," "," ","O"," "," "," ","O"," "," "," "," ","R"," "," "," "," "," "," "," "," "," "," "," "," "," "," "," "," ","O","O","O","O","O","O"," "," "," "," "," "," "," "," "," "," "," "," ","R","R","O","O","O","O","O"," "]
["524","R","R","R","R","R","R","R","R","O","O","O","O","O","S","R","R","O"," "," "," "," ","O"," "," ","R"," "," ","R"," ","O","R"," "," "," "," ","O","R"," ","O","O"," "," "," "," "," "," ","O","R","R","R","R","R","R","O"," ","R","R","R","O","R"," ","O","O","O"," ","O","O"," "," ","O","O"," ","O","O","O"," ","O","O"," "," "," ","O"," ","O","O"," ","R"," ","O","O","O"," "," ","O","O"," "," "," ","O","O"," ","O","O"," "," "," ","O"," "," "," "," ","R"," "," "," "," "," "," "," "," "," "," "," "," "," "," "," "," ","O","O","O","O","O","O"," "," "," "," "," "," "," "," "," "," "," "," ","R","R","O","O","O","O","O"," "]
["528","R","R","R","R","R","R","R","R","O","O","O","O","O","S","R","R","O"," "," "," "," ","O"," "," ","R"," "," ","O"," ","O","O"," "," "," "," "," ","R"," ","O","O"," "," "," "," "," "," "," ","R","R","R","R","O","R","O"," ","O","O","R","O","O"," ","O","O","O"," "," ","O"," "," ","R","O"," "," ","O","O"," "," ","O"," "," "," "," "," ","R"," "," ","O"," "," "," "," "," "," ","O","O"," "," "," ","O","O"," "," ","R"," "," "," ","O"," "," "," "," ","R"," "," "," "," "," "," "," "," "," "," "," "," "," "," "," "," "," ","O","O","O","O","O"," "," "," "," "," "," "," "," "," "," "," "," "," "," "," "," "," "," "," "," "]
["540","R","R","R","R","R","R","R","R","O","O","O","O","O","S","R","R","O"," "," "," "," ","O"," "," ","R"," "," ","O","O","O","R"," "," "," "," "," ","R"," ","O","O"," "," "," "," "," "," ","O","R","R","R","R","R","R","O","O","R","O","R","O","R"," ","O"," ","R","O","O","O"," ","O","O","O","O","O","O","O","O","O","O"," "," "," ","O"," ","R","O"," ","R"," ","O","O","O"," "," ","O","O"," "," "," ","O","O"," ","O","R"," "," "," ","O"," "," "," "," ","R"," "," "," "," "," "," "," "," "," "," "," "," "," "," "," "," ","O","O","O","O","O","O"," "," "," "," "," "," "," "," "," "," "," "," ","R","R","O","O","O","O","O"," "]
["541","R","R","R","R","R","R","R","R","O","O","O","O","O","S","R","R","O"," "," "," "," ","O"," "," ","R"," "," ","O","O","O","R"," "," "," "," "," ","R"," ","O","O"," "," "," "," "," "," ","O","R","R","R","R","R","R","O","O","R","O","R","O","R"," ","O"," ","R","O","O","O"," "," ","O","O","R","O","O","O","O","O","O"," "," "," "," "," ","R","O"," ","R"," ","O","O","O","O","O","O","O"," "," "," ","O","O"," ","O","R"," "," "," ","O"," "," "," "," ","R"," "," "," "," "," "," "," "," "," "," "," "," "," "," "," "," ","O","O","O","O","O","O"," "," "," "," "," "," "," "," "," "," "," "," ","R","R","O","O","O","O","O"," "]
["542","R","R","R","R","R","R","R","R","O","O","O","O","O","S","R","R","O"," "," "," ","O","O"," "," ","R"," "," ","O"," ","O","O"," "," "," "," "," ","R"," ","O","O"," "," "," "," "," "," "," ","R","R","R","R","R","R","O"," ","R","R","R","O","R"," ","O"," ","O","O"," ","O","R"," ","O","O","O","O","O","O","O"," ","O"," "," "," ","O"," ","O","O"," ","R"," ","O","O","O"," "," ","O","O"," "," "," ","O","O"," "," ","O"," "," ","O","O"," "," "," "," ","R"," "," "," "," "," "," "," "," "," "," "," "," "," "," "," "," ","O","O","O","O","O","O"," "," "," "," "," "," "," "," "," "," "," "," ","R","R","O","O"," ","O","O"," "]
["543","R","R","R","R","R","R","R","R","O","O","O","O","O","S","R","R","O"," "," "," "," ","O"," "," ","R"," "," ","O","O","O","O"," "," "," "," "," ","R"," ","O","O"," "," "," "," "," "," "," ","R","R","R","R","R","R","O"," ","R","R","R","O","R"," ","O"," ","O"," "," "," ","R","O","O","O","O","O","O","O","O"," ","O"," "," "," ","O"," ","O","O"," ","R"," ","O","O","O"," "," ","O","O"," "," "," ","O","O"," "," ","O"," "," "," ","O"," "," "," "," ","R"," "," "," "," "," "," "," "," "," "," "," "," "," "," "," "," "," ","O","O","O","O","O"," "," "," "," "," "," "," "," "," "," "," "," ","R","R","O","O"," ","O","O"," "]
["546","R","R","R","R","R","R","R","R","O","O","O","O","O","S","R","R","O"," "," "," "," ","O"," "," ","R"," "," ","O","O","O","O"," "," "," "," "," ","R"," ","O","O"," "," "," "," "," "," "," ","R","R","R","R","R","R","O"," ","R","R","R","O","R"," ","O"," ","O","O"," "," ","R"," ","O","O"," ","O","O","O","O"," ","O"," "," "," ","O"," ","O","O"," ","R"," ","O","O","O"," "," ","O","O"," "," "," ","O","O"," "," ","R"," "," "," ","O"," "," "," "," ","R"," "," "," "," "," "," "," "," "," "," "," "," "," "," "," "," "," ","O","O","O","O","O"," "," "," "," "," "," "," "," "," "," "," "," ","R","R","O","O"," ","O","O"," "]
["548","R","R","R","R","R","R","R","R","O","O","O","O","O","S","R","R","O"," "," "," "," ","O"," "," ","R"," "," ","O","O","O","O"," "," "," "," ","R","R"," ","O","O"," "," "," "," "," "," "," ","R","R","R","R","R","R","O"," ","R","O","R","O","R"," ","O"," ","O","O"," "," ","R"," ","O","O"," ","O","O","O","O"," ","O"," "," "," ","O"," ","O","O"," ","R"," ","O","O","O"," "," ","O","O"," "," "," ","O","O"," "," ","O"," "," "," ","O"," "," "," "," ","R"," "," "," "," "," "," "," "," "," "," "," "," "," "," "," "," "," ","O","O","O","O","O"," "," "," "," "," "," "," "," "," "," "," "," ","R","R","O","O"," ","O","O"," "]
["549","R","R","R","R","R","R","R","R","O","O","O","O","O","S","R","R","O"," "," "," "," ","O"," "," ","R"," "," ","O","O","O","O"," "," "," "," ","R","R"," ","O","O"," "," "," "," "," "," "," ","R","R","R","R","R","R","O"," ","R","O","R","O","R"," ","O"," ","O","O"," "," ","R"," ","O","O","O","O","O","O","O"," ","O"," "," "," ","O"," ","O","O"," ","R"," ","O","O","O"," "," ","O","O"," "," "," ","O","O"," "," ","O"," "," "," ","O"," "," "," "," ","R"," "," "," "," "," "," "," "," "," "," "," "," "," "," "," "," "," ","O","O","O","O","O"," "," "," "," "," "," "," "," "," "," "," "," ","R","R","O","O"," ","O","O"," "]
["570","R","R","R","R","R","R","R","R","O","O","O","O","O","S","R","R","O"," "," ","O"," ","O"," "," ","R","O"," ","O","O","O","O"," "," "," "," "," ","R"," ","O","O","O","O","O","O","O","O","O","R","R","R","R","O","R","O","O","R","R","R","O","R"," ","O"," ","O","O","O","O"," ","O","O","O","O","O","O","O","O","O","O"," "," "," ","O"," ","R","O"," ","R"," ","O","O","O"," "," ","O","O"," ","O","O","O","O"," ","O","R"," "," "," ","O"," "," "," "," ","R"," "," "," "," "," "," "," "," "," "," "," "," "," "," "," "," ","O","O","O","O","O","O"," "," "," "," "," "," "," "," "," "," "," "," ","R","R","O","O","O","O","O"," "]
["571","R","R","R","R","R","R","R","R","O","O","O","O","O","S","R","R","O"," "," ","O"," ","O"," "," ","R","O"," ","O","O","O","O"," "," "," "," ","R","R"," ","O","O","O","O","O","O","O","O","O","R","R","R","R","O","R","O","O","R","R","R","R","R"," ","O"," ","O","O","O","O"," ","O","O","O","O","O","O","O","O","O","O"," "," "," ","O"," ","R","O"," ","R"," ","O","O","O","O","O","O","O"," ","O","O","O","O"," ","O","O"," "," "," ","O"," "," "," "," ","R"," "," "," "," "," "," "," "," "," "," "," "," "," "," "," "," ","O","O","O","O","O","O"," "," "," "," "," "," "," "," "," "," "," "," ","R","R","O","O","O","O","O"," "]
["572","R","R","R","R","R","R","R","R","O","O","O","O","O","S","R","R","O"," "," "," "," ","O"," "," ","R"," "," ","O","O","O","R"," "," "," "," "," ","R"," ","O","O","O","O","O","O","O","O"," ","R","R","R","R","O","R","O"," ","O","O","R","O","R"," ","O"," ","O","O","O","O"," "," ","O","O","O","O","O","O","O","O","O"," "," "," ","O"," ","R","O"," ","R"," ","O","O","O"," "," ","O","O"," "," "," ","O","O"," ","O","O"," "," "," ","O"," "," "," "," ","R"," "," "," "," "," "," "," "," "," "," "," "," "," "," "," "," ","O","O","O","O","O","O"," "," "," "," "," "," "," "," "," "," "," "," "," "," "," "," "," "," "," "," "]
["573","R","R","R","R","R","R","R","R","O","O","O","O","O","S","R","R","O"," "," "," "," ","O"," "," ","R","O"," ","O","O","O","R"," "," "," "," ","O","R"," ","O","O","O","O","O","O","O","O","O","R","R","R","R","O","R","O"," ","O","R","R","O","R"," ","O"," ","O","O","O","O"," "," ","O","O","O","O","O","O","O","O","O"," "," "," ","O"," ","R","O"," ","R"," ","O","O","O"," "," ","O","O"," "," "," ","O","O"," ","O","R"," "," "," ","O"," "," "," "," ","R"," "," "," "," "," "," "," "," "," "," "," "," "," "," "," "," ","O","O","O","O","O","O"," "," "," "," "," "," "," "," "," "," "," "," ","R","R","O","O","O","O","O"," "]
["590","R","R","R","R","R","R","R","R","O","O","O","O","O","S","R","R","O"," "," "," "," ","O"," "," ","R"," "," ","O","O","O","O"," "," "," "," ","R","R"," ","O","O","O","O","O","O","O","O"," ","R","R","R","R","O","R","O"," ","O","O","O","O","O"," ","O"," ","O"," ","O"," ","O"," ","O","O"," ","O","O","O","O","O","O"," "," "," ","O"," ","O","O"," ","R"," ","O","O","O"," "," ","O","O"," "," "," ","O","O"," "," ","O"," "," "," ","O"," "," "," "," ","R"," "," "," "," "," "," "," "," "," "," "," "," "," "," "," "," "," ","O","O","O","O","O"," "," "," "," "," "," "," "," "," "," "," "," ","R","R","O","O","O","O","O"," "]
["702","R","R","R","R","R","R","R","R","O","O","O","O","O","S","R","R","O"," "," "," "," ","O"," "," "," "," "," "," ","O"," ","O"," "," "," "," "," ","R"," ","O","O"," "," "," "," "," "," "," ","R","R","R","R","R","R","O","O","R","R","O","O","O"," ","O"," "," "," ","O","O"," "," ","O","O","O"," ","O","O"," ","R"," "," "," "," ","O"," "," ","O"," ","O"," "," "," "," ","O","O"," "," "," "," "," ","O"," "," "," "," "," "," "," ","O"," "," ","S","S","R"," "," "," "," "," "," "," "," "," "," "," "," "," "," "," "," ","O","O"," "," "," "," "," "," "," "," "," "," "," "," "," "," "," "," "," "," ","O","O","O","O","O"," "]
["703","R","R","R","R","R","R","R","R","O","O","O","O","O","S","R","R","O"," "," "," "," ","O"," "," "," "," "," "," ","O"," ","O"," "," "," "," ","R","R"," ","O","O"," "," "," "," "," "," "," ","R","R","R","R","R","R"," ","O","R","R","O","O","O"," ","O"," "," "," ","O","O"," "," ","O","O","O"," ","O","O"," ","O"," "," "," "," ","O"," "," ","O"," ","O"," "," "," "," ","O","O"," "," "," "," "," ","O"," "," "," "," "," "," "," ","O"," "," "," "," ","R"," "," "," "," "," "," "," "," "," "," "," "," "," "," "," "," ","O","O"," "," "," "," "," "," "," "," "," "," "," "," "," "," "," "," "," "," ","O","O","O","O","O"," "]
["713","R","R","R","R","R","R","R","R","O","O","O","O","O","S","R","R","O"," "," "," "," ","O"," "," "," "," "," "," ","O"," ","O"," "," "," "," "," ","R"," ","O","O"," "," "," "," "," "," "," ","R","R","R","R","R","R","R","O","R","R","O","O","O"," ","O","O"," "," ","O","O"," "," ","O","O","O"," "," ","O"," ","R"," "," "," "," "," "," "," ","O"," ","O"," "," "," "," ","O","O"," "," "," "," "," ","O"," "," "," "," "," "," "," ","S"," "," "," "," ","R"," "," "," "," "," "," "," "," "," "," "," "," "," "," "," "," ","O","O","O","O","O","O"," "," "," "," "," "," "," "," "," "," "," "," "," "," ","O","O","O","O","O"," "]
["721","R","R","R","R","R","R","R","R","O","O","O","O","O","S","R","R","O"," "," "," "," ","O"," "," "," "," "," "," ","O"," ","O"," "," "," "," "," ","R"," ","O","O"," "," "," "," "," "," "," ","R","R","R","R","R","R","O","O","R","O","O","O","O"," ","O"," "," "," ","O","O"," "," ","O","O"," "," "," ","O"," ","O"," "," "," "," "," "," "," ","O"," ","O"," "," "," "," ","O","O"," "," "," "," "," ","O"," "," "," "," "," "," "," ","S"," "," "," "," ","R"," "," "," "," "," "," "," "," "," "," "," "," "," "," "," "," ","O","O"," "," "," "," "," "," "," "," "," "," "," "," "," "," "," "," "," "," ","O","O","O","O","O"," "]
["730","R","R","R","R","R","R","R","R","O","O","O","O","O","S","R","R","O"," "," "," "," "," "," "," "," "," "," "," "," "," "," "," "," "," "," ","R","R"," ","O"," "," "," "," "," "," "," "," ","R","R","R","R","R","R"," "," "," "," "," "," "," "," "," "," "," "," "," "," "," "," ","O","O"," "," "," "," "," "," "," "," "," "," "," "," "," "," "," "," "," "," "," "," "," "," "," "," "," "," "," ","R"," "," "," "," "," "," "," ","S"," "," "," "," ","R"," "," "," "," "," "," "," "," "," "," "," "," "," "," "," "," "," ","O"," "," "," "," "," "," "," "," "," "," "," "," "," "," "," "," "," "," ","O","O"," ","O","O"," "]
["731","R","R","R","R","R","R","R","R","O","O","O","O","O","S","R","R","O"," "," "," "," "," "," "," "," "," "," "," "," "," "," "," "," "," "," ","R","R"," ","O","O"," "," "," "," "," "," "," "," "," "," "," "," "," "," "," ","R"," "," "," "," "," "," "," "," "," "," "," "," "," ","O","O"," "," "," "," "," "," "," "," "," "," "," "," "," "," "," "," "," "," "," "," "," "," "," "," "," "," "," ","O"," "," "," "," "," "," "," ","S"," "," "," "," ","R"," "," "," "," "," "," "," "," "," "," "," "," "," "," "," "," "," "," "," "," "," "," "," "," "," "," "," "," "," "," "," "," "," "," "," "," ","O","O"," ","O","O"," "]
["732","R","R","R","R","R","R","R","R","O","O","O","O","O","S","R","R","O"," "," "," "," "," "," "," "," "," "," "," "," "," "," "," "," "," "," "," ","R"," ","O"," "," "," "," "," "," "," "," "," "," "," "," "," "," "," "," "," "," "," "," "," "," "," "," "," "," "," "," "," "," ","O","O"," "," "," "," "," "," "," "," "," "," "," "," "," "," "," "," "," "," "," "," "," "," "," "," "," "," "," ","R"," "," "," "," "," "," "," ","S"," "," "," "," ","R"," "," "," "," "," "," "," "," "," "," "," "," "," "," "," "," "," "," "," "," "," "," "," "," "," "," "," "," "," "," "," "," "," "," "," "," ","O","O"," ","O","O"," "]
["740","R","R","R","R","R","R","R","R","O","O","O","O","O","S","R","R","O"," "," "," "," ","O"," "," "," "," "," "," "," "," "," "," "," "," "," ","O","R"," ","O","O"," "," "," "," "," "," "," ","R","R","R","R","O","R","R","O","R","O","R"," ","R"," ","R","O"," "," ","O","O"," "," ","O","O"," "," "," "," "," ","O"," "," "," "," "," "," "," ","O"," ","O"," "," "," "," ","O","O"," "," "," "," "," ","O"," "," "," "," "," "," "," ","S"," "," "," "," ","R"," "," "," "," "," "," "," "," "," "," "," "," "," "," "," "," ","O","O","O","O","O","O"," "," "," "," "," "," "," "," "," "," "," "," "," "," ","O","O","O","O","O"," "]
["741","R","R","R","R","R","R","R","R","O","O","O","O","O","S","R","R","O"," "," "," "," "," "," "," "," "," "," "," "," "," "," "," "," "," "," ","R","R"," ","O","O"," "," "," "," "," "," "," ","R","R","R","R","O","R","R","O","R","O","R"," ","R"," ","R","O"," "," "," "," "," "," ","O","O"," "," "," "," "," "," "," "," "," "," "," "," "," ","O"," ","O"," "," "," "," ","O","O"," "," "," "," "," ","O"," "," "," "," "," "," "," ","S"," "," "," "," ","R"," "," "," "," "," "," "," "," "," "," "," "," "," "," "," "," "," ","O","O","O","O","O"," "," "," "," "," "," "," "," "," "," "," "," "," "," ","O","O","O","O","O"," "]
["750","R","R","R","R","R","R","R","R","O","O","O","O","O","S","R","R","O"," "," "," "," "," "," "," "," "," "," "," "," "," "," "," "," "," "," ","R","R"," ","O","O"," "," "," "," "," "," "," "," "," "," "," "," "," "," "," "," "," "," "," "," "," "," "," "," "," "," "," "," "," ","O","O"," "," "," "," "," "," "," "," "," "," "," "," "," ","O"," ","O"," "," "," "," "," "," "," "," "," "," "," ","O"," "," "," "," "," "," "," "," "," "," "," "," ","R"," "," "," "," "," "," "," "," "," "," "," "," "," "," "," "," "," "," "," "," "," "," "," "," "," "," "," "," "," "," "," "," "," "," "," "," ","O"," ","O"," "," "," "]
["755","R","R","R","R","R","R","R","R","O","O","O","O","O","S","R","R","O"," "," "," "," "," "," "," "," "," "," "," "," "," "," "," "," "," "," ","R","R"," ","O","O"," "," "," "," "," "," "," "," "," "," "," "," "," "," "," "," "," "," "," "," "," "," "," "," "," "," "," "," "," "," ","O"," "," "," "," "," "," "," "," "," "," "," "," "," "," "," "," "," "," "," "," "," "," "," "," "," "," "," ","O"," "," "," "," "," "," "," "," "," "," "," "," ","R"," "," "," "," "," "," "," "," "," "," "," "," "," "," "," "," "," "," "," "," "," "," "," "," "," "," "," "," "," "," "," "," "," "," "," "," ","O"," ","O"," "," "," "]
["760","R","R","R","R","R","R","R","R","O","O","O","O","O","S","R","R","O"," "," "," "," "," "," "," "," ","S"," "," "," ","O"," "," "," "," "," ","R","R"," ","O","O","O","O","O","O","O","O","O"," "," "," "," "," "," "," "," "," "," "," "," "," "," ","O"," "," "," "," "," "," "," "," ","O"," "," ","O","O","O"," "," "," "," "," "," "," "," "," "," "," "," "," "," "," "," "," "," "," "," "," "," ","O"," "," "," "," "," "," "," "," "," "," "," "," ","R"," "," "," "," "," "," "," "," "," "," "," "," "," "," "," "," "," "," "," "," "," "," "," "," "," "," "," "," "," "," "," "," "," "," "," "," ","O"," ","O"," "," "," "]
["761","R","R","R","R","R","R","R","R","O","O","O","O","O","S","R","R","O"," "," "," "," "," "," "," "," "," "," "," "," "," "," "," "," "," "," ","R","R"," ","O","O"," "," "," "," "," "," "," "," "," "," "," "," "," "," "," "," "," "," "," "," "," "," "," "," "," "," "," "," "," "," ","O"," "," "," "," "," "," "," "," "," "," "," "," "," "," "," "," "," "," "," "," "," "," "," "," "," "," "," ","O"," "," "," "," "," "," "," "," "," "," "," "," ","R"," "," "," "," "," "," "," "," "," "," "," "," "," "," "," "," "," "," "," "," "," "," "," "," "," "," "," "," "," "," "," "," "," "," "," "," "," "," "," "," "," "," "]
["762","R","R","R","R","R","R","R","R","O","O","O","O","O","S","R","R","O"," "," "," "," "," "," "," "," "," "," "," "," ","O"," "," "," "," "," ","R","R"," ","O","O"," "," "," "," "," "," "," "," "," "," "," "," "," "," "," "," "," "," "," "," "," "," "," "," "," "," "," "," "," "," ","O"," "," "," "," "," "," "," "," "," "," "," "," "," "," "," "," "," "," "," "," "," "," "," "," "," "," "," ","O"," "," "," "," "," "," "," "," "," "," "," "," ","R"," "," "," "," "," "," "," "," "," "," "," "," "," "," "," "," "," "," "," "," "," "," "," "," "," "," "," "," "," "," "," "," "," "," "," "," ","O"," "," "," "," "," "]
["765","R","R","R","R","R","R","R","R","O","O","O","O","O","S","R","R","O"," "," "," "," "," "," "," "," "," "," "," "," ","O"," "," "," "," "," ","R","R"," ","O","O"," "," "," "," "," "," "," "," "," "," "," "," "," "," "," "," "," "," "," "," "," "," "," "," "," "," "," "," "," "," ","O"," "," ","O"," "," "," "," "," "," "," "," "," "," "," "," "," "," "," "," "," "," "," "," "," "," "," "," ","O"," "," "," "," "," "," "," "," "," "," "," "," ","R"," "," "," "," "," "," "," "," "," "," "," "," "," "," "," "," "," "," "," "," "," "," "," "," "," "," "," "," "," "," "," "," "," "," "," "," ","O"," ","O"," "," "," "]
["769","R","R","R","R","R","R","R","R","O","O","O","O","O","S","R","R","O"," "," "," "," "," "," "," "," "," "," "," "," "," "," "," "," "," "," ","R","R"," ","O","O"," "," "," "," "," "," "," "," "," "," "," "," "," "," "," "," "," "," "," "," "," "," "," "," "," "," "," "," "," "," ","O"," "," "," "," "," "," "," "," "," "," "," "," "," "," "," "," "," "," "," "," "," "," "," "," "," "," "," ","O"," "," "," "," "," "," "," "," "," "," "," "," ","R"," "," "," "," "," "," "," "," "," "," "," "," "," "," "," "," "," "," "," "," "," "," "," "," "," "," "," "," "," "," "," "," "," "," "," "," ","O"," ","O"," "," "," "]
["770","R","R","R","R","R","R","R","R","O","O","O","O","O","S","R","R","O"," "," "," "," "," "," "," "," "," "," "," "," "," "," "," "," "," "," ","R","R"," ","O","O"," "," "," "," "," "," "," "," "," "," "," "," "," "," "," "," "," "," "," "," "," "," "," "," "," "," "," "," "," "," ","O"," "," "," "," "," "," "," "," "," "," "," "," "," "," "," "," "," "," "," "," "," "," "," "," "," "," "," ","O"," "," "," "," "," "," "," "," "," "," "," "," ","R"," "," "," "," "," "," "," "," "," "," "," "," "," "," "," "," "," "," "," "," "," "," "," "," "," "," "," "," "," "," "," "," "," "," "," "," ","O"," ","O"," "," "," "]
["772","R","R","R","R","R","R","R","R","O","O","O","O","O","S","R","R","O"," "," "," "," "," "," "," "," "," "," "," "," "," "," "," "," "," "," ","R","R"," ","O","O"," "," "," "," "," "," "," "," "," "," "," "," "," "," "," "," "," "," "," "," "," "," "," "," "," "," "," "," "," "," ","O"," "," "," "," "," "," "," "," "," "," "," "," "," "," "," "," "," "," "," "," "," "," "," "," "," "," "," ","O"," "," "," "," "," "," "," "," "," "," "," "," ","R"," "," "," "," "," "," "," "," "," "," "," "," "," "," "," "," "," "," "," "," "," "," "," "," "," "," "," "," "," "," "," "," "," "," "," "," ","O"," ","O"," "," "," "]
["773","R","R","R","R","R","R","R","R","O","O","O","O","O","S","R","R","O"," "," "," "," "," "," "," "," "," "," "," "," "," "," "," "," "," "," ","R","R"," ","O","O"," "," "," "," "," "," "," "," "," "," "," "," "," "," "," "," "," "," "," "," "," "," "," "," "," "," "," "," "," "," ","O"," "," "," "," "," "," "," "," "," "," "," "," "," "," "," "," "," "," "," "," "," "," "," "," "," "," "," ","O"," "," "," "," "," "," "," "," "," "," "," "," ","R"," "," "," "," "," "," "," "," "," "," "," "," "," "," "," "," "," "," "," "," "," "," "," "," "," "," "," "," "," "," "," "," "," "," "," "," ","O"," ","O"," "," "," "]
["780","R","R","R","R","R","R","R","R","O","O","O","O","O","S","R","R","O"," "," "," "," "," "," "," "," "," "," "," "," "," "," "," "," "," "," "," ","R"," ","O","O"," "," "," "," "," "," "," "," "," "," "," "," "," "," "," "," "," "," "," "," "," "," "," "," "," "," "," "," "," "," ","O"," "," "," "," "," "," "," "," "," "," "," "," "," "," "," "," "," "," "," "," "," "," "," "," "," "," "," ","O"," "," "," "," "," "," "," "," "," "," "," "," ","R"," "," "," "," "," "," "," "," "," "," "," "," "," "," "," "," "," "," "," "," "," "," "," "," "," "," "," "," "," "," "," "," "," "," "," "," "," "," "," "," "," "," "]
["781","R","R","R","R","R","R","R","R","O","O","O","O","O","S","R","R","O"," "," "," "," "," "," "," "," ","O"," ","O","O","O"," "," "," "," "," "," ","R"," ","O","O"," "," "," "," "," "," "," "," "," "," "," "," "," "," "," "," "," "," "," "," "," "," "," "," "," "," "," "," "," ","O","O"," "," ","O"," ","O"," "," "," "," "," ","O"," ","O"," "," "," "," "," "," "," "," "," "," "," "," "," "," ","O"," "," "," "," "," "," "," ","R"," "," "," "," ","R"," "," "," "," "," "," "," "," "," "," "," "," "," "," "," "," "," "," "," "," "," "," "," "," "," "," "," "," "," "," "," "," "," "," "," "," "," "," "," "," ","O"," "]
["782","R","R","R","R","R","R","R","R","O","O","O","O","O","S","R","R","O"," "," "," "," "," "," "," "," "," "," "," "," "," "," "," "," "," "," "," ","R"," ","O","O"," "," "," "," "," "," "," "," "," "," "," "," "," "," "," "," "," "," "," "," "," "," "," "," "," "," "," "," "," "," ","O"," "," "," "," "," "," "," "," "," "," ","R"," "," "," "," "," "," "," "," "," "," "," "," "," "," "," "," ","O"," "," "," "," "," "," "," "," "," "," "," "," ","R"," "," "," "," "," "," "," "," "," "," "," "," "," "," "," "," "," "," "," "," "," "," "," "," "," "," "," "," "," "," "," "," "," "," "," "," "," "," "," "," "," "," "]
["790","R","R","R","R","R","R","R","R","O","O","O","O","O","S","R","R","O"," "," "," "," ","O"," "," "," "," "," "," "," "," "," "," "," "," "," "," ","R"," ","O","O"," "," "," "," "," "," "," ","R","R","R","R","O","R","O"," "," "," "," "," "," "," ","O"," "," "," "," "," "," "," ","O","O"," "," "," "," "," "," "," "," "," "," "," "," "," ","O"," ","O"," "," "," "," "," "," ","O","O"," "," "," ","O"," "," "," "," "," "," "," ","S"," "," "," "," ","R"," "," "," "," "," "," "," "," "," "," "," "," "," "," "," "," "," "," "," "," "," "," "," "," "," "," "," "," "," "," "," "," "," "," "," "," ","O"," ","O"," ","O"," "]
["792","R","R","R","R","R","R","R","R","O","O","O","O","O","S","R","R","O"," "," "," "," "," "," "," "," "," "," "," "," "," "," "," "," "," "," "," ","R"," ","O","O"," "," "," "," "," "," "," ","S","S","S","S","S","S"," ","O"," "," "," "," "," "," "," "," "," "," "," "," "," "," ","O","O"," "," "," "," "," "," "," "," "," "," "," "," "," ","O"," ","O"," "," "," "," "," "," "," "," "," "," "," ","O"," "," "," "," "," "," "," "," "," "," "," "," ","R"," "," "," "," "," "," "," "," "," "," "," "," "," "," "," "," "," "," "," "," "," "," "," "," "," "," "," "," "," "," "," "," "," "," "," "," ","O","O"," "," "," "," "]
["800","R","R","R","R","R","R","R","R","O","O","O","O","O","S","R","R","O"," "," "," "," "," "," "," "," "," "," "," "," "," "," "," "," "," "," "," ","R"," ","O","O"," "," "," "," "," "," "," ","O","O","O","O","O","O","O"," "," "," "," "," "," "," ","O"," "," "," "," "," ","O","O"," ","O"," "," "," "," "," "," "," "," "," "," "," "," "," "," "," "," "," ","O","O"," "," "," "," "," "," "," "," ","O"," "," "," "," "," "," "," "," "," "," "," "," ","R"," "," "," "," "," "," "," "," "," "," "," "," "," "," "," "," "," "," "," "," "," "," "," "," "," "," "," "," "," "," "," "," "," "," "," "," "," "," "," "," "," "," "]
["803","R","R","R","R","R","R","R","R","O","O","O","O","O","S","R","R","O"," "," "," "," "," "," "," "," "," "," "," "," "," ","R"," "," "," "," "," ","R"," ","O","O"," "," "," "," "," "," "," "," "," "," "," "," "," "," "," "," "," "," "," "," "," "," "," ","O"," "," "," "," "," ","O","O"," "," "," "," "," "," ","O"," "," "," ","O"," "," "," "," "," "," "," "," "," "," "," "," "," "," "," "," ","O","O"," ","O","O","O"," "," ","O"," "," "," "," ","R"," "," "," "," "," "," "," "," "," "," "," "," "," "," "," "," "," "," "," "," "," "," "," "," "," "," "," "," "," "," "," "," "," "," ","O","O"," "," ","O"," "," "," "]
["805","R","R","R","R","R","R","R","R","O","O","O","O","O","S","R","R","O"," "," "," "," "," "," "," "," "," "," "," "," "," "," "," "," "," "," "," ","R"," ","O","O"," "," "," "," "," "," "," "," "," "," "," "," "," "," "," "," "," "," "," "," "," "," "," "," "," "," "," "," "," "," ","R"," "," "," "," "," "," "," "," "," "," "," "," "," "," "," "," "," "," "," "," "," "," "," "," "," "," "," ","O"," "," "," "," "," "," "," "," "," "," "," "," ","R"," "," "," "," "," "," "," "," "," "," "," "," "," "," "," "," "," "," "," "," "," "," "," "," "," "," "," "," "," "," "," "," "," "," "," "," "," "," "," "," "," ","O"]
["806","R","R","R","R","R","R","R","R","O","O","O","O","O","S","R","R","O"," "," "," "," "," "," "," "," "," "," "," ","R"," "," "," "," "," "," "," ","R"," ","O","O"," "," "," "," "," "," "," "," "," "," "," "," "," "," "," "," "," "," "," "," "," "," "," "," "," "," "," "," "," "," ","R"," "," "," "," "," "," "," "," "," "," "," "," "," "," "," "," "," "," "," "," "," "," "," "," "," "," "," ","O"," "," "," "," "," "," "," "," "," "," "," "," ","R"," "," "," "," "," "," "," "," "," "," "," "," "," "," "," "," "," "," "," "," "," "," "," "," "," "," "," "," "," "," "," "," "," "," "," "," "," "," "," "," "," ","O"]
["810","R","R","R","R","R","R","R","R","O","O","O","O","O","S","R","R","O"," "," "," "," "," "," "," "," "," "," "," "," "," "," "," "," "," "," "," ","R"," ","O","O"," "," "," "," "," "," "," "," "," "," "," "," "," "," "," "," "," "," "," "," "," "," "," "," "," "," "," "," "," "," ","O"," "," "," "," "," "," "," "," "," "," "," "," "," "," "," "," "," "," "," "," "," "," "," "," "," "," "," "," "," "," "," "," "," "," "," "," "," "," ","O","O","R"," "," "," "," "," "," "," "," "," "," "," "," "," "," "," "," "," "," "," "," "," "," "," "," "," "," "," "," "," "," "," "," "," "," "," "," "," "," "," "," "," "," "]
["815","R","R","R","R","R","R","R","R","O","O","O","O","O","S","R","R","O"," "," "," "," "," "," "," "," "," "," "," "," "," "," "," "," "," "," "," ","R"," ","O","O"," "," "," "," "," "," "," "," "," "," "," "," "," "," "," "," "," "," "," "," "," "," "," "," "," "," "," "," "," "," ","O"," "," "," "," "," "," "," "," "," "," "," "," "," "," "," "," "," "," "," "," "," "," "," "," "," "," "," "," "," "," "," "," "," "," "," "," "," ","R"," "," ","R"," "," "," "," "," "," "," "," "," "," "," "," "," "," "," "," "," "," "," "," "," "," "," "," "," "," "," "," "," "," "," "," "," "," "," "," "," "," "," "," "," "," "]
["816","R","R","R","R","R","R","R","R","O","O","O","O","O","S","R","R","O"," "," "," "," "," "," "," "," "," "," "," "," "," "," "," "," "," "," "," ","R"," ","O","O"," "," "," "," "," "," "," "," "," "," "," "," "," "," "," "," "," "," "," "," "," "," "," "," "," "," "," "," "," "," ","O"," "," "," "," "," "," "," "," "," "," "," "," "," "," "," "," "," "," "," "," "," "," "," "," "," "," "," "," "," "," "," "," "," "," "," "," ","R"," "," "," ","R"," "," "," "," "," "," "," "," "," "," "," "," "," "," "," "," "," "," "," "," "," "," "," "," "," "," "," "," "," "," "," "," "," "," "," "," "," "," "," "," "," "," "]
["817","R","R","R","R","R","R","R","R","O","O","O","O","O","S","R","R","O"," "," "," "," "," "," "," "," "," "," "," "," "," "," "," "," "," "," "," ","R"," ","O","O"," "," "," "," "," "," "," "," "," "," "," "," "," "," "," "," "," "," "," "," "," "," "," "," "," "," "," "," "," "," ","O"," "," "," "," "," "," "," "," "," "," "," "," "," "," "," "," "," "," "," "," "," "," "," "," "," "," "," "," "," "," "," "," "," "," "," "," "," ","R"," "," ","R"," "," "," "," "," "," "," "," "," "," "," "," "," "," "," "," "," "," "," "," "," "," "," "," "," "," "," "," "," "," "," "," "," "," "," "," "," "," "," "," "," "," "]
["818","R","R","R","R","R","R","R","R","O","O","O","O","O","O","R","R","O"," "," "," "," "," "," "," "," "," "," "," "," "," "," "," "," "," "," "," ","R"," ","O","O"," "," "," "," "," "," "," "," "," "," "," "," "," "," "," "," "," "," "," "," "," "," "," "," "," "," "," "," "," ","O","O"," "," "," "," "," "," "," "," "," "," "," "," "," ","O"," "," "," "," "," "," "," "," "," "," "," "," "," ","O"," "," "," "," "," "," "," "," "," "," "," "," ","R"," "," "," "," "," "," "," "," "," "," "," "," "," "," "," "," "," "," "," "," "," "," "," "," "," "," "," "," "," "," "," "," "," "," "," "," "," "," "," "," "," "," "]
["819","R","R","R","R","R","R","R","R","O","O","O","O","O","O","R","R","O"," "," "," "," "," "," "," "," "," "," "," "," "," "," "," "," "," "," "," ","R"," ","O","O"," "," "," "," "," "," "," "," "," "," "," "," "," "," "," "," "," "," "," "," "," "," "," "," "," "," "," "," "," ","O","O"," "," "," "," "," "," "," "," "," "," "," "," "," ","O"," "," "," "," "," "," "," "," "," "," "," "," "," ","O"," "," "," "," "," "," "," "," "," "," "," "," ","R"," "," "," "," "," "," "," "," "," "," "," "," "," "," "," "," "," "," "," "," "," "," "," "," "," "," "," "," "," "," "," "," "," "," "," "," "," "," "," "," "," "," "]
["825","R","R","R","R","R","R","R","R","O","O","O","O","O","S","S","S","S"," "," "," "," "," "," "," "," "," "," "," "," "," "," "," "," "," "," "," ","R"," ","O","O"," "," "," "," "," "," "," "," "," "," "," "," "," "," "," "," "," "," "," "," "," "," "," "," "," "," "," "," "," "," ","O"," "," "," "," "," "," "," "," "," "," "," "," "," "," "," "," "," "," "," "," "," "," "," "," "," "," "," "," "," "," "," "," "," "," "," "," "," "," "," "," ","R"," "," "," ","O"," "," "," ","S","R","R"," ","R","O","O","O","O"," "," "," "," "," "," ","S"," ","S"," "," "," "," "," "," "," "," "," "," "," "," "," "," "," "," "," "]
["827","R","R","R","R","R","R","R","R","O","O","O","O","O","S","R","R","O"," "," "," "," "," "," "," "," "," "," "," "," "," "," "," "," "," "," "," ","R"," ","O","O"," "," "," "," "," "," "," "," "," "," "," "," "," "," "," "," "," "," "," "," "," "," "," "," "," "," "," "," "," "," ","O"," "," "," "," "," "," "," "," "," "," "," "," "," "," "," "," "," "," "," "," "," "," "," "," "," "," "," "," "," "," "," "," "," "," "," "," "," "," "," ","O","R"," "," "," "," "," "," "," "," "," "," "," "," "," "," "," "," "," "," "," "," "," "," "," "," "," "," "," "," "," "," "," "," "," "," "," "," "," "," "," "," "," "," "]
["840","R","R","R","R","R","R","R","R","O","O","O","O","O","S","S","S","S"," "," "," "," "," "," "," "," "," "," "," "," "," "," "," "," "," "," "," ","R"," ","O","O"," "," "," "," "," "," "," "," "," "," "," "," "," "," "," "," "," "," "," "," "," "," "," "," "," "," "," "," "," "," ","O"," "," "," "," "," "," "," "," "," "," "," "," "," "," "," "," "," "," "," "," "," "," "," "," "," "," "," ","O"," "," "," "," "," "," "," "," "," "," "," "," ","R","R","R","R","R","O","O","O","O","R","R"," ","R","O","O","O","O"," "," "," "," "," "," ","S"," ","S"," "," "," "," "," "," "," "," "," "," "," "," "," "," "," "," "," "]
["841","R","R","R","R","R","R","R","R","O","O","O","O","O","S","S","S","S"," "," "," "," "," "," "," "," "," "," "," "," "," "," "," "," "," "," "," ","R"," ","O","O"," "," "," "," "," "," "," "," "," "," "," "," "," "," "," "," "," "," "," "," "," "," "," "," "," "," "," "," "," "," ","O"," "," "," "," "," "," "," "," "," "," "," "," "," "," "," "," "," "," "," "," "," "," "," "," "," "," "," ","O"," "," "," "," "," "," "," "," "," "," "," "," ","R","R","R","R","R","O","O","O","R","R","R"," ","R","O","O","O","O"," "," "," "," "," "," ","S","R","S"," "," "," "," "," "," "," "," "," "," "," "," "," "," "," "," "," "]
["842","R","R","R","R","R","R","R","R","O","O","O","O","O","S","S","S","S"," "," "," "," "," "," "," "," "," "," "," "," "," "," "," "," "," "," "," ","R"," ","O","O"," "," "," "," "," "," "," "," "," "," "," "," "," "," "," "," "," "," "," "," "," "," "," "," "," "," "," "," "," "," ","O"," "," "," "," "," "," "," "," "," "," "," "," "," "," "," "," "," "," "," "," "," "," "," "," "," "," "," ","O"," "," "," "," "," "," "," "," "," "," "," "," ","R","R"," "," ","R","O","O","O","O","R","R"," ","R","O","O","O","O"," "," "," "," "," "," ","S","R","S"," "," "," "," "," "," "," "," "," "," "," "," "," "," "," "," "," "]
["843","R","R","R","R","R","R","R","R","O","O","O","O","O","S","S","S","S"," "," "," "," "," "," "," "," "," "," "," "," "," "," "," "," "," "," "," ","R"," ","O","O"," "," "," "," "," "," "," "," "," "," "," "," "," "," "," "," "," "," "," "," "," "," "," "," "," "," "," "," "," "," ","O"," "," "," "," "," "," "," "," "," "," "," "," "," "," "," "," "," "," "," "," "," "," "," "," "," "," "," "," "," "," "," "," "," "," "," "," "," "," "," "," ","R","R"," "," ","R","O","O","O","R","R","R","O","R","O","O","O","O"," "," "," "," "," "," ","S","R","S"," "," "," "," "," "," "," "," "," "," "," "," "," "," "," "," "," "]
["844","R","R","R","R","R","R","R","R","O","O","O"," ","O","S","S","S","S"," "," "," "," "," "," "," "," "," "," "," "," "," "," "," "," "," "," "," ","R"," ","O","O"," "," "," "," "," "," "," "," "," "," "," "," "," "," "," "," "," "," "," "," "," "," "," "," "," "," "," "," "," "," ","O"," "," "," "," "," "," "," "," "," "," "," "," "," "," "," "," "," "," "," "," "," "," "," "," "," "," "," ","O"," "," "," "," "," "," "," "," "," "," "," "," ","R","R","R","R","R"," "," "," ","S","R","R"," ","R","O","O","O","O"," "," "," "," "," "," ","S"," ","S"," "," "," "," "," "," "," "," "," "," "," "," "," "," "," "," "," "]
["845","R","R","R","R","R","R","R","R","O","O","O","O","O","S","S","S","S"," "," "," "," "," "," "," "," "," "," "," "," "," "," "," "," "," "," "," ","R"," ","O","O"," "," "," "," "," "," "," "," "," "," "," "," "," "," "," "," "," "," "," "," "," "," "," "," "," "," "," "," "," "," ","O"," "," "," "," "," "," "," "," "," "," "," "," "," "," "," "," "," "," "," "," "," "," "," "," "," "," "," ","O"," "," "," "," "," "," "," "," "," "," "," "," ","R","R","R","R","R","S","R"," ","S","R","R"," ","R","O","O","O","O"," "," "," "," "," "," ","S"," ","S"," "," "," "," "," "," "," "," "," "," "," "," "," "," "," "," "," "]
["846","R","R","R","R","R","R","R","R","O","O","O","O","O","S","S","S","S"," "," "," "," "," "," "," "," "," "," "," "," "," "," "," "," "," "," "," ","R"," ","O","O"," "," "," "," "," "," "," "," "," "," "," "," "," "," "," "," "," "," "," "," "," "," "," "," "," "," "," "," "," "," ","O"," "," "," "," "," "," "," "," "," "," "," "," "," "," "," "," "," "," "," "," "," "," "," "," "," "," "," ","O"," "," "," "," "," "," "," "," "," "," "," "," ","R","R"," "," ","R"," "," "," ","O"," "," "," "," "," "," "," "," "," "," "," "," "," "," ","S"," ","S"," "," "," "," "," "," "," ","R","R"," "," "," "," "," "," "," "," "]
["847","R","R","R","R","R","R","R","R","O","O","O","O","O","S","S","S","S"," "," "," "," "," "," "," "," "," "," "," "," "," "," "," "," "," "," "," ","R"," ","O","O"," "," "," "," "," "," "," "," "," "," "," "," "," "," "," "," "," "," "," "," "," "," "," "," "," "," "," "," "," "," ","O"," "," ","O"," "," "," "," "," "," "," "," "," "," "," "," "," "," "," "," "," "," "," "," "," "," "," "," ","O"," "," "," "," "," "," "," "," "," "," "," "," ","R","R"," "," ","R"," "," "," ","R"," "," "," "," "," "," "," "," "," "," "," "," "," "," ","S"," ","S"," "," "," "," "," "," "," ","R","R"," "," "," "," "," "," "," "," "]
["848","R","R","R","R","R","R","R","R","O","O","O","O","O","S","S","S","S"," "," "," "," "," "," "," "," "," "," "," "," "," "," "," "," "," "," "," ","R"," ","O","O"," "," "," "," "," "," "," "," "," "," "," "," "," "," "," "," "," "," "," "," "," "," "," "," "," "," "," "," "," "," ","O"," "," "," "," "," "," "," "," "," "," "," "," "," "," "," "," "," "," "," "," "," "," "," "," "," "," "," ","O"," "," "," "," "," "," "," "," "," "," "," "," ","R","R","R","R","R","O","O","O","O","R","R"," ","R","O","O","O","O"," "," "," "," "," "," ","S"," ","S"," "," "," "," "," "," "," "," "," "," "," "," "," "," "," "," "," "]
["849","R","R","R","R","R","R","R","R","O","O","O","O","O","S","S","S","S"," "," "," "," "," "," "," "," "," "," "," "," "," "," "," "," "," "," "," ","R"," ","O","O"," "," "," "," "," "," "," "," "," "," "," "," "," "," "," "," "," "," "," "," "," "," "," "," "," "," "," "," "," "," ","O"," "," "," "," "," "," "," "," "," "," "," "," "," "," "," "," "," "," "," "," "," "," "," "," "," "," "," ","O"," "," "," "," "," "," "," "," "," "," "," "," ","R","R","R","R","R","O","O","O","S","R","R"," ","R","O","O","O","O"," "," "," "," "," "," ","S"," ","S"," "," "," "," "," "," "," "," "," "," "," "," "," "," "," "," "," "]
["866","R","R","R","R","R","R","R","R","O","O","O","O","O","S","R","R","O"," "," "," "," "," "," "," "," "," "," "," "," "," "," "," "," "," "," "," ","R"," ","O","O"," "," "," "," "," "," "," "," "," "," "," "," "," "," "," "," ","O","O"," ","O"," ","R"," "," "," ","O"," "," "," "," ","O"," "," "," "," "," ","O"," "," "," "," "," "," "," "," "," "," "," "," "," "," "," "," "," "," "," "," "," ","O"," "," "," "," "," "," "," "," "," "," "," "," ","R"," "," "," "," "," "," "," "," "," "," "," "," "," "," "," "," "," ","O","O","O","O","O"," "," "," "," "," "," "," "," "," "," "," "," "," "," "," "," "," "," "," "," "]
["867","R","R","R","R","R","R","R","R","O","O","O","O","O","S","R","R","O"," "," "," "," "," "," "," "," "," "," "," "," "," "," "," "," "," "," "," ","R"," ","O","O"," "," "," "," "," "," "," "," "," "," "," ","O"," "," "," "," ","O","O"," ","O"," ","O"," "," "," ","R"," "," "," "," ","O"," "," "," "," "," "," "," "," "," "," "," "," "," "," "," "," "," "," "," "," "," "," "," "," "," "," "," ","O"," "," "," "," "," "," "," "," "," "," "," "," ","R"," "," "," "," "," "," "," "," "," "," "," "," "," "," "," "," "," ","O"," "," "," "," "," "," "," "," "," "," "," "," "," "," "," "," "," "," "," "," "," "," "," "," "]
["868","R","R","R","R","R","R","R","R","O","O","O","O","O","S","R","R","O"," "," "," "," "," "," "," "," "," "," "," "," "," "," "," "," "," "," "," ","R"," ","O","O"," "," "," "," "," "," "," "," "," "," "," ","O"," "," "," "," ","O","O"," ","O"," ","O"," "," "," ","R"," "," "," "," ","O"," "," "," "," "," "," "," "," "," "," "," "," "," "," "," "," "," "," "," "," "," "," "," "," "," "," "," ","O"," "," "," "," "," "," "," "," "," "," "," "," ","R"," "," "," "," "," "," "," "," "," "," "," "," "," "," "," "," "," ","O"," "," "," "," "," "," "," "," "," "," "," "," "," "," "," "," "," "," "," "," "," "," "," "," "]
["872","R","R","R","R","R","R","R","R","O","O","O","O","O","S","S","S","S"," "," "," "," "," "," "," "," "," "," "," "," "," "," "," "," "," "," "," ","R"," ","O","O"," "," "," "," "," "," "," "," "," "," "," "," "," "," "," "," "," "," "," "," "," "," "," "," "," "," "," "," "," "," ","O"," "," "," "," "," "," "," "," "," "," "," "," "," "," "," "," "," "," "," "," "," "," "," "," "," "," "," ","O"," "," "," "," "," "," "," "," "," "," "," "," ","R","R"," "," ","R"," "," "," "," "," "," "," "," "," "," "," "," "," "," "," "," "," "," ","S"," ","S"," "," "," "," "," "," "," ","R","R"," "," "," "," "," "," "," "," "]
["873","R","R","R","R","R","R","R","R","O","O"," "," "," "," ","S","S","S"," "," "," "," "," "," "," "," "," "," "," "," "," "," "," "," "," "," "," "," "," ","O","O"," "," "," "," "," "," "," "," "," "," "," "," "," "," "," "," "," "," "," "," "," "," "," "," "," "," "," "," "," "," ","O"," "," "," "," "," "," "," "," "," "," "," "," "," "," "," "," "," "," "," "," "," "," "," "," "," "," "," ","O"," "," "," "," "," "," "," "," "," "," "," "," ","R","R","R","R","R"," "," "," ","S","R","R"," ","R","O","O","O","O"," "," "," "," "," "," ","S"," ","S"," "," "," "," "," "," "," "," "," "," "," "," "," "," "," "," "," "]
["874","R","R","R","R","R","R","R","R","O","O","O","O","O","S","S","S","S"," "," "," "," "," "," "," "," "," "," "," "," "," "," "," "," "," "," "," ","R"," ","O","O"," "," "," "," "," "," "," "," "," "," "," "," "," "," "," "," "," "," "," "," "," "," "," "," "," "," "," "," "," "," ","O"," "," "," "," "," "," "," "," "," "," "," "," "," "," "," "," "," "," "," "," "," "," "," "," "," "," "," ","O"," "," "," "," "," "," "," "," "," "," "," "," ","R","R","O","O","R","O","O","O","O","R","R"," ","R","O","O","O","O"," "," "," "," "," "," "," ","R","S"," "," "," "," "," "," "," "," "," "," "," "," "," "," "," "," "," "]
["875","R","R","R","R","R","R","R","R","O","O","O","O","O","S","S","S","S"," "," "," "," "," "," "," "," "," "," "," "," "," "," "," "," "," "," "," ","R"," ","O","O"," "," "," "," "," "," "," "," "," "," "," "," "," "," "," "," "," "," "," "," "," "," "," "," "," "," "," "," "," "," ","O"," "," "," "," "," "," "," "," "," "," "," "," "," "," "," "," "," "," "," "," "," "," "," "," "," "," "," ","O"," "," "," "," "," "," "," "," "," "," "," "," ","R","R"," "," ","R","O","O","O","O","R","R"," ","R","O","O","O","O"," "," "," "," "," "," ","R","R","S"," "," "," "," "," "," "," "," "," "," "," "," "," "," "," "," "," "]
["876","R","R","R","R","R","R","R","R","O","O","O","O","O","S","S","S","S"," "," "," "," "," "," "," "," "," "," "," "," "," "," "," "," "," "," "," ","R"," ","O","O"," "," "," "," "," "," "," "," "," "," "," "," "," "," "," "," "," "," "," "," "," "," "," "," "," "," "," "," "," "," ","O"," "," "," "," "," "," "," "," "," "," "," "," "," "," "," "," "," "," "," "," "," "," "," "," "," "," "," "," "," "," "," "," "," "," "," "," "," "," "," "," ","R","R"," "," ","R","O","O","O","O","R","R","O","R","O","O","O","O"," "," "," "," "," "," "," ","R","S"," "," "," "," "," "," "," "," "," "," "," "," "," "," "," "," "," "]
["877","R","R","R","R","R","R","R","R","O","O","O","O","O","S","S","S","S"," "," "," "," "," "," "," "," "," "," "," "," "," "," "," "," "," "," "," ","R"," ","O","O"," "," "," "," "," "," "," "," "," "," "," "," "," "," "," "," "," "," "," "," "," "," "," "," "," "," "," "," "," "," ","O"," "," "," "," "," "," "," "," "," "," "," "," "," "," "," "," "," "," "," "," "," "," "," "," "," "," "," "," "," "," "," "," "," "," "," "," "," "," "," "," ","R","R","R","R","R","O","O","O","O","R","R"," ","R","O","O","O","O"," "," "," "," "," "," "," "," ","S"," "," "," "," "," "," "," "," "," "," "," "," "," "," "," "," "," "]
["878","R","R","R","R","R","R","R","R","O","O","O","O","O","S","S","S","S"," "," "," "," "," "," "," "," "," "," "," "," "," "," "," "," "," "," "," ","R"," ","O","O"," "," "," "," "," "," "," "," "," "," "," "," "," "," "," "," "," "," "," "," "," "," "," "," "," "," "," "," "," "," ","O"," "," "," "," "," "," "," "," "," "," "," "," "," "," "," "," "," "," "," "," "," "," "," "," "," "," "," "," "," "," "," "," "," "," "," "," "," "," "," "," ","R","R","R","R","R"," "," "," ","O"," "," "," ","R","O","O","O","O"," "," "," "," "," "," "," "," ","S"," "," "," "," "," "," "," "," "," "," "," "," "," "," "," "," "," "]
["879","R","R","R","R","R","R","R","R","O","O","O","O","O","S","S","S","S"," "," "," "," "," "," "," "," "," "," "," "," "," "," "," "," "," "," "," ","R"," ","O","O"," "," "," "," "," "," "," "," "," "," "," "," "," "," "," "," "," "," "," "," "," "," "," "," "," "," "," "," "," "," ","O"," "," "," "," "," "," "," "," "," "," "," "," "," "," "," "," "," "," "," "," "," "," "," "," "," "," "," "," "," "," "," "," "," "," "," "," "," "," "," "," ","R","R"," "," ","R"," "," "," ","O","R","R"," ","R","O","O","O","O"," "," "," "," "," "," "," ","R","S"," "," "," "," "," "," "," "," "," "," "," "," "," "," "," "," "," "]
["880","R","R","R","R","R","R","R","R","O","O","O","O","O","S","R","R","O"," "," "," "," "," "," "," ","R"," "," "," "," "," "," "," "," "," "," "," ","R"," ","O","O"," "," "," "," "," "," "," "," "," "," "," "," "," "," "," "," "," "," "," "," "," "," "," "," ","O"," "," "," "," "," ","O","O","O"," "," "," "," "," "," "," "," "," "," ","O"," "," "," "," "," "," "," "," "," "," "," "," "," "," "," "," "," "," "," "," "," "," "," "," "," "," "," ","R"," "," "," "," "," "," "," "," "," "," "," "," "," "," "," "," "," "," "," "," "," "," "," "," "," "," "," "," "," "," "," "," "," "," "," "," "," "," "," "," "," "," "]
["881","R","R","R","R","R","R","R","R","O","O","O","O","O","S","R","R","O"," "," "," "," "," "," "," "," "," "," ","R","O"," "," "," "," "," "," "," ","R"," ","O","O"," "," "," "," "," "," "," "," "," "," "," "," "," "," "," "," "," "," "," "," "," ","O"," "," "," "," "," "," "," "," ","O"," "," "," "," "," "," "," "," "," "," "," "," "," "," "," "," "," "," "," "," "," "," "," "," "," "," "," "," "," "," "," "," "," "," "," "," "," "," "," "," ","R"," "," "," "," "," "," "," "," "," "," "," "," "," "," "," "," "," "," "," "," "," "," "," "," "," "," "," "," "," "," "," "," "," "," "," "," "," "," "," "," "," ","O"]
["882","R","R","R","R","R","R","R","R","O","O","O","O","O","S","R","R","O"," "," "," "," "," "," "," "," ","R"," "," "," "," "," ","S"," "," "," "," ","R"," ","O","O"," "," "," "," "," "," "," "," "," "," "," "," "," "," "," "," "," "," "," "," "," ","O"," ","O","O"," "," "," "," "," ","O"," "," ","O"," "," "," ","S"," "," "," ","O"," "," "," "," "," "," "," "," "," "," "," "," "," "," "," "," ","O","O"," ","O"," ","O","O"," "," "," "," "," "," ","R"," "," "," "," "," "," "," "," "," "," "," "," "," "," "," "," "," "," "," "," "," "," "," "," "," "," "," "," "," "," "," "," "," "," ","O","O"," "," ","O"," "," "," "]
["883","R","R","R","R","R","R","R","R","O","O","O","O","O","S","R","R","O"," "," "," ","R"," "," "," "," "," "," "," "," "," "," "," "," "," "," "," ","R"," ","O","O"," "," "," "," "," "," "," "," "," "," "," "," "," "," "," "," "," "," "," "," "," "," "," "," ","R"," "," "," "," "," ","O"," "," "," "," "," "," "," ","O"," "," "," "," "," "," "," "," "," "," "," "," "," "," "," "," "," "," "," ","O"," "," "," "," "," "," ","O"," "," "," "," "," ","R"," "," "," "," "," "," "," "," "," "," "," "," "," "," "," "," "," "," "," "," "," "," "," "," "," "," "," "," "," "," "," "," "," "," "," "," "," "," "," "," "," "," "]
["885","R","R","R","R","R","R","R","R","O","O","O","O","O","S","S","S","S"," "," "," "," "," "," "," "," "," "," "," "," "," "," "," "," "," "," "," ","R"," ","O","O"," "," "," "," "," "," "," "," "," "," "," "," "," "," "," "," "," "," "," "," "," "," "," "," "," "," "," "," "," "," ","O"," "," "," "," "," "," "," "," "," "," "," "," "," "," "," "," "," "," "," "," "," "," "," "," "," "," "," ","O"," "," "," "," "," "," "," "," "," "," "," "," ","R","R","R","R","R"," "," "," ","O","R","R"," ","R","O","O","O","O"," "," "," "," "," "," ","R"," ","S"," "," "," "," "," "," "," "," "," "," "," "," "," "," "," "," "," "]
["886","R","R","R","R","R","R","R","R","O","O","O","O","O","S","S","S","S"," "," "," "," "," "," "," "," "," "," "," "," "," "," "," "," "," "," "," ","R"," ","O","O"," "," "," "," "," "," "," "," "," "," "," "," "," "," "," "," "," "," "," "," "," "," "," "," "," "," "," "," "," "," ","O"," "," "," "," "," "," "," "," "," "," "," "," "," "," "," "," "," "," "," "," "," "," "," "," "," "," "," ","O"," "," "," "," "," "," "," "," "," "," "," "," ","R","R","R","R","R","S","S","S","S","R","R"," ","R","O","O","O","O"," "," "," "," "," "," ","S"," ","S"," "," "," "," "," "," "," "," "," "," "," "," "," "," "," "," "," "]
["887","R","R","R","R","R","R","R","R","O","O","O","O","O","S","S","S","S"," "," "," "," "," "," "," "," "," "," "," "," "," "," "," "," "," "," "," ","R"," ","O","O"," "," "," "," "," "," "," "," "," "," "," "," "," "," "," "," "," "," "," "," "," "," "," "," "," "," "," "," "," "," ","O"," "," "," "," "," "," "," "," "," "," "," "," "," "," "," "," "," "," "," "," "," "," "," "," "," "," "," ","O"," "," "," "," "," "," "," "," "," "," "," "," ","R","R","R","R","R","O","O","O","O","R","R"," ","R","O","O","O","O"," "," "," "," "," "," "," "," "," "," "," "," "," "," "," "," "," "," "," "," "," "," "," "," "," "," "]
["888","R","R","R","R","R","R","R","R","O","O","O","O","O","S","R","R","O"," "," "," "," "," "," "," "," "," "," "," "," "," "," "," "," "," "," "," ","R"," ","O","O"," "," "," "," "," "," "," "," "," "," "," "," "," "," "," "," "," "," "," "," "," "," "," "," "," "," "," "," "," "," ","O"," "," "," "," "," "," "," "," "," "," "," "," "," "," "," "," "," "," "," "," "," "," "," "," "," "," "," ","O"," "," "," "," "," "," "," "," "," "," "," "," ","R"," "," "," "," "," "," "," "," "," "," "," "," "," "," "," "," "," "," "," "," "," "," "," "," "," "," "," "," "," "," "," "," "," "," "," "," "," "," "," "," "," "," "]
["889","R","R","R","R","R","R","R","R","O","O","O","O","O","S","S","S","S"," "," "," "," "," "," "," "," "," "," "," "," "," "," "," "," "," "," "," ","R"," ","O","O"," "," "," "," "," "," "," "," "," "," "," "," "," "," "," "," "," "," "," "," "," "," "," "," "," "," "," "," "," "," ","O"," "," "," "," "," "," "," "," "," "," "," "," "," "," "," "," "," "," "," "," "," "," "," "," "," "," "," ","O"," "," "," "," "," "," "," "," "," "," "," "," ","R","R","R","R","R","O","O","O","R","R","R"," ","R","O","O","O","O"," "," "," "," "," "," ","S","R","S"," "," "," "," "," "," "," "," "," "," "," "," "," "," "," "," "," "]
["890","R","R","R","R","R","R","R","R","O","O","O","O","O","S","R","R","O","S","S","S","S","S","S","S","S","S","S","S","S","S","S","S","S","S","S","S","R"," ","O","O","S","S","S","S","S","S","S","O","O","O","O","O","O","O","S","R","R","R","R","R","S","O","S","S","S","O","S","S","S","O","O","S","S","S","S","S","O","S","S","S","S","S","S","S","O","S","O","S","O","O","O","O","O"," "," ","S","S","S","O","S","S","S","S","S","S","S","S"," "," "," ","S","R"," "," "," "," "," "," "," "," "," "," "," "," "," "," "," "," ","S","O"," "," "," "," "," "," "," "," "," "," "," "," "," "," "," "," "," "," "," "," "," "," "," "," "]
["891","R","R","R","R","R","R","R","R","O","O","O","O","O","S","R","R","O"," "," "," "," "," "," "," "," "," "," "," "," "," "," "," "," "," "," "," ","R"," ","O","O"," "," "," "," "," "," "," "," "," "," "," "," "," "," "," ","O","O","R"," ","R","O"," "," "," "," ","S"," "," "," "," ","O"," "," "," "," "," "," "," "," "," "," "," "," "," ","O"," "," "," "," "," "," "," "," "," "," "," "," "," ","O"," "," "," "," "," "," "," "," "," "," "," "," ","R"," "," "," "," "," "," "," "," "," "," "," "," "," "," "," "," "," ","O"," "," "," "," "," "," "," "," "," "," "," "," "," "," "," "," "," "," "," "," "," "," "," "," "]
["892","R","R","R","R","R","R","R","R","O","O","O","O","O","S","R","R","O"," "," "," "," "," "," "," "," "," "," "," "," "," "," "," "," "," "," "," ","R"," ","O","O"," "," "," "," "," "," "," "," "," "," "," "," "," "," "," ","R","R","R"," ","R"," ","O"," "," "," ","S"," "," "," "," ","O"," "," "," "," "," "," "," "," "," "," "," "," "," "," "," "," "," "," "," "," "," "," "," "," "," "," "," ","O"," "," "," "," "," "," "," "," "," "," "," "," ","R"," "," "," "," "," "," "," "," "," "," "," "," "," "," "," "," "," ","O"," "," "," "," "," "," "," "," "," "," "," "," "," "," "," "," "," "," "," "," "," "," "," "," "]
["893","R","R","R","R","R","R","R","R","O","O","O","O","O","S","R","R","O"," "," "," "," "," "," "," "," ","S"," "," "," "," "," "," "," "," "," "," ","R"," ","O","O"," "," "," "," "," "," "," "," "," "," "," "," "," "," "," "," ","R","R"," ","R"," ","O"," "," "," ","S"," "," "," "," ","O"," "," "," "," "," "," "," "," "," "," "," "," "," "," "," "," "," "," "," "," "," "," "," "," "," "," "," ","O"," "," "," "," "," "," "," "," "," "," "," "," ","R"," "," "," "," "," "," "," "," "," "," "," "," "," "," "," "," "," ","O"," "," "," "," "," "," "," "," "," "," "," "," "," "," "," "," "," "," "," "," "," "," "," "," "]
["894","R","R","R","R","R","R","R","R","O","O","O","O","O","S","R","R","O","S","S","S","S","S","S","S","S","S","S","S","S","S","S","S","S","S","S","S","R"," ","O","O","S","S","S","S","S","S","S","S","S","S","S","O","S","S","S","R","R","R","R","R","S","O","S","S","S","O","S","S","S","O","O","S","S","S","S","S","S","S","S","S","S","S","S","S","O","S","O","S","O","O","O","O","O"," "," ","S","S","S","O","S","S","S","S","S","S","S","S"," "," "," ","S","R"," "," "," "," "," "," "," "," "," "," "," "," "," "," "," "," ","S","O"," "," "," "," "," "," "," "," "," "," "," "," "," "," "," "," "," "," "," "," "," "," "," "," "]
["895","R","R","R","R","R","R","R","R","O","O","O","O","O","S","R","R","O"," "," "," "," "," "," "," "," "," "," "," "," "," "," "," "," "," "," "," ","R"," ","O","O"," "," "," "," "," "," "," "," "," "," "," "," "," "," "," "," "," "," "," "," "," "," "," "," "," ","S"," "," "," "," ","O"," "," "," "," "," "," "," "," "," "," "," "," "," "," "," "," "," "," "," "," "," "," "," "," "," "," "," ","O"," "," "," "," "," "," "," "," "," "," "," "," ","R"," "," "," "," "," "," "," "," "," "," "," "," "," "," "," "," "," "," "," "," "," "," "," "," "," "," "," "," "," "," "," "," "," "," "," "," "," "," "," "," "," "," "]
["896","R","R","R","R","R","R","R","R","O","O","O","O","O","S","R","R","O","S","S","S","S","S","S","S","S","S","S","S","S","S","S","S","S","S","S","S","R"," ","O","O","S","S","S","S","S","S","S","S","S","S","S","O","S","S","S","R","R","R","R","R","S","O","S","S","S","O","S","S","S","O","O","S","S","S","S","S","S","S","S","S","S","S","S","S","O","S","O","S","O","O","O","O","O"," "," ","S","S","S","O","S","S","S","S","S","S","S","S"," "," "," ","S","R"," "," "," "," "," "," "," "," "," "," "," "," "," "," "," "," ","S","O"," "," "," "," "," "," "," "," "," "," "," "," "," "," "," "," "," "," "," "," "," "," "," "," "]
["897","R","R","R","R","R","R","R","R","O","O","O","O","O","S","R","R","O","S","S","S","S","S","S","S","S","S","S","S","S","S","S","S","S","S","S","S","R"," ","O","O","S","S","S","S","S","S","S","S","S","S","S","O","S","S","S","R","R","R","R","R","S","O","S","S","S","O","S","S","S","O","O","S","S","S","S","S","S","S","S","S","S","S","S","S","O","S","O","S","O","O","O","O","O"," "," ","S","S","S","O","S","S","S","S","S","S","S","S"," "," "," ","S","R"," "," "," "," "," "," "," "," "," "," "," "," "," "," "," "," ","S","O"," "," "," "," "," "," "," "," "," "," "," "," "," "," "," "," "," "," "," "," "," "," "," "," "]
["898","R","R","R","R","R","R","R","R","O","O","O","O","O","S","R","R","R"," "," "," "," "," "," "," "," "," "," "," "," "," "," "," "," "," "," "," ","R"," "," "," "," "," "," "," "," "," "," "," "," "," "," "," "," ","R"," "," "," "," "," "," "," "," "," "," "," "," "," "," "," "," ","O"," "," "," "," ","O"," "," "," "," "," "," "," "," "," "," "," "," "," "," "," "," "," "," "," "," "," "," "," "," "," "," "," "," "," "," "," "," "," "," "," ","R"," "," "," "," "," "," "," "," "," "," "," "," "," "," "," "," "," "," "," "," "," "," "," "," "," "," "," "," "," "," "," "," "," "," "," "," "," "," "," "," "," "," "]
["899","R","R","R","R","R","R","R","R","O","O","O","O","O","S","R","R","O"," "," "," "," "," "," "," "," "," "," "," "," "," "," "," "," "," "," "," ","R"," ","O","O"," "," "," "," "," "," "," "," "," "," "," "," "," "," "," ","R","R","O"," ","O"," ","O"," "," "," ","O"," "," "," "," ","O"," "," "," "," "," "," "," "," "," "," "," "," "," "," "," "," "," "," "," "," "," "," "," "," "," "," "," ","O"," "," "," "," "," "," "," "," "," "," "," "," ","R"," "," "," "," "," "," "," "," "," "," "," "," "," "," "," "," "," ","O"," "," "," "," "," "," "," "," "," "," "," "," "," "," "," "," "," "," "," "," "," "," "," "," "]
["900","R","R","R","R","R","R","R","R","O","O","O","O","O","S","R","R","O","R","R","R","R"," "," ","O","R","R","R","R","O","R","R"," "," "," "," ","O","R","S","O","O","O","O","O","O","O","O","O","R","R","R","R","R","R"," ","O","O","R","R","R","R"," ","R","O","O","O","O","O","O","O","O","O","O","O","R","R","R","O","R","R"," "," ","O"," ","R","O","R","O"," ","O","O","O","O","O","O","O"," ","O","O","O","O","R","O","R","O","O","R","R"," "," "," "," ","R"," "," "," "," "," "," "," "," "," "," "," "," "," "," "," "," ","O"," ","O"," "," "," "," "," "," "," "," "," "," "," "," "," "," "," ","R","R","O","R","O","R","R","O"]
["901","R","R","R","R","R","R","R","R","O","O","O","O","O","S","R","R","O"," "," "," "," "," "," "," "," "," "," "," "," "," "," "," "," "," "," "," ","R"," ","O","O"," "," "," "," "," "," "," "," "," "," "," ","R"," "," "," "," "," "," "," "," "," "," ","R"," "," "," "," "," "," "," ","O"," "," "," "," "," "," "," "," "," "," "," "," "," "," "," "," "," "," "," "," "," "," "," "," "," "," "," ","O"," "," "," "," "," "," "," "," "," "," "," "," ","R"," "," "," "," "," "," "," "," "," "," "," "," "," "," "," "," "," "," "," "," "," "," "," "," "," "," "," "," "," "," "," "," "," "," "," "," "," "," "," "," "," "," "]
["902","R","R","R","R","R","R","R","R","O","O","O","O","O","S","R","R","O","R","R","R","R"," "," "," ","R","R","R","R"," ","R","R"," "," "," "," ","R","R","R"," "," "," "," "," "," "," "," "," ","R","R","R","R","R","R"," "," ","R","R","R","R","R"," ","R"," "," "," "," "," "," "," ","R"," "," "," ","R","R"," ","R","R","R"," "," "," "," ","R","R","R","R"," "," "," "," "," "," "," "," "," ","O","O"," "," "," "," "," "," "," ","R","R"," "," "," "," ","R"," "," "," "," "," "," "," "," "," "," "," "," "," "," "," "," "," "," "," "," "," "," "," "," "," "," "," "," "," "," "," "," "," "," "," "," "," ","R"," "," "," "," "]
["903","R","R","R","R","R","R","R","R","O","O","O","O","O","S","R","R","O"," "," "," "," "," "," "," "," "," "," "," "," "," "," "," "," "," "," "," "," "," ","O","O"," "," "," "," "," "," "," "," "," "," "," "," "," "," "," "," "," "," "," "," "," "," "," "," "," "," "," "," "," "," ","O"," "," "," "," "," "," "," "," "," "," "," "," "," "," "," "," "," ","O","O"," "," "," "," "," "," "," "," ","S"," "," "," "," "," "," "," "," "," "," "," "," ","R"," "," "," "," "," "," "," "," "," "," "," "," "," "," "," "," "," "," "," "," "," "," "," "," "," "," "," "," "," "," "," "," "," "," "," "," "," "," "," "," "," "," "]
["904","R","R","R","R","R","R","R","R","O","O","O","O","O","S","R","R","O"," "," "," "," "," "," "," "," "," "," "," "," "," "," "," "," "," "," ","R","R"," ","O","O"," "," "," "," "," "," "," "," "," "," "," "," "," "," "," "," "," "," "," "," "," "," "," "," "," "," "," "," "," "," ","O"," "," "," "," "," "," "," "," "," "," "," "," "," "," "," "," "," "," "," "," "," "," "," "," "," "," "," ","O"," "," "," "," "," "," "," "," "," "," "," "," ","R"," "," "," "," "," "," "," "," "," "," "," "," "," "," "," "," "," "," "," "," "," "," "," "," "," "," "," "," "," "," "," "," "," "," "," "," "," "," "," "," "," "," "]
["906","R","R","R","R","R","R","R","R","O","O","O","O","O","S","R","R","O","R","R","O","R"," "," "," ","R","R","R","R"," ","R","R"," "," "," "," "," ","R","R","O","O"," ","R"," "," ","R"," ","R","R","R","R","R","R","R"," "," ","R","R","R","R","R"," ","R"," "," "," "," "," "," ","R","R","O"," "," ","R","R"," "," ","R","R"," "," "," "," ","R","R","R","R"," ","O","O"," "," "," "," "," "," ","O","O","O"," ","R"," "," "," "," ","R","R"," "," "," "," ","R"," "," "," "," "," "," "," "," "," "," "," "," "," "," "," "," "," "," "," "," "," "," "," "," "," "," "," "," "," "," "," "," "," "," "," "," "," "," "," "," "," "," "]
["908","R","R","R","R","R","R","R","R","O","O","O","O","O","S","R","R","O"," "," "," "," "," "," "," "," "," "," "," "," "," "," "," "," "," "," "," ","R","R","O","O"," "," "," "," "," "," "," "," "," "," "," "," "," ","O"," "," "," "," "," "," "," "," "," "," "," "," "," "," "," "," ","O"," "," "," "," "," "," "," "," "," "," "," "," "," "," "," "," "," "," "," "," "," "," "," "," "," "," "," ","O"," "," "," "," "," "," "," "," "," "," "," "," ","R"," "," "," "," "," "," "," "," "," "," "," "," "," "," "," "," "," "," "," "," "," "," "," "," "," "," "," "," "," "," "," "," "," "," "," "," "," "," "," "," "," "," "]
["910","R","R","R","R","R","R","R","R","O","O","O","O","O","S","R","R","O"," "," "," "," "," "," "," "," "," "," "," "," "," "," "," "," "," "," "," ","R"," ","O","O"," "," "," "," "," "," "," "," "," "," "," "," "," "," "," "," "," "," "," "," "," "," "," "," "," "," "," "," "," "," ","O"," "," "," "," "," "," "," "," "," "," "," "," "," "," "," "," "," "," "," "," "," "," "," "," "," "," "," ","O"," "," "," "," "," "," "," "," "," "," "," "," ","R"," "," "," "," "," "," "," "," "," "," "," "," "," "," "," "," "," "," "," "," "," "," "," "," "," "," "," "," "," "," "," "," "," "," "," "," "," "," "," "," "," "," "]
["911","R","R","R","R","R","R","R","R","O","O","O","O","O","S","R","R","O","R","R","R","R"," "," "," ","R","R","R","R"," ","R","R"," "," "," "," ","R","R","R","O","O"," ","R"," "," ","R"," ","R","R","R","R","R","R","R"," "," ","R","R","R","R","R"," ","R"," "," "," "," "," "," ","R","R","O"," "," ","R","R"," "," ","R","R"," "," "," "," ","R","R","R","R"," "," "," "," "," "," "," "," "," ","O","O","O"," ","R"," "," "," "," ","R","R"," "," "," "," ","R"," "," "," "," "," "," "," "," "," "," "," "," "," "," "," "," "," ","O"," "," "," "," "," "," "," "," "," "," "," "," "," "," "," "," "," "," "," ","R"," "," "," "," "]
["915","R","R","R","R","R","R","R","R","O","O","O","O","O","S","R","R","O"," "," "," "," "," "," "," "," "," "," "," "," ","R"," "," "," "," "," "," ","R"," ","O","O"," "," "," "," "," "," "," "," "," "," "," "," "," "," "," "," "," "," "," "," "," ","O"," "," "," "," "," "," "," "," ","O"," "," "," "," "," "," "," "," "," "," "," "," "," "," "," "," "," "," "," "," "," "," "," "," "," "," "," ","O"," "," "," "," "," "," "," "," "," "," "," "," ","R"," "," "," "," "," "," "," "," "," "," "," "," "," "," "," "," "," ","O"," "," "," "," "," "," "," "," "," "," "," "," "," "," "," "," "," "," "," "," "," "," "," "," "]
["916","R","R","R","R","R","R","R","R","R","O","O","O","O","S","R","R","O"," "," "," "," "," "," "," "," "," "," "," "," ","R"," "," "," "," "," "," "," "," "," ","O"," "," "," "," "," "," "," "," "," "," "," "," "," "," "," "," "," "," "," "," "," "," "," "," "," "," "," "," "," "," ","O"," "," "," "," "," "," "," "," "," "," "," "," "," "," "," "," "," "," "," "," "," "," "," "," "," "," "," ","O"," "," "," "," "," "," "," "," "," "," "," "," ","R"," "," "," "," "," "," "," "," "," "," "," "," "," "," "," "," "," "," "," "," "," "," "," "," "," "," "," "," "," "," "," "," "," "," "," "," "," "," "," "," "," "," "]
["917","R","R","R","R","R","R","R","R","O","O","O","O","O","S","R","R","O"," "," "," "," "," "," "," "," ","O"," ","O","O"," "," "," "," "," "," "," ","R"," ","O","O"," "," "," "," "," "," "," "," "," "," "," "," "," "," "," ","R","O","O","O","O","O","O"," "," "," "," "," "," "," ","O","O"," "," "," "," "," "," "," "," "," "," "," "," "," "," "," "," "," ","R","R","R"," "," "," "," "," "," "," ","O"," "," "," "," "," "," "," "," "," "," "," "," ","R"," "," "," "," "," "," "," "," "," "," "," "," "," "," "," "," "," ","O"," "," "," "," "," "," "," "," "," "," "," "," "," "," "," "," "," "," "," "," "," "," "," "," "]
["919","R","R","R","R","R","R","R","R","O","O","O","O","O","S","R","R","O"," "," "," "," "," "," "," "," "," "," "," "," "," "," "," "," "," "," "," ","R"," ","O","O"," "," "," "," "," "," "," ","R","R","R","R","R","R","R"," "," "," "," "," "," "," "," "," "," "," "," "," "," "," "," ","O"," "," "," "," "," "," "," "," "," "," "," "," "," "," "," "," "," "," "," "," "," "," "," "," "," "," "," ","O"," "," "," "," "," "," "," "," "," "," "," "," ","R"," "," "," "," "," "," "," "," "," "," "," "," "," "," "," "," "," "," "," "," "," "," "," "," "," "," "," "," "," "," "," "," "," "," "," "," "," "," "," "," "," "," "]
["920","R","R","R","R","R","R","R","R","O","O","O","O","O","S","R","R","O"," "," ","O"," "," "," "," "," ","O"," ","O","O"," "," "," "," "," "," "," ","R"," ","O","O"," "," "," "," "," "," "," "," "," "," "," "," "," "," "," "," ","O","O","O","O"," "," "," ","O","O"," "," "," "," "," ","O"," "," "," "," ","O","O"," "," "," "," ","O"," "," "," "," "," "," "," "," "," "," "," "," "," "," ","O","O","O"," "," "," "," "," "," "," ","O"," "," "," "," ","R"," "," "," "," "," "," "," "," "," "," "," "," "," "," "," "," "," ","O"," "," "," "," "," "," "," "," "," "," "," "," "," "," "," "," "," "," "," "," "," "," "," "," "]
["922","R","R","R","R","R","R","R","R","O","O","O","O","O","S","R","R","O"," "," "," "," "," "," "," "," "," "," "," "," "," "," "," "," "," "," ","R","R"," ","O","O"," "," "," "," "," "," "," ","R","R","R","R","R","R"," "," "," "," "," "," "," "," "," "," "," "," "," ","O"," "," ","O","O"," "," "," "," "," "," "," "," "," "," "," "," "," "," "," "," "," "," "," "," "," "," "," "," "," "," "," ","O"," "," "," "," "," "," "," "," "," "," "," "," ","R"," "," "," "," "," "," "," "," "," "," "," "," "," "," "," "," ","O"," "," "," "," "," "," "," "," "," "," "," "," "," "," "," "," "," "," "," "," "," "," "," "," "," "]
["923","R","R","R","R","R","R","R","R","O","O","O","O","O","S","R","R","O"," "," "," "," "," "," "," "," "," "," "," "," "," "," "," "," "," "," ","R","R"," ","O","O"," "," "," "," "," "," "," "," "," "," "," "," "," "," "," "," "," "," "," "," "," "," "," "," "," "," "," "," "," ","O","O"," "," "," "," "," "," "," "," "," "," "," "," "," "," "," "," "," "," "," "," "," "," "," "," "," "," "," ","O"," "," "," "," "," "," "," "," "," "," "," "," ","R"," "," "," "," "," "," "," "," "," "," "," "," "," "," "," "," "," "," "," "," "," "," "," "," "," "," "," "," "," "," "," "," "," "," "," "," "," "," "," "," "," "," "]
["924","R","R","R","R","R","R","R","R","O","O","O","O","O","S","R","R","O"," "," "," "," "," "," "," "," "," "," "," "," "," "," "," "," "," "," "," ","R"," ","O","O"," "," "," "," "," "," "," "," "," "," "," "," "," "," "," "," "," "," "," "," "," "," "," "," "," "," "," "," "," ","R","O"," "," "," "," "," "," "," "," "," "," "," "," "," "," "," "," "," "," "," "," "," "," "," "," "," "," "," ","O"," "," "," "," "," "," "," "," "," "," "," "," ","R"," "," "," "," "," "," "," "," "," "," "," "," "," "," "," "," "," "," "," "," "," "," "," "," "," "," "," "," "," "," "," "," "," "," "," "," "," "," "," "," "," "," "]
["925","R","R","R","R","R","R","R","R","O","O","O","O","O","S","R","R","O"," "," "," "," "," "," "," "," "," "," "," "," "," "," "," "," "," "," "," ","R"," ","O","O"," "," "," "," "," "," "," "," "," "," "," "," "," "," "," "," "," "," "," "," "," "," "," "," "," "," "," "," "," "," ","O"," "," "," "," "," "," "," "," "," "," "," "," "," "," "," "," "," "," "," "," "," "," "," "," "," "," "," ","O"," "," "," "," "," "," "," "," "," "," "," "," ","R"," "," "," "," "," "," "," "," "," "," "," "," "," "," "," "," "," "," "," "," "," "," "," "," "," "," "," "," "," "," "," "," "," "," "," "," "," "," "," "," "," "," "]
["926","R","R","R","R","R","R","R","R","O","O","O","O","O","S","R","R","O"," "," "," "," "," "," "," "," "," "," "," "," "," "," "," "," "," "," "," ","R"," ","O","O"," "," "," "," "," "," "," "," "," "," "," "," "," "," "," "," "," "," "," "," "," "," "," "," "," "," "," "," "," "," ","O"," "," "," "," "," "," "," "," "," "," "," "," "," "," "," "," "," ","R","R"," "," "," "," "," "," "," "," ","O"," "," "," "," "," "," "," "," "," "," "," "," ","R"," "," "," "," "," "," "," "," "," "," "," "," "," "," "," "," "," "," "," "," "," "," "," "," "," "," "," "," "," "," "," "," "," "," "," "," "," "," "," "," "," "," "]
["927","R","R","R","R","R","R","R","R","O","O","O","O","O","S","R","R","O"," "," "," "," "," "," "," "," "," "," "," "," "," "," "," "," "," "," "," ","R"," ","O","O"," "," "," "," "," "," "," "," "," "," "," "," "," "," "," "," "," "," "," "," "," "," "," "," "," "," "," "," "," "," ","O"," "," "," "," "," "," "," "," "," "," "," "," "," "," "," "," "," "," "," "," "," "," "," "," "," "," "," ","O"," "," "," "," "," "," "," "," "," "," "," "," ","R"," "," "," "," "," "," "," "," "," "," "," "," "," "," "," "," "," "," "," "," "," "," "," "," "," "," "," "," "," "," "," "," "," "," "," "," "," "," "," "," "," "," "]
["928","R","R","R","R","R","R","R","R","O","O","O","O","O","S","R","R","O","R","R","R","R"," "," "," ","R","R","S"," "," "," "," "," "," "," "," ","R","R","S","O","O"," "," "," "," "," "," "," ","R","R","R","R","R","R"," "," ","S"," "," "," "," "," "," "," "," "," "," "," "," "," ","S","R"," "," "," "," "," ","S"," ","R"," "," ","O"," ","S","S","S","S"," "," "," "," "," "," "," "," "," ","O","O","O"," "," "," "," "," "," ","R","R"," "," "," "," ","R"," "," "," "," "," "," "," "," "," "," "," "," "," "," "," "," "," "," "," "," "," "," "," "," "," "," "," "," "," "," "," "," "," "," "," "," "," ","R"," "," "," "," "]
["929","R","R","R","R","R","R","R","R","O","O","O","O","O","S","R","R","O"," "," "," "," "," "," "," "," "," "," "," "," "," "," "," "," "," "," "," ","R","R","O","O"," "," "," "," "," "," "," "," "," "," "," "," "," ","O"," "," "," "," "," "," "," "," "," "," "," "," "," "," "," "," ","O"," "," "," "," "," "," "," "," "," "," "," "," "," "," "," "," "," "," "," "," "," "," "," "," "," "," "," ","O"," "," "," "," "," "," "," "," "," "," "," "," ","R"," "," "," "," "," "," "," "," "," "," "," "," "," "," "," "," "," "," "," "," "," "," "," "," "," "," "," "," "," "," "," "," "," "," "," "," "," "," "," "," "," "," "]
["930","R","R","R","R","R","R","R","R","O","O","O","O","O","S","R","R","O"," "," "," "," "," "," "," "," "," "," "," "," "," "," "," "," "," "," ","R","R"," ","O","O"," "," "," "," "," "," "," ","R","R","R","R","R","R"," "," "," "," "," "," "," "," "," "," "," "," "," ","O"," "," ","O","O"," "," "," "," "," "," "," "," "," "," "," "," "," "," "," "," "," "," "," "," "," "," "," "," "," "," "," ","O"," "," "," "," "," "," "," "," "," "," "," "," ","R"," "," "," "," "," "," "," "," "," "," "," "," "," "," "," "," ","O"," "," "," "," "," "," "," "," "," "," "," "," "," "," "," "," "," "," "," "," "," "," "," "," "," "]
["931","R","R","R","R","R","R","R","R","O","O","O","O","O","S","R","R","O"," "," "," "," "," "," "," "," "," "," "," "," "," "," "," "," "," "," ","R","R"," ","O","O"," "," "," "," "," "," "," "," "," "," "," "," "," "," "," "," "," "," "," "," "," "," "," "," "," "," "," "," "," ","O","O"," "," "," "," "," "," "," "," "," "," "," "," "," "," "," "," "," "," "," "," "," "," "," "," "," "," "," ","O"," "," "," "," "," "," "," "," "," "," "," "," ","R"," "," "," "," "," "," "," "," "," "," "," "," "," "," "," "," "," "," "," "," "," "," "," "," "," "," "," "," "," "," "," "," "," "," "," "," "," "," "," "," "," "," "]
["932","R","R","R","R","R","R","R","R","O","O","O","O","O","S","R","R","O"," "," "," "," "," "," "," "," "," "," "," "," "," "," "," "," "," "," "," ","R"," ","O","O"," "," "," "," "," "," "," "," "," "," "," "," "," "," "," "," "," "," "," "," "," "," "," "," "," "," "," "," "," ","R","O"," "," "," "," "," "," "," "," "," "," "," "," "," "," "," "," "," "," "," "," "," "," "," "," "," "," "," ","O"," "," "," "," "," "," "," "," "," "," "," "," ","R"," "," "," "," "," "," "," "," "," "," "," "," "," "," "," "," "," "," "," "," "," "," "," "," "," "," "," "," "," "," "," "," "," "," "," "," "," "," "," "," "," "," "]
["933","R","R","R","R","R","R","R","R","O","O","O","O","O","S","R","R","O","R","R","R","R"," "," "," ","R","R","R","R"," ","R","R"," "," "," "," "," ","R","R","O","O","O","O","O","O","O","O","O","R","R","R","R","R","R"," ","O","R","R","R","O","R"," ","R"," ","O","O","O","O"," ","O","R","O","O","O","R","R","R","R","R","R"," "," ","O"," ","R","O","R","R"," ","O","O","O","O","O","O","O"," ","O","O","O","O","R","O","R","O","O","R","R"," "," "," "," ","R"," "," "," "," "," "," "," "," "," "," "," "," "," "," "," "," "," "," "," "," "," "," "," "," "," "," "," "," "," "," "," "," "," "," "," "," "," ","O"," "," "," "," "]
["934","R","R","R","R","R","R","R","R","O","O","O","O","O","S","R","R","O"," "," "," "," ","O"," "," ","R"," "," ","O","O","O","O"," "," "," "," ","R","R"," ","O","O","O","O","O","O","O","O","O","R","R","R","R","R","R","O"," ","R","O","R","R","R"," ","O"," ","O","O","O","O"," "," ","O","O","O","O","O","O"," ","O","O"," "," "," ","O"," ","R","O"," "," "," "," "," "," "," "," ","O","O"," "," "," ","O","O"," "," ","R"," "," "," ","R"," "," "," "," ","R"," "," "," "," "," "," "," "," "," "," "," "," "," "," "," "," ","O"," "," "," "," "," "," "," "," "," "," "," "," "," "," "," "," "," "," "," "," "," "," "," "," "," "]
["939","R","R","R","R","R","R","R","R","O","O","O","O","O","S","R","R","O"," "," "," "," "," "," "," "," "," "," "," "," "," "," "," "," "," "," "," ","R"," ","O","O"," "," "," "," "," "," "," "," "," "," "," "," "," "," "," "," "," "," "," "," "," "," "," "," "," "," "," "," "," "," ","O"," "," "," "," "," "," "," "," "," "," "," "," "," "," "," "," "," "," "," "," "," "," ","R","R"," "," "," "," "," "," "," "," "," "," "," "," "," "," "," "," ","R"," "," "," "," "," "," "," "," "," "," "," "," "," "," "," "," "," "," "," "," "," "," "," "," "," "," "," "," "," "," "," "," "," "," "," "," "," "," "," "," "," "," "]
["950","R","R","R","R","R","R","R","R","R","O","O","O","O","S","R","R","O"," "," "," "," "," "," "," "," "," "," "," "," "," "," "," "," "," "," "," ","R"," ","O","O"," "," "," "," "," "," "," "," "," "," "," "," "," "," "," "," "," "," "," "," "," "," "," "," "," "," "," "," "," "," ","O"," "," "," "," "," "," "," "," "," "," "," "," "," "," "," "," "," "," "," "," "," "," "," "," "," "," "," "," "," "," "," "," "," "," "," "," "," "," "," "," ","R"," "," "," "," "," "," "," "," "," "," "," "," "," "," "," "," "," "," "," "," "," "," "," "," "," "," "," "," "," "," "," "," "," "," "," "," "," "," "," "," "," "," "]
["953","R","R","R","R","R","R","R","R","O","O","O","O","O","S","R","R","O","R","R","R","R"," "," "," ","R","R","R","R"," ","R","R"," "," "," "," "," ","R","R","O","O"," "," "," "," "," "," "," ","R","R","R","R","R","R"," "," ","R","R","R","O","R"," ","O"," "," "," ","O"," "," "," ","R","O"," ","O","R","R","R","O","R","R"," "," ","O"," ","R","R","R","O"," "," "," "," "," "," ","O"," "," ","O","O","O"," ","R"," ","R"," "," ","R","R"," "," "," "," ","R"," "," "," "," "," "," "," "," "," "," "," "," "," "," "," "," "," "," "," "," "," "," "," "," "," "," "," "," "," "," "," "," "," "," ","R","R"," ","R"," "," "," "," "]
["954","R","R","R","R","R","R","R","R","O","O","O","O","O","S","R","R","O"," "," "," "," "," "," "," ","O","O"," ","O"," ","O","R"," "," "," "," ","O","R"," ","O","O"," "," "," "," "," "," "," ","R","R","R","R","R","R","O"," ","R","R","R"," ","R"," ","O"," "," ","O"," "," "," "," ","R","O"," "," ","O","O","O","O"," "," "," "," ","O"," ","R","O"," ","O"," "," "," "," "," "," ","O","O"," "," "," ","O"," "," "," ","R"," "," "," ","O"," "," "," "," ","R"," "," "," "," "," "," "," "," "," "," "," "," "," "," "," "," "," "," "," "," "," "," "," "," "," "," "," "," "," "," "," "," "," "," ","R","R"," "," "," "," "," "," "]
["955","R","R","R","R","R","R","R","R","O","O","O","O","O","S","R","R","O","R","R","R","R"," "," "," ","R","R","R","R"," ","R","R"," "," "," "," ","R","R","R","O","O","O","O","O","O","O","O","O","R","R","R","R","R","R"," "," ","R","R","R","O","R"," ","R"," "," "," "," "," "," "," ","R","O"," ","O","R","R","R","O","R","R"," "," ","O"," ","R","R","R","R"," "," "," "," "," "," ","O","O"," ","O","O","O"," ","R"," ","R"," "," ","R","R"," "," "," "," ","R"," "," "," "," "," "," "," "," "," "," "," "," "," "," "," "," "," "," "," "," "," "," "," "," "," "," "," "," "," "," "," "," "," "," ","R","R"," ","R"," "," "," "," "]
["956","R","R","R","R","R","R","R","R","O","O","O","O","O","S","R","R","O"," "," "," "," "," "," "," "," ","O"," ","O"," ","O","O"," "," "," "," ","R","R"," ","O","O","O","O","O","O","O","O","O","R","R","R","R","R","R","O"," ","R","R","R","R","R"," ","O"," "," "," "," "," "," "," ","R","O"," "," ","O"," ","O","O"," "," "," "," ","O"," ","O"," "," ","O"," "," "," "," "," "," ","O","O"," "," "," ","O"," "," "," ","O"," "," "," ","O"," "," "," "," ","R"," "," "," "," "," "," "," "," "," "," "," "," "," "," "," "," "," "," "," "," "," "," "," "," "," "," "," "," "," "," "," "," "," "," ","R","R"," "," "," "," "," "," "]
["957","R","R","R","R","R","R","R","R","O","O","O","O","O","S","R","R","O"," "," "," "," "," "," "," "," "," "," "," "," ","O"," "," "," "," "," ","R","R"," ","O","O","O","O","O","O","O","O","O"," "," "," "," "," "," "," "," "," "," "," "," "," "," ","O"," "," "," "," "," "," "," "," ","O"," "," ","O"," "," "," "," "," "," "," "," "," "," "," "," "," "," "," "," "," "," "," "," "," "," "," "," ","O"," "," "," "," "," "," "," "," "," "," "," "," ","R"," "," "," "," "," "," "," "," "," "," "," "," "," "," "," "," "," "," "," "," "," "," "," "," "," "," "," "," "," "," "," "," "," "," "," "," "," "," "," "," "," "," "]
["966","R","R","R","R","R","R","R","R","O","O","O","O","O","S","R","R","O"," "," "," "," "," "," "," "," "," "," "," "," "," "," "," "," "," "," "," "," "," "," "," "," "," "," "," "," "," "," "," "," "," "," "," "," "," "," "," "," "," "," "," "," "," "," "," "," "," "," "," "," "," "," "," "," ","O"," "," "," "," "," "," "," "," "," "," "," "," "," "," "," "," "," "," "," "," "," "," "," "," "," "," "," "," "," "," "," "," "," "," "," "," "," "," "," "," "," "," "," "," "," "," "," "," "," "," "," "," "," "," "," "," "," "," "," "," "," "," "," "," "," "," "," "," "," "," "," "," "," "," "," "," "," "," "," "," "]
["969","R","R","R","R","R","R","R","R","O","O","O","O","O","S","R","R","O"," "," "," "," "," "," "," "," "," "," "," "," "," "," "," "," "," "," "," ","R","R","O","O"," "," "," "," "," "," "," "," "," "," "," "," "," ","R"," "," "," "," "," "," "," "," "," "," "," "," "," "," "," "," ","O"," "," "," "," ","O"," "," "," "," "," "," "," "," "," "," "," "," "," "," "," "," "," "," "," "," "," "," ","O"," "," "," "," "," "," "," "," "," "," "," "," ","R"," "," "," "," "," "," "," "," "," "," "," "," "," "," "," "," "," "," "," "," "," "," "," "," "," "," "," "," "," "," "," "," "," "," "," "," "," "," "," "," "," "," "]
["970","R","R","R","R","R","R","R","R","O","O","O","O","O","S","R","R","O"," "," "," "," "," "," "," "," "," "," "," "," "," "," "," "," "," "," "," ","R"," ","O","O"," "," "," "," "," "," "," "," "," "," "," "," "," "," "," "," "," "," "," "," "," "," "," "," "," "," "," "," "," "," ","O"," "," "," "," "," "," "," "," "," "," "," "," "," "," "," "," "," "," "," "," "," "," "," "," "," "," "," "," "," "," "," "," "," "," "," "," "," "," "," "," ","R","R","R","R","R"," "," "," "," ","R","R"," ","R","O","O","O","O"," "," "," "," "," "," ","S"," ","S"," "," "," "," "," "," "," "," "," "," "," "," "," "," "," "," "," "]
["971","R","R","R","R","R","R","R","R","O","O","O","O","O","S","R","R","O"," "," "," "," "," "," "," "," "," "," "," "," "," "," "," "," "," "," "," ","R","R","O","O"," "," "," "," "," "," "," "," "," "," "," "," "," ","R"," "," "," "," "," "," "," "," "," "," "," "," "," "," "," "," ","O"," "," "," "," ","R"," "," "," "," "," "," "," "," "," "," "," "," "," "," "," "," "," "," "," "," "," "," ","O"," "," "," "," "," "," "," "," "," "," "," "," ","R"," "," "," "," "," "," "," "," "," "," "," "," "," "," "," "," "," "," "," "," "," "," "," "," "," "," "," "," "," "," "," "," "," "," "," "," "," "," "," "," "," "," "]
["972","R","R","R","R","R","R","R","R","O","O","O","O","O","S","R","R","O"," "," "," "," "," "," "," "," "," "," "," "," "," "," "," "," "," "," "," ","R"," "," "," "," "," "," "," "," "," "," "," "," "," "," "," "," "," "," "," "," "," "," "," "," "," "," "," "," "," "," "," "," "," "," "," "," "," "," "," "," "," "," "," "," "," "," "," "," "," "," "," "," "," "," "," "," "," "," "," "," "," "," "," "," "," "," "," "," "," "," "," "," "," "," ","R"," "," "," "," "," "," "," "," ","R","R"," ","R","O","O","O","O"," "," "," "," "," "," ","S"," ","S"," "," "," "," "," "," "," "," "," "," "," "," "," "," "," "," "," "]
["973","R","R","R","R","R","R","R","R","O","O","O","O","O","S","R","R","O"," "," "," "," "," "," "," "," "," "," "," "," "," "," "," "," "," "," "," ","R"," "," "," "," "," "," "," "," "," "," "," "," "," "," "," "," "," "," "," "," "," "," "," "," "," "," "," "," "," "," "," "," "," "," "," "," "," "," "," "," "," "," "," "," "," "," "," "," "," "," "," "," "," "," "," "," "," "," "," "," "," "," "," "," "," "," "," "," "," "," "," "," "," "," ","R"," ","R","R"," "," "," "," "," ","R","R"," ","R","O","O","O","O"," "," "," "," "," "," ","S"," ","S"," "," "," "," "," "," "," "," "," "," "," "," "," "," "," "," "," "]
["975","R","R","R","R","R","R","R","R","O","O","O","O","O","S","R","R","O"," "," "," "," "," "," "," "," "," "," "," "," "," "," "," "," "," "," "," ","R"," "," "," "," "," "," "," "," "," "," ","R","R","R","R","R","R"," "," "," "," "," "," "," "," "," "," "," "," "," "," "," "," "," ","O"," "," "," "," "," "," "," "," "," "," "," "," "," "," "," "," "," "," "," "," "," "," "," "," "," "," "," "," "," "," "," "," "," "," "," "," "," "," "," "," ","R"," "," "," "," "," "," "," "," "," "," "," "," "," "," "," "," "," "," "," "," "," "," "," "," "," "," "," "," "," "," "," "," "," "," "," "," "," "," "," "," "," "," "]
["976","R","R","R","R","R","R","R","R","O","O","O","O","O","S","R","R","O"," "," "," "," "," ","O","O"," "," "," ","O"," "," "," "," "," "," "," "," ","R"," ","O","O"," "," "," "," "," "," "," "," "," "," "," "," "," "," "," "," "," "," "," "," "," "," "," "," "," "," "," "," "," "," ","O"," "," "," "," "," "," "," "," "," "," "," "," "," "," "," "," "," "," "," "," "," "," "," "," "," "," "," ","R"," "," "," "," "," "," "," "," "," "," "," "," ","R"," "," "," "," "," "," "," "," "," "," "," "," "," "," "," "," "," "," "," "," "," "," "," "," "," "," "," "," "," "," "," "," "," "," "," "," "," "," "," "," "," ","O"]
["977","R","R","R","R","R","R","R","R","O","O","O","O","O","S","R","R","O"," "," "," "," "," "," "," "," "," "," "," "," "," "," "," "," "," "," ","R","R"," ","O","O"," "," "," "," "," "," "," ","R","R","R","R","R","R"," "," "," "," "," "," "," "," "," "," "," "," "," "," "," "," "," ","O"," "," "," "," "," "," "," "," "," "," "," "," "," "," "," "," "," "," "," "," "," "," "," "," "," "," "," ","O"," "," "," "," "," "," "," "," "," "," "," "," ","R"," "," "," "," "," "," "," "," "," "," "," "," "," "," "," "," "," "," "," "," "," "," "," "," "," "," "," "," "," "," "," "," "," "," "," "," "," "," "," "," "," "," "]
["978","R","R","R","R","R","R","R","R","O","O","O","O","O","S","R","R","O"," "," "," "," "," "," "," "," "," "," "," "," "," ","O"," "," "," "," ","R","R"," ","O","O"," "," "," "," "," "," "," ","R","R","R","R","R","R"," "," "," "," "," "," "," "," "," "," "," "," "," ","O"," "," ","O","O"," "," "," "," "," "," "," "," "," "," "," "," "," "," "," "," "," "," "," "," "," "," "," "," "," "," "," ","O"," "," "," "," "," "," "," ","R"," "," "," "," ","R"," "," "," "," "," "," "," "," "," "," "," "," "," "," "," "," ","O"," "," "," "," "," "," "," "," "," "," "," "," "," "," "," "," "," "," "," "," "," "," "," "," "," "]
["979","R","R","R","R","R","R","R","R","O","O","O","O","O","S","R","R","O"," "," "," "," "," "," "," "," "," "," "," "," "," "," "," "," "," "," "," ","R"," ","O","O"," "," "," "," "," "," "," "," "," "," "," "," "," "," "," ","R","R","R"," ","R","R"," "," "," "," ","S"," "," "," "," ","O"," "," "," "," "," "," "," "," "," "," "," "," "," "," "," "," "," "," "," "," "," "," "," "," "," "," "," ","O"," "," "," "," "," "," "," "," "," "," "," "," ","R"," "," "," "," "," "," "," "," "," "," "," "," "," "," "," "," "," "," "," "," "," "," "," "," "," "," "," "," "," "," "," "," "," "," "," "," "," "," "," "," "," "," "]
["980","R","R","R","R","R","R","R","R","O","O","O","O","O","S","R","R","O"," "," "," "," "," "," "," "," "," "," "," "," "," "," "," "," "," "," "," ","R"," ","O","O"," "," "," "," "," "," "," "," "," "," "," "," "," "," "," ","R","R","R"," ","R"," "," "," "," "," ","S"," "," "," "," ","O"," "," "," "," "," "," "," "," "," "," "," "," "," "," "," "," "," "," "," "," "," "," "," "," "," "," "," ","O"," "," "," "," "," "," "," "," "," "," "," "," ","R"," "," "," "," "," "," "," "," "," "," "," "," "," "," "," "," "," "," "," "," "," "," "," "," "," "," "," "," "," "," "," "," "," "," "," "," "," "," "," "," "," "," "]
["981","R","R","R","R","R","R","R","R","O","O","O","O","O","S","R","R","O"," "," "," "," "," "," "," "," "," "," "," "," "," "," "," "," "," "," "," ","R"," ","O","O"," "," "," "," "," "," "," ","R","R","R","R","R","R"," "," ","R","R","R","R","R","O","O"," "," "," ","O"," "," "," "," ","O"," "," "," "," "," ","O"," "," "," "," "," "," "," "," "," "," "," "," "," "," "," "," "," "," "," "," "," ","O"," "," "," "," "," "," "," "," "," "," "," "," ","R"," "," "," "," "," "," "," "," "," "," "," "," "," "," "," "," "," "," "," "," "," "," "," "," "," "," "," "," "," "," "," "," "," "," "," "," "," "," "," "," "," "," "]
["982","R","R","R","R","R","R","R","R","O","O","O","O","O","S","R","R","O"," "," "," "," "," "," "," "," "," "," "," "," "," "," "," "," "," "," "," ","R"," ","O","O"," "," "," "," "," "," "," "," "," "," "," "," "," "," "," ","O"," ","O"," ","O"," ","O"," "," "," "," "," "," "," "," ","O"," "," "," "," "," "," "," "," "," "," "," "," "," "," "," "," "," "," "," "," "," "," "," "," "," "," "," "," "," "," "," "," "," "," "," "," "," "," "," "," ","R"," "," "," "," "," "," "," "," "," "," "," "," "," "," "," "," "," "," "," "," "," "," "," "," "," "," "," "," "," "," "," "," "," "," "," "," "," "," "," "," "," "," "]
["983","R","R","R","R","R","R","R","R","O","O","O","O","O","S","R","R","O"," "," "," "," "," "," "," "," "," "," "," "," "," "," "," "," "," "," "," ","R"," ","O","O"," "," "," "," "," "," "," "," "," "," "," "," "," "," "," ","R"," ","R"," ","O"," "," "," "," "," "," "," "," "," "," ","O"," "," "," "," "," "," "," "," "," "," "," "," "," "," "," "," "," "," "," "," "," "," "," "," "," "," "," "," "," "," "," "," "," "," "," "," "," "," "," "," ","R"," "," "," "," "," "," "," "," "," "," "," "," "," "," "," "," "," "," "," "," "," "," "," "," "," "," "," "," "," "," "," "," "," "," "," "," "," "," "," "," "," "," "]
["984","R","R","R","R","R","R","R","R","O","O","O","O","O","S","R","R","O"," "," "," "," "," "," "," "," "," "," "," "," "," "," "," "," "," "," "," "," "," "," "," "," "," "," "," "," "," "," "," "," "," "," "," "," "," "," "," "," "," "," "," "," "," "," "," "," "," "," "," "," "," "," "," "," "," "," "," "," "," "," "," "," "," "," "," "," "," "," "," "," "," "," "," "," "," "," "," "," "," "," "," "," "," "," "," "," "," "," "," ","O"," "," "," "," "," "," "," "," "," "," "," "," "," "," "," "," "," "," "," "," "," "," "," "," "," "," "," "," "," "," "," "," "," "," "," "," "," "," "," "," "," "," "," "," "," "]
["985","R","R","R","R","R","R","R","R","O","O","O","O","O","S","R","R","O"," "," "," "," "," "," "," "," ","O"," "," "," "," "," "," "," "," "," "," ","R"," ","O","O"," "," "," "," "," "," "," "," "," "," "," "," "," "," "," "," "," "," "," "," "," "," "," "," "," "," "," "," "," "," ","O"," "," ","O"," ","O"," "," "," "," "," ","O"," "," "," "," "," "," "," "," "," "," "," "," "," "," "," "," ","O"," "," "," "," "," "," "," ","R"," "," "," "," ","R"," "," "," "," "," "," "," "," "," "," "," "," "," "," "," "," "," "," "," "," "," "," "," "," "," "," "," "," "," "," "," "," "," "," "," "," "," "," "," "," ","O"," "]
["986","R","R","R","R","R","R","R","R","O","O","O","O","O","S","R","R","O"," "," "," "," ","O"," "," "," "," "," "," ","O"," ","O"," "," "," "," "," ","R"," ","O","O"," "," "," "," "," "," "," ","R","R","R","R","R","R","R"," ","R","R","O","O","O"," ","O","O"," "," ","O","O"," "," ","O","O","O"," "," ","O"," ","O"," "," "," "," "," "," "," ","O"," ","O"," "," "," "," ","O","O"," "," "," "," "," ","O"," "," "," "," "," "," "," "," "," "," "," "," ","R"," "," "," "," "," "," "," "," "," "," "," "," "," "," "," "," ","O","O","O","O","O","O"," "," "," "," "," "," "," "," "," "," "," "," "," "," "," "," "," "," "," "," "]
["988","R","R","R","R","R","R","R","R","O","O","O","O","O","S","R","R","O"," "," "," "," "," "," "," "," "," "," "," "," "," "," "," "," "," "," "," ","R"," ","O","O"," "," "," "," "," "," "," ","R","R","R","R","R","R","O"," "," "," "," "," "," "," "," "," "," "," "," "," ","R"," "," ","O"," "," "," "," "," "," "," "," "," "," "," "," "," ","O"," "," "," "," "," "," ","O","O"," "," "," "," "," ","O"," "," "," "," "," "," "," "," "," "," "," "," ","R"," "," "," "," "," "," "," "," "," "," "," "," "," "," "," "," "," "," "," "," "," "," "," "," "," "," "," "," "," "," "," "," "," "," "," "," "," "," "," "," "," "," "]
["989","R","R","R","R","R","R","R","R","O","O","O","O","O","S","R","R","O"," "," "," "," "," "," "," "," "," "," "," "," "," "," "," "," "," "," "," ","R"," ","O","O"," "," "," "," "," "," "," "," "," "," "," "," "," "," "," ","R","R","R"," ","R"," ","O"," "," "," ","O"," "," "," "," ","O"," "," "," "," "," "," "," "," "," "," "," "," "," "," "," "," "," "," "," "," "," "," "," "," "," "," "," ","O"," "," "," "," "," "," "," "," "," "," "," "," ","R"," "," "," "," "," "," "," "," "," "," "," "," "," "," "," "," "," "," "," "," "," "," "," "," "," "," "," "," "," "," "," "," "," "," "," "," "," "," "," "," "," "," "]
["990","R","R","R","R","R","R","R","R","O","O","O","O","O","S","R","R","O"," "," "," "," "," "," "," "," "," "," "," "," "," "," "," "," "," "," "," ","R"," "," "," "," "," "," "," "," "," "," ","R","R","R","R","R","R","R"," "," ","R"," "," "," "," ","R","R"," "," "," ","R"," "," "," ","O"," "," "," "," "," "," "," "," "," "," "," "," "," "," "," "," "," "," "," "," "," "," "," "," "," "," "," "," "," "," "," "," "," "," "," "," "," "," "," "," ","R"," "," "," "," "," "," "," "," "," "," "," "," "," "," "," "," "," "," "," "," "," "," "," "," "," "," "," "," "," "," "," "," "," "," "," "," "," "," "," "," "," "," "]
["991","R","R","R","R","R","R","R","R","O","O","O","O","O","S","R","R","O"," "," "," "," "," "," "," "," "," "," "," ","O"," ","O"," "," "," "," "," ","R"," ","O","O"," "," "," "," "," "," "," ","R","R","R","R","R","R","R"," ","R","R","O","O","O"," ","O"," "," "," ","R","R"," "," "," ","O","R"," "," "," "," "," "," "," "," "," "," "," "," ","O"," "," "," "," "," "," ","R","R"," "," "," "," "," ","O"," "," "," "," "," "," "," "," "," "," "," "," ","R"," "," "," "," "," "," "," "," "," "," "," "," "," "," "," "," ","O"," "," "," "," "," "," "," "," "," "," "," "," "," "," "," "," "," "," "," "," "," "," "," "," "," "]
["993","R","R","R","R","R","R","R","R","O","O","O","O","O","S","R","R","O"," "," "," "," "," "," "," "," "," "," "," "," "," "," "," "," "," "," "," ","R"," ","O","O"," "," "," "," "," "," "," "," "," "," "," "," "," "," "," "," "," "," "," "," "," "," "," "," "," "," "," "," "," "," ","O"," "," "," "," "," "," "," "," "," "," ","R"," "," "," "," "," "," "," "," "," "," "," "," "," "," "," "," ","O"," "," "," "," "," "," "," "," "," "," "," "," ","R"," "," "," "," "," "," "," "," "," "," "," "," "," "," "," "," "," "," "," "," "," "," "," "," "," "," "," "," "," "," "," "," "," "," "," "," "," "," "," "," ","O"," "]
["994","R","R","R","R","R","R","R","R","O","O","O","O","O","S","S","S","S"," "," "," "," "," "," "," "," "," "," "," "," "," "," "," "," "," "," "," "," "," ","O","O"," "," "," "," "," "," "," "," "," "," "," "," "," "," "," "," "," "," "," "," "," "," "," "," "," "," "," "," "," "," ","O"," "," "," "," "," "," "," "," "," "," "," "," "," "," "," "," "," "," "," "," "," "," "," "," "," "," "," ","O"," "," "," "," "," "," "," "," "," "," "," "," ","R","O"," "," ","O","O","O","O","O"," "," ","O"," "," "," "," "," "," "," "," "," "," "," "," "," ","S"," "," "," "," "," "," "," "," "," "," "," "," "," "," "," "," "," "]
["998","R","R","R","R","R","R","R"," "," "," "," "," "," ","S","R","R","O"," "," "," "," "," "," "," "," "," "," "," "," "," "," "," "," "," "," "," ","R"," "," "," "," "," "," "," "," "," "," "," "," "," "," "," "," "," "," "," "," "," "," "," "," "," "," "," "," "," "," "," "," "," "," "," "," "," "," "," "," "," "," "," "," "," "," "," "," "," "," "," "," "," "," "," "," "," "," "," "," "," ","O"," "," "," "," "," "," "," "," "," "," "," "," ","R"," "," "," "," "," "," "," "," "," "," "," "," "," "," "," "," "," "," "," "," "," "," "," "," "," "," "," "," "," "," "," "," "," "," "," "," "," "," "," "," "," "," "]
["999","R","R","R","R","R","R","R","R","O","O","O","O","O","S","R","R","O"," "," ","O"," "," "," "," "," "," ","O"," ","O"," "," "," "," "," "," "," "," "," ","O","O","O","O","O","O","O","O","O"," "," "," "," "," "," "," ","O"," "," "," "," "," "," "," ","O","O","O","O","O"," "," ","O"," ","O","O","O","O","R"," ","O"," "," "," "," "," "," ","O","O","O"," ","O","O"," "," "," ","O","O","O","O","O","O","O","O","O"," ","O","O"," "," "," "," "," "," "," "," "," "," "," "," "," "," "," "," "," "," "," "," "," "," "," "," "," "," "," "," "," "," "," "," "," "," "," "," "," "," "," "," "," "," "," "," "," "," "," "," "," "]

{"sheet":"FEGLI Codes","index":8,"n_rows":76,"n_cols":2,"rows_kept":76,"cut":false,"hidden":false,"merged":[]}
["FEGLI CODE","DESCRIPTION"]
[90,"Basic+B(3x)"]
["A0","Ineligible"]
["A1","FEGLI Cov Ended-12 Months NonP"]
["B0","Waived"]
["C0","Basic only"]
["D0","Basic+A"]
["E1","Basic+C(1x)"]
["E2","Basic+C(2x)"]
["E3","Basic+C(3x)"]
["E4","Basic+C(4x)"]
["E5","Basic+C(5x)"]
["F1","Basic+A+C(1x)"]
["F2","Basic+A+C(2x)"]
["F3","Basic+A+C(3x)"]
["F4","Basic+A+C(4x)"]
["F5","Basic+A+C(5x)"]
["G0","Basic+B(1x)"]
["H0","Basic+B(1x)+A"]
["I1","Basic+B(1x)+C(1x)"]
["I2","Basic+B(1x)+C(2x)"]
["I3","Basic+B(1x)+C(3x)"]
["I4","Basic+B(1x)+C(4x)"]
["I5","Basic+B(1x)+C(5x)"]
["J1","Basic+B(1x)+A+C(1x)"]
["J2","Basic+B(1x)+A+C(2x)"]
["J3","Basic+B(1x)+A+C(3x)"]
["J4","Basic+B(1x)+A+C(4x)"]
["J5","Basic+B(1x)+A+C(5x)"]
["K0","Basic+B(2x)"]
["L0","Basic+B(2x)+A"]
["M1","Basic+B(2x)+C(1x)"]
["M2","Basic+B(2x)+C(2x)"]
["M3","Basic+B(2x)+C(3x)"]
["M4","Basic+B(2x)+C(4x)"]
["M5","Basic+B(2x)+C(5x)"]
["N1","Basic+B(2x)+A+C(1x)"]
["N2","Basic+B(2x)+A+C(2x)"]
["N3","Basic+B(2x)+A+C(3x)"]
["N4","Basic+B(2x)+A+C(4x)"]
["N5","Basic+B(2x)+A+C(5x)"]
["P0","Basic+B(3x)+A"]
["Q1","Basic+B(3x)+C(1x)"]
["Q2","Basic+B(3x)+C(2x)"]
["Q3","Basic+B(3x)+C(3x)"]
["Q4","Basic+B(3x)+C(4x)"]
["Q5","Basic+B(3x)+C(5x)"]
["R1","Basic+B(3x)+A+C(1x)"]
["R2","Basic+B(3x)+A+C(2x)"]
["R3","Basic+B(3x)+A+C(3x)"]
["R4","Basic+B(3x)+A+C(4x)"]
["R5","Basic+B(3x)+A+C(5x)"]
["S0","Basic+B(4x)"]
["T0","Basic+B(4x)+A"]
["U1","Basic+B(4x)+C(1x)"]
["U2","Basic+B(4x)+C(2x)"]
["U3","Basic+B(4x)+C(3x)"]
["U4","Basic+B(4x)+C(4x)"]
["U5","Basic+B(4x)+C(5x)"]
["V1","Basic+B(4x)+A+C(1x)"]
["V2","Basic+B(4x)+A+C(2x)"]
["V3","Basic+B(4x)+A+C(3x)"]
["V4","Basic+B(4x)+A+C(4x)"]
["V5","Basic+B(4x)+A+C(5x)"]
["W0","Basic+B(5x)"]
["X0","Basic+B(5x)+A"]
["Y1","Basic+B(5x)+C(1x)"]
["Y2","Basic+B(5x)+C(2x)"]
["Y3","Basic+B(5x)+C(3x)"]
["Y4","Basic+B(5x)+C(4x)"]
["Y5","Basic+B(5x)+C(5x)"]
["Z1","Basic+B(5x)+A+C(1x)"]
["Z2","Basic+B(5x)+A+C(2x)"]
["Z3","Basic+B(5x)+A+C(3x)"]
["Z4","Basic+B(5x)+A+C(4x)"]
["Z5","Basic+B(5x)+A+C(5x)"]

{"sheet":"Special Employment Program","index":9,"n_rows":97,"n_cols":2,"rows_kept":97,"cut":false,"hidden":false,"merged":[]}
["SPECIAL EMPLOYMENT PROGRAM CODE","DESCRIPTION"]
["00","Not Applicable"]
["01","Part-Time BLS Fld Econ Asst"]
["02","Chemical Engineering"]
["03","Electrical Engineering"]
["04","General Engineering"]
["05","General Chemistry"]
["06","Electronics"]
["07","Mechanical Engineering"]
["08","Organic Engineering"]
["09","Physics"]
[10,"Civil Engineering"]
[11,"Metallurgical Engineering"]
[12,"IPA Ceiling Exempt"]
[26,"Biomedical Engineering"]
[40,"Mixed Tour"]
[41,"Sch A 213.3102 (LL)"]
[42,"Sch A, 5 CFR 213.3102 (T)"]
[43,"Sch A, 5 CFR 213.3102 (U)"]
[44,"700 HR, 5 CFR 316.402 (A)"]
[45,"Temp, 5 CFR 316.402 (B)(5)"]
[46,"Sch B, 5 CFR 213.3202 (K)"]
[47,"Summer Intern Pgm - College"]
[48,"National Scholars Program"]
[54,"Student Temp Empl (STEP)"]
[55,"Summer Aid"]
[56,"Federal Summer Intern"]
[57,"Federal Junior Fellowship"]
[58,"Work Release Program"]
[59,"Veteran's Readjustment Pgm"]
[60,"Appnt-Vet Under 5 USC 3112"]
[61,"Viet Nam Era Veteran"]
[62,"Empl Coop Education Pgm"]
[63,"Worker Trainee"]
[64,"Trainee..at higer grade level"]
[65,"GAO EMPLOYEE INELIG FOR LOCALI"]
[66,"Reemployed Annuitant"]
[67,"Special Handicap"]
[69,"Presidential Mgt Intern"]
[70,"Worker Trainee in Develop"]
[73,"Coop Ed Pgm-High School"]
[74,"Coop Ed Pgm-Assoc Degree"]
[75,"Students"]
[76,"Upward Mobility Same Series"]
[77,"Upward Mobility Diff Series"]
[78,"Summer Employment Pgm"]
[80,"SES Candidate Development"]
[90,"Lng Term Trng over 120 Days"]
[91,"Secrataries and Depart Head"]
[99,"IPA-Out 50% or More Reimbur"]
["9A","Special Gov Employee"]
["9B","Displaced Employee"]
["9C","Vocational Office"]
["9D","Worker Trainee Opp Pgm"]
["9E","Workr Trainee Opportunities"]
["9N","Student Trainee"]
["9R","Graduate Students"]
["9V","20/20 Work Study"]
["C1","Coop-Assoc Degree Pgm-Sch A"]
["C2","Coop-High School Prgm-Sch A"]
["C3","Coop-Baccalaureate-Sch B"]
["C4","Coop-Graduate Masters-Sch B"]
["C5","Coop-Assoc Degree Pgm-Sch B"]
["C6","Coop-Graduate PHD-Sch B"]
["C7","Coop-Graduate Other-Sch B"]
["C8","Coop-High School Prgm-Sch B"]
["C9","Coop-Votech-Sch B"]
["D1","Upward Mobility Program"]
["D2","Detail-Non-Reimbursable"]
["D3","Detail-Reimbursable"]
["D4","Detail-To International Org"]
["D5","Dist Dir Candidate Dev Pgm"]
["E1","FEMA-2 Year Core"]
["E2","FEMA-2 Year Katrina Core"]
["E3","FEMA-4 Year Core"]
["E4","FEMA-PFT Budget Allocated"]
["E5","FEMA-Disaster Area Employee"]
["G1","Attorney"]
["G2","Law Clerk"]
["G3","Expert/Consultant"]
["G4","Accounting Fellow"]
["G5","Outstanding Scholar"]
["GS","Survivor of Retired CG"]
["IP","Intern Program"]
["MC","Marshals Service Contractor"]
["MS","Mil Spouse Special Tax Proc"]
["NR","NAFI Retirement Coverage"]
["OH","Atty Hired AG's Honor Recrt"]
["OU","Atty Hired as Spec Asst"]
["P1","Student-Sec. 213.3102 (P)"]
["PD","Worker Trainee Pgm"]
["PP","Part Time Professional"]
["Q1","Student-Sec. 213.3102 (Q)"]
["SH","Summer Hires"]
["TA","TSA Executive Resource Service"]
["TP","US Secret Serv Uniformed Dv"]
["ZZ","Unique Tax Processing"]

{"sheet":"Config","index":10,"n_rows":51,"n_cols":10,"rows_kept":51,"cut":false,"hidden":true,"merged":[]}
["AG - Production COPY","empusda.copy.nfc.usda.gov","https",443,"EMPLOYEE","hr","hrms","ENG",10,10]
["AG - Production","usda.empowhr.gov","https",443,"EMPLOYEE","hr","hrms","ENG",10,10]
["DHS - Production COPY","empdhs.copy.nfc.usda.gov","https",443,"EMPLOYEE","hr","hrms","ENG",10,10]
["DHS - Production","dhs.empowhr.gov","https",443,"EMPLOYEE","hr","hrms","ENG",10,10]
["DOJ - Production COPY","empdoj.copy.nfc.usda.gov","https",443,"EMPLOYEE","hr","hrms","ENG",10,10]
["DOJ - Production  ","doj.empowhr.gov","https",443,"EMPLOYEE","hr","hrms","ENG",10,10]
["OFA - Production COPY","empofa.copy.nfc.usda.gov","https",443,"EMPLOYEE","hr","hrms","ENG",10,10]
["OFA - Production","ofa.empowhr.gov","https",443,"EMPLOYEE","hr","hrms","ENG",10,10]
["USDAUAT","empusda.cuat.nfc.usda.gov","https",443,"EMPLOYEE","hr","hrms","ENG",10,10]
["DHSUAT","empdhs.cuat.nfc.usda.gov","https",443,"EMPLOYEE","hr","hrms","ENG",10,10]
["DOJUAT","empdoj.cuat.nfc.usda.gov","https",443,"EMPLOYEE","hr","hrms","ENG",10,10]
["OFAUAT","empofa.cuat.nfc.usda.gov","https",443,"EMPLOYEE","hr","hrms","ENG",10,10]
["USDAQA","empusda.qa.nfc.usda.gov","https",443,"EMPLOYEE","hr","hrms","ENG",10,10]
["DHSQA","empdhs.qa.nfc.usda.gov","https",443,"EMPLOYEE","hr","hrms","ENG",10,10]
["DOJQA","empdoj.qa.nfc.usda.gov","https",443,"EMPLOYEE","hr","hrms","ENG",10,10]
["OFAQA","empofa.qa.nfc.usda.gov","https",443,"EMPLOYEE","hr","hrms","ENG",10,10]
["USDATEST","empusda.test.nfc.usda.gov","https",443,"EMPLOYEE","hr","hrms","ENG",10,10]
["DHSTEST","empdhs.test.nfc.usda.gov","https",443,"EMPLOYEE","hr","hrms","ENG",10,10]
["DOJTEST","empdoj.test.nfc.usda.gov","https",443,"EMPLOYEE","hr","hrms","ENG",10,10]
["OFATEST","empofa.test.nfc.usda.gov","https",443,"EMPLOYEE","hr","hrms","ENG",10,10]
["Training","train.empowhr.gov","https",443,"EMPLOYEE","hr","hrms","ENG",10,10]
["Development","empowhr.dev.nfc.usda.gov","https",443,"EMPLOYEE","hr","hrms","ENG",10,10]
[]
["CREATE","Remarks","NOA","DESCR",null,null,"Check Mail Address Translate Values"]
[null,0,280,"PLACEMENT IN PAY STATUS",null,null,1,"Personnel Office Identifier"]
[null,1,302,"RETIREMENT-VOLUNTARY",null,null,2,"Check Mail Address"]
[null,2,317,"RESIGNATION",null,null,3,"Specified Address"]
[null,3,355,"TERMINATION-EXP OF APPT"]
[null,4,357,"TERMINATION"]
[null,5,385,"TERM DURING PROB/TRIAL PERIOD"]
[null,6,430,"PLACEMENT IN NON-PAY STATUS"]
[null,7,450,"SUSPENSION-NTE"]
[null,8,460,"LWOP-NTE"]
[null,9,471,"FURLOUGH"]
[null,10,472,"FURLOUGH NTE"]
[null,null,473,"ABSENT-UNIFORMED SERVICE"]
[null,null,760,"EXTENSION OF APPT NTE"]
[null,null,765,"EXTENSION OF TERM APPT NTE"]
[null,null,773,"EXT OF LWOP NTE"]
[null,null,780,"NAME CHANGE (SEE REMARK)"]
[null,null,781,"CHANGE IN WORK SCHEDULE"]
[null,null,782,"CHANGE IN HOURS"]
[null,null,790,"REALIGNMENT"]
[null,null,792,"CHANGE IN DUTY STATION"]
[null,null,800,"CHANGE IN DATA ELEMENT"]
[null,null,883,"CHG IN VET PREF-RIF"]
[null,null,892,"IRREGULAR PERFORMANCE PAY"]
[null,null,894,"GEN ADJ"]
[null,null,903,"CHANGE IN NON CPDF DATA ELEMENT"]
[null,null,908,"TERMINATION"]
[null,null,939,"CHG QTRS DEDUCTIONS"]