{"text_format":"1","workbook":"xlsx","n_sheets":8,"sheets":["Coversheet","Connect Information","Template","Data Input","Staging & Submission","Errors","Remark Codes-Descriptions","Config"],"not_rendered":{"charts":0,"images":3,"macros":1,"external_links":0,"defined_names":64,"comments":4,"pivot_tables":0},"unopened":[],"bounds":{"document_bytes":16777216,"sheet_cells":100000,"rows_first":2000,"rows_last":500,"rows_between":2000,"halvings":0,"cell_chars":16384,"cell_head_chars":4096},"cells_cut":0,"cells_raw":0,"read":"row_number_cap","date_system":"1900"}

{"sheet":"Coversheet","index":0,"n_rows":18,"n_cols":3,"rows_kept":18,"cut":false,"hidden":false,"merged":[]}
[]
[null,null,"Excel To CI Utility"]
[null,null,"The purpose of this workbook is to upload data from Excel into PeopleSoft using the Component Interface to execute business logic for each transaction. This source workbook contains both worksheets and Excel VBA code modules.  The Worksheets can be copied to other workbooks for distribution without copying the code modules."]
[]
[null,"Process:"]
[null,"1)","Connection Information sheet: The information provided on this sheet is required to create a new template or submit data to the database. You will need to specify environment information as well as information in regard to how each transaction should be handled. The Action will be filled in automatically. By default, character fields which are left blank or only contain blanks will not be submitted for update. There is an option to override this setting."]
[]
[null,"2)","Template sheet: Here you create the template that you are going to use. The template is based upon the structure of a Component Interface on the PeopleSoft database."]
[null,null,"2.1. New Template: When prompted, enter the name of your PeopleSoft User ID, password, and the Component Interface you wish to use. The connect information previously provided is used to retrieve the PeopleSoft Component Interface properties. The Component Interface structure is displayed graphically."]
[null,null,"2.2. Manipulate Template: Here input cells are selected for inclusion on the Data Input and Staging & Submisson sheets.  The purpose of each button provided to allow manipulation of the template is more fully described by mousing over the button on the toolbar."]
[null,null,"2.3. New Data Input: This button copies the selected input cells into the Data Input sheet. The Data Input sheet becomes active, and you will be prompted before the structures and data on that sheet are deleted."]
[]
[null,"3)","Data Input sheet: Here you enter data values for submission to the PeopleSoft database."]
[null,null,"3.1. Stage Data for Submission: The data entered on the Data Input sheet is then staged in hierarchical form in preparation for submission to the database."]
[]
[null,"4)","Staging & Submission sheet: The last step is to format the data and submit to the database."]
[null,null,"4.1. Submit Data: This submits the data to the database.  Your PeopleSoft User ID and Password will be required. Each row submitted is marked with the reply from the database which will either be OK, Warning, or Error."]
[null,null,"4.2. Post Results: This posts the status for each row submitted to the database on the Data Input sheet so that data in a status of error can be corrected and resubmitted."]

{"sheet":"Connect Information","index":1,"n_rows":23,"n_cols":8,"rows_kept":23,"cut":false,"hidden":false,"merged":[],"read":"row_number_cap"}
[]
[]
[]
[]
[null,"Environment:","AG - Production COPY"]
[null,"Web Server Machine Name:",{"$f":"IF(ISNA(VLOOKUP(C5 & \"\",Config!A1:B21,2,FALSE)),\"\", VLOOKUP(C5 & \"\",Z_ConnectTable,2,FALSE))","v":"empusda.copy.nfc.usda.gov"},null,"Optional Keys:"]
[null,"Protocol:",{"$f":"IF(ISNA(VLOOKUP(C5 & \"\",Z_ConnectTable,3,FALSE)),\"\", VLOOKUP(C5 & \"\",Z_ConnectTable,3,FALSE))","v":"https"}]
[null,"HTTP Port:",{"$f":"IF(ISNA(VLOOKUP(C5 & \"\",Z_ConnectTable,4,FALSE)),\"\", VLOOKUP(C5 & \"\",Z_ConnectTable,4,FALSE))","v":443}]
[null,"Portal:",{"$f":"IF(ISNA(VLOOKUP(C5 & \"\",Z_ConnectTable,5,FALSE)),\"\", VLOOKUP(C5 & \"\",Z_ConnectTable,5,FALSE))","v":"EMPLOYEE"}]
[null,"PeopleSoft Site Name:",{"$f":"IF(ISNA(VLOOKUP(C5 & \"\",Z_ConnectTable,6,FALSE)),\"\", VLOOKUP(C5 & \"\",Z_ConnectTable,6,FALSE))","v":"hr"}]
[null,"Node:",{"$f":"IF(ISNA(VLOOKUP(C5 & \"\",Z_ConnectTable,7,FALSE)),\"\", VLOOKUP(C5 & \"\",Z_ConnectTable,7,FALSE))","v":"PT_LOCAL"},null,"NOA:",840,null,{"$f":"VLOOKUP(F11,Config!$C$20:$D$29,2,FALSE)","v":"INDIVIDUAL CASH AWARD RB"}]
[null,"Language Code:",{"$f":"IF(ISNA(VLOOKUP(C5 & \"\",Z_ConnectTable,8,FALSE)),\"\", VLOOKUP(C5 & \"\",Z_ConnectTable,8,FALSE))","v":"ENG"}]
[null,"Number of Remarks:",2]
[null,"Chunking Factor:","40"]
[null,"Error Threshold:","1"]
[null,"Submit Blanks as Input:"]
[null,"Action:","CREATE"]
[null,"Action:"]
[null,"Submit Options"]
[]
[null,"Allow Blanks:"," "]
[null,"Z_AWD_MASSLOAD_CI"]
[null,"Submit Options"]

{"sheet":"Template","index":2,"n_rows":14,"n_cols":59,"rows_kept":14,"cut":false,"hidden":false,"merged":[]}
[]
["Z_AWD_MASSLOAD_CI"]
[]
[null,null,"Collection","Z_AWD_MASSLOAD_CI","Z_AWD_MASSLOAD_CI","Z_AWD_MASSLOAD_CI","Z_AWD_MASSLOAD_CI","Z_AWD_MASSLOAD_CI","Z_AWD_MASSLOAD_CI","Z_AWD_MASSLOAD_CI","Z_AWD_MASSLOAD_CI","Z_AWD_MASSLOAD_CI","Z_AWD_MASSLOAD_CI","Z_AWD_MASSLOAD_CI","Z_AWD_MASSLOAD_CI","Z_AWD_MASSLOAD_CI","Z_AWD_MASSLOAD_CI","Z_AWD_MASSLOAD_CI","Z_AWD_MASSLOAD_CI","Z_AWD_MASSLOAD_CI","Z_AWD_MASSLOAD_CI","Z_AWD_MASSLOAD_CI","Z_AWD_MASSLOAD_CI","Z_AWD_MASSLOAD_CI","Z_AWD_MASSLOAD_CI","Z_AWD_MASSLOAD_CI","Z_AWD_MASSLOAD_CI","Z_AWD_MASSLOAD_CI","Z_AWD_MASSLOAD_CI","Z_AWD_MASSLOAD_CI","Z_AWD_MASSLOAD_CI","Z_AWD_MASSLOAD_CI","Z_AWD_MASSLOAD_CI","Z_AWD_MASSLOAD_CI","Z_AWD_MASSLOAD_CI","Z_AWD_MASSLOAD_CI","Z_AWD_MASSLOAD_CI","Z_AWD_MASSLOAD_CI","Z_AWD_MASSLOAD_CI","Z_AWD_MASSLOAD_CI","Z_AWD_MASSLOAD_CI","Z_AWD_MASSLOAD_CI","Z_AWD_MASSLOAD_CI","Z_AWD_MASSLOAD_CI","Z_AWD_MASSLOAD_CI","Z_AWD_MASSLOAD_CI","Z_AWD_MASSLOAD_CI","Z_AWD_MASSLOAD_CI","Z_IMP_AWD_RMKS","Z_IMP_AWD_RMKS","Z_IMP_AWD_RMKS","Z_IMP_AWD_RMKS","Z_IMP_AWD_RMKS","Z_IMP_AWD_RMKS","Z_IMP_AWD_RMKS","Z_IMP_AWD_RMKS","Z_IMP_AWD_RMKS","Z_IMP_AWD_RMKS","Z_IMP_AWD_RMKS"]
[null,null,"Property","RUN_DTTM","PROCESSNAME","COMPANY","NATIONAL_ID","GVT_SUB_AGENCY","GVT_NOA_CODE","GVT_POI","Z_EFFDT_C","Z_ACTION_DT_C","GVT_STATUS_TYPE","Z_DOC_TYPE","EMPLID","OPRID","GVT_SUGGESTION_NBR","Z_STORED_ACCTG_CD","Z_CASH_AWARD_CD","Z_AWARD_FROM_DT_C","Z_AWARD_TO_DT_C","GVT_TANG_BEN_AMT","Z_AWD_FIRST_YR_SAV","GVT_INTANG_BEN_AMT","Z_AWARD_PAY_CD","GOAL_AMT","Z_AWARD_GROUP","Z_ACCTG_DISTRIB","Z_AWD_AGNCY_CHRGD","Z_AWD_ACCT_STA_CHG","GVT_LEG_AUTH_1","GVT_LEG_AUTH_2","Z_CK_MAIL_ADDR_IND","ADDRESS1_OTHER","ADDRESS2_OTHER","Z_GVT_LEGAUTH1_1ST","Z_GVT_LEGAUTH2_1ST","CITY_OTHER","STATE_OTHER","GVT_PAR_AUTH_D1","GVT_PAR_AUTH_D2","POSTAL_OTHER","COMMENTS","ACTION","ACTION_REASON","Z_TANG_INTANG_BEN","GVT_CONT_EMPLID","Z_LC_RECOMMENDER","GVT_SF50_REMARK","GVT_INSERT_REQD","GVT_REMARK_LINE1","GVT_REMARK_LINE2","GVT_REMARK_LINE3","GVT_REMARK_LINE4","GVT_REMARK_LINE5","GVT_REMARK_LINE6","GVT_REMARK_LINE7","GVT_REMARK_LINE8","GVT_REMARK_LINE9"]
[null,null,"Record Type","0-0-0","0-0-0","0-0-0","0-0-0","0-0-0","0-0-0","0-0-0","0-0-0","0-0-0","0-0-0","0-0-0","0-0-0","0-0-0","0-0-0","0-0-0","0-0-0","0-0-0","0-0-0","0-0-0","0-0-0","0-0-0","0-0-0","0-0-0","0-0-0","0-0-0","0-0-0","0-0-0","0-0-0","0-0-0","0-0-0","0-0-0","0-0-0","0-0-0","0-0-0","0-0-0","0-0-0","0-0-0","0-0-0","0-0-0","0-0-0","0-0-0","0-0-0","0-0-0","0-0-0","0-0-0","1-0-0","1-0-0","1-0-0","1-0-0","1-0-0","1-0-0","1-0-0","1-0-0","1-0-0","1-0-0","1-0-0"]
[null,null,"Field Type","DATETIME","CHARACTER","CHARACTER","CHARACTER","CHARACTER","CHARACTER","CHARACTER","CHARACTER","CHARACTER","CHARACTER","CHARACTER","CHARACTER","CHARACTER","CHARACTER","CHARACTER","CHARACTER","CHARACTER","CHARACTER","NUMBER","NUMBER","NUMBER","CHARACTER","SIGNED_NUMBER","NUMBER","CHARACTER","CHARACTER","CHARACTER","CHARACTER","CHARACTER","CHARACTER","CHARACTER","CHARACTER","CHARACTER","CHARACTER","CHARACTER","CHARACTER","CHARACTER","CHARACTER","CHARACTER","LONG_CHARACTER","CHARACTER","CHARACTER","CHARACTER","CHARACTER","CHARACTER","CHARACTER","CHARACTER","CHARACTER","CHARACTER","CHARACTER","CHARACTER","CHARACTER","CHARACTER","CHARACTER","CHARACTER","CHARACTER"]
[null,null,"Field Length","26","12","3","20","2","3","4","8","8","3","4","11","30","10","1","4","8","8","8","8.2","8","1","8.2","3","27","2","4","3","3","1","55","55","3","3","30","6","25","25","12","0","3","3","1","11","11","3","1","72","72","72","72","72","72","72","72","72"]
[null,null,"Key / Required","Y/ ","Y/ ","Y/ ","Y/ ","Y/ ","Y/ ","Y/ ","Y/ ","Y/ "," / "," / "," / "," / "," / "," / "," / "," / "," / "," / "," / "," / "," / "," / "," / "," / "," / "," / "," / "," / "," / "," / "," / "," / "," / "," / "," / "," / "," / "," / "," / "," / "," / "," / "," / "," / ","Y/ "," / "," / "," / "," / "," / "," / "," / "," / "," / "," / "]
[null,null,"Sequence","1","2","3","4","5","6","7","8","9","10","11","12","13","14","15","16","17","18","19","20","21","22","23","24","25","26","27","28","29","30","31","32","33","34","35","36","37","38","39","40","41","42","43","44","45","46","47","48","49","50","51","52","53","54","55","56"]
["Status","Line No","Record Type","Run Date and Time","Process Name","Agency","*Social Security Number","Sub-Agency","Nature of Action Code","Personnel Office ID","*Effective Date","*Auth Date","Status Type","Document Type","*EmplID","User ID","*Case Number","Use Stored Accounting","*Award Code","Award From Date","Award To Date","Tangible Benefit","First Year Savings","Intangible Benefit","*Pay Code","*Amount / Hours","*Number of Persons","Accounting Distribution","Sub-Agency Charged","Accounting Station Charged","*Legal Authority (1)","Legal Authority (2)","Address Indicator","Address Line 1","Address Line 2","Legal Authority (1) 1st NOA","Legal Authority (2) 1st NOA","City - Other","State - Other","Authority 1 Descr - Part 1","Authority 2 Descr - Part 1","Postal Code - Other","*Justification","Action","*Reason Code","Tangible / Intangible Benefit","Contact Emplid","Recommending Official","SF50 Remark Code","Insertion Required","Remark Line 1","Remark Line 2","Remark Line 3","Remark Line 4","Remark Line 5","Remark Line 6","Remark Line 7","Remark Line 8","Remark Line 9"]
["Template",null,"0-0-0","","CIIMP","","","",820,"","","","COM","110","","","","Y","","","","0","","0","","",1,"","","","","","2","","","","","","","","","","","AWD","","N","",""]
["Template",null,"1-0-0",null,null,null,null,null,null,null,null,null,null,null,null,null,null,null,null,null,null,null,null,null,null,null,null,null,null,null,null,null,null,null,null,null,null,null,null,null,null,null,null,null,null,null,null,null,"","","","","","","","","","",""]
["Template",null,"1-0-0",null,null,null,null,null,null,null,null,null,null,null,null,null,null,null,null,null,null,null,null,null,null,null,null,null,null,null,null,null,null,null,null,null,null,null,null,null,null,null,null,null,null,null,null,null,"","","","","","","","","","",""]

{"sheet":"Data Input","index":3,"n_rows":5,"n_cols":39,"rows_kept":5,"cut":false,"hidden":false,"merged":[]}
[]
["Z_AWD_MASSLOAD_CI"]
["Record Type 0-0-0","Record Type 0-0-0","Record Type 0-0-0","Record Type 0-0-0","Record Type 0-0-0","Record Type 0-0-0","Record Type 0-0-0","Record Type 0-0-0","Record Type 0-0-0","Record Type 0-0-0","Record Type 0-0-0","Record Type 0-0-0","Record Type 0-0-0","Record Type 0-0-0","Record Type 0-0-0","Record Type 0-0-0","Record Type 0-0-0","Record Type 0-0-0","Record Type 0-0-0","Record Type 1-0-0","Record Type 1-0-0","Record Type 1-0-0","Record Type 1-0-0","Record Type 1-0-0","Record Type 1-0-0","Record Type 1-0-0","Record Type 1-0-0","Record Type 1-0-0","Record Type 1-0-0","Record Type 1-0-0","Record Type 1-0-0","Record Type 1-0-0","Record Type 1-0-0","Record Type 1-0-0","Record Type 1-0-0","Record Type 1-0-0","Record Type 1-0-0","Record Type 1-0-0","Record Type 1-0-0"]
["Sub-Agency","*Effective Date","*Auth Date","*EmplID","*Case Number","*Award Code","Award From Date","Award To Date","*Pay Code","*Amount / Hours","Accounting Distribution","Sub-Agency Charged","Accounting Station Charged","*Legal Authority (1)","Legal Authority (2)","Authority 1 Descr - Part 1","Authority 2 Descr - Part 1","*Justification","*Reason Code","SF50 Remark Code","Remark Line 1","Remark Line 2","Remark Line 3","Remark Line 4","Remark Line 5","Remark Line 6","Remark Line 7","Remark Line 8","Remark Line 9","SF50 Remark Code","Remark Line 1","Remark Line 2","Remark Line 3","Remark Line 4","Remark Line 5","Remark Line 6","Remark Line 7","Remark Line 8","Remark Line 9"]
["II","06162024","06162024","999999","2024CTMS","C090","01012024","04302024","0",16000,null,null,null,"VPD",null,null,null,"GOOD WORK","090","YT8",null,null,null,null,null,null,null,null,null,"YT9"]

{"sheet":"Staging & Submission","index":4,"n_rows":14,"n_cols":43,"rows_kept":14,"cut":false,"hidden":false,"merged":[]}
[]
["Z_AWD_MASSLOAD_CI"]
[null,null,null,"Z_AWD_MASSLOAD_CI","Z_AWD_MASSLOAD_CI","Z_AWD_MASSLOAD_CI","Z_AWD_MASSLOAD_CI","Z_AWD_MASSLOAD_CI","Z_AWD_MASSLOAD_CI","Z_AWD_MASSLOAD_CI","Z_AWD_MASSLOAD_CI","Z_AWD_MASSLOAD_CI","Z_AWD_MASSLOAD_CI","Z_AWD_MASSLOAD_CI","Z_AWD_MASSLOAD_CI","Z_AWD_MASSLOAD_CI","Z_AWD_MASSLOAD_CI","Z_AWD_MASSLOAD_CI","Z_AWD_MASSLOAD_CI","Z_AWD_MASSLOAD_CI","Z_AWD_MASSLOAD_CI","Z_AWD_MASSLOAD_CI","Z_AWD_MASSLOAD_CI","Z_AWD_MASSLOAD_CI","Z_AWD_MASSLOAD_CI","Z_AWD_MASSLOAD_CI","Z_AWD_MASSLOAD_CI","Z_AWD_MASSLOAD_CI","Z_AWD_MASSLOAD_CI","Z_AWD_MASSLOAD_CI","Z_AWD_MASSLOAD_CI","Z_AWD_MASSLOAD_CI","Z_AWD_MASSLOAD_CI","Z_IMP_AWD_RMKS","Z_IMP_AWD_RMKS","Z_IMP_AWD_RMKS","Z_IMP_AWD_RMKS","Z_IMP_AWD_RMKS","Z_IMP_AWD_RMKS","Z_IMP_AWD_RMKS","Z_IMP_AWD_RMKS","Z_IMP_AWD_RMKS","Z_IMP_AWD_RMKS"]
[null,null,null,"PROCESSNAME","GVT_SUB_AGENCY","GVT_NOA_CODE","Z_EFFDT_C","Z_ACTION_DT_C","GVT_STATUS_TYPE","Z_DOC_TYPE","EMPLID","GVT_SUGGESTION_NBR","Z_STORED_ACCTG_CD","Z_CASH_AWARD_CD","Z_AWARD_FROM_DT_C","Z_AWARD_TO_DT_C","GVT_TANG_BEN_AMT","GVT_INTANG_BEN_AMT","Z_AWARD_PAY_CD","GOAL_AMT","Z_AWARD_GROUP","Z_ACCTG_DISTRIB","Z_AWD_AGNCY_CHRGD","Z_AWD_ACCT_STA_CHG","GVT_LEG_AUTH_1","GVT_LEG_AUTH_2","Z_CK_MAIL_ADDR_IND","GVT_PAR_AUTH_D1","GVT_PAR_AUTH_D2","COMMENTS","ACTION","ACTION_REASON","Z_TANG_INTANG_BEN","GVT_SF50_REMARK","GVT_REMARK_LINE1","GVT_REMARK_LINE2","GVT_REMARK_LINE3","GVT_REMARK_LINE4","GVT_REMARK_LINE5","GVT_REMARK_LINE6","GVT_REMARK_LINE7","GVT_REMARK_LINE8","GVT_REMARK_LINE9"]
[null,null,null,"0-0-0","0-0-0","0-0-0","0-0-0","0-0-0","0-0-0","0-0-0","0-0-0","0-0-0","0-0-0","0-0-0","0-0-0","0-0-0","0-0-0","0-0-0","0-0-0","0-0-0","0-0-0","0-0-0","0-0-0","0-0-0","0-0-0","0-0-0","0-0-0","0-0-0","0-0-0","0-0-0","0-0-0","0-0-0","0-0-0","1-0-0","1-0-0","1-0-0","1-0-0","1-0-0","1-0-0","1-0-0","1-0-0","1-0-0","1-0-0"]
[null,null,null,"CHARACTER","CHARACTER","CHARACTER","CHARACTER","CHARACTER","CHARACTER","CHARACTER","CHARACTER","CHARACTER","CHARACTER","CHARACTER","CHARACTER","CHARACTER","NUMBER","NUMBER","CHARACTER","SIGNED_NUMBER","NUMBER","CHARACTER","CHARACTER","CHARACTER","CHARACTER","CHARACTER","CHARACTER","CHARACTER","CHARACTER","LONG_CHARACTER","CHARACTER","CHARACTER","CHARACTER","CHARACTER","CHARACTER","CHARACTER","CHARACTER","CHARACTER","CHARACTER","CHARACTER","CHARACTER","CHARACTER","CHARACTER"]
[null,null,null,"12","2","3","8","8","3","4","11","10","1","4","8","8","8","8","1","8.2","3","27","2","4","3","3","1","25","25","0","3","3","1","3","72","72","72","72","72","72","72","72","72"]
[null,null,null,"Y/ ","Y/ ","Y/ ","Y/ ","Y/ "," / "," / "," / "," / "," / "," / "," / "," / "," / "," / "," / "," / "," / "," / "," / "," / "," / "," / "," / "," / "," / "," / "," / "," / "," / ","Y/ "," / "," / "," / "," / "," / "," / "," / "," / "," / "]
[null,null,null,"2","5","6","8","9","10","11","12","14","15","16","17","18","19","21","22","23","24","25","26","27","28","29","30","37","38","40","41","42","43","46","48","49","50","51","52","53","54","55","56"]
["Status","Line No","Record Type","Process Name","Sub-Agency","Nature of Action Code","*Effective Date","*Auth Date","Status Type","Document Type","*EmplID","*Case Number","Use Stored Accounting","*Award Code","Award From Date","Award To Date","Tangible Benefit","Intangible Benefit","*Pay Code","*Amount / Hours","*Number of Persons","Accounting Distribution","Sub-Agency Charged","Accounting Station Charged","*Legal Authority (1)","Legal Authority (2)","Address Indicator","Authority 1 Descr - Part 1","Authority 2 Descr - Part 1","*Justification","Action","*Reason Code","Tangible / Intangible Benefit","SF50 Remark Code","Remark Line 1","Remark Line 2","Remark Line 3","Remark Line 4","Remark Line 5","Remark Line 6","Remark Line 7","Remark Line 8","Remark Line 9"]
["OK",5,"0-0-0","CIIMP","II",820,"06162024","06162024","COM","110","999999","2024CTMS","Y","C090","01012024","04302024","0","0","0",16000,1,null,null,null,"VPD",null,"2",null,null,"GOOD WORK","AWD","090","N"]
[" ",5,"1-0-0",null,null,null,null,null,null,null,null,null,null,null,null,null,null,null,null,null,null,null,null,null,null,null,null,null,null,null,null,null,null,"YT8"]
[" ",5,"1-0-0",null,null,null,null,null,null,null,null,null,null,null,null,null,null,null,null,null,null,null,null,null,null,null,null,null,null,null,null,null,null,"YT9"]
["STOP"]

{"sheet":"Errors","index":5,"n_rows":0,"n_cols":0,"rows_kept":0,"cut":false,"hidden":false,"merged":[]}

{"sheet":"Remark Codes-Descriptions","index":6,"n_rows":1641,"n_cols":12,"rows_kept":1641,"cut":false,"hidden":false,"merged":[]}
["Remark Code","Insertion Required?","Effective Date","Remark Line 1","Remark Line 2","Remark Line 3","Remark Line 4","Remark Line 5","Remark Line 6","Remark Line 7","Remark Line 8","Remark Line 9"]
[7,"N","1990-03-25","UCFE SECURE REMARK REQUIRED"," "," "," "," "," "," "," "," "]
["01A","N","1992-05-17","THIS ACTION IS BASED ON SUSTAINED SUPERIOR PERFORMANCE"," "," "," "," "," "," "," "," "]
["01C","N","1992-01-26","UNDER P.L. 96-8, IS ENTITLED TO CONTINUE FEGLI AND HEALTH BENEFITS.","HAS REEMPLOYMENT RIGHTS IN                                    OR","SUCCESSOR AGENCY UPON SEPARATION FROM THE INSTITUTE, SUBJECT TO SUCH TIM","PERIOD AND OTHER CONDITIONS AS THE PRESIDENT MAY PRESCRIBE."," "," "," "," "," "]
["01H","N","2013-09-01","COMPLETED 3 YEARS CONTINUOUS SERVICE EXCEPTED APPOINTMENT INDIAN","PREFERENCE.  EMPLOYEE ENTITLED TO INDIAN PREFERENCE."," "," "," "," "," "," "," "]
["01P","N","1997-02-01","PAYABLE SALARY LIMITED TO $115,700 BY 5 U.S.C. 5304 (G)(1)"," "," "," "," "," "," "," "," "]
["02A","N","1992-05-17","THIS ACTION IS BASED ON A SPECIAL ACT"," "," "," "," "," "," "," "," "]
["02C","N","1992-01-26","VOLUNTARY SEPARATION WITHOUT A BREAK IN SERVICE FROM COMPETITIVE","SERVICE."," "," "," "," "," "," "," "]
["02H","N","2013-09-01","P.L. 100-47 PROVIDES THAT IHS EMPLOYEES APPOINTED INTO THE EXCEPTED","SERVICE UNDER SCHEDULE A 213 3116 (B)(8) SHALL BE CONVERTED TO A CAREER","COMPETITIVE APPOINTMENT AFTER THREE YEARS CONTINUOUS SERVICE AND","SATISFACTORY PERFORMANCE.  THE THREE CONTINUOUS YEARS OF SERVICE MAY","BEGIN WITH TEMPORARY OR PERMANENT EMPLOYMENT."," "," "," "," "]
["03A","N","1992-05-17","THIS RATING OF RECORD IS OUTSTANDING"," "," "," "," "," "," "," "," "]
["03C","N","1992-01-26","SUBJECT TO CONDITIONS AS SPECIFIED BY LAW, YOU ARE ENTITLED TO","MANDATORY RETENTION RIGHTS WHICH EXPIRE        ."," "," "," "," "," "," "," "]
["03H","Y","2013-09-01","EMPLOYEE ENTITLED TO MARKET PAY IN THE AMOUNT OF $XXX"," "," "," "," "," "," "," "," "]
["04A","N","1992-05-17","THIS RATING OF RECORD IS EXCELLENT"," "," "," "," "," "," "," "," "]
["04C","N","1992-01-26","YOUR WAIVER OF                          INSURANCE BECAME EFFECTIVE THE","DAY PRIOR TO THE EFFECTIVE DATE SHOWN ABOVE."," "," "," "," "," "," "," "]
[50,"N","1997-03-09","A"," "," "," "," "," "," "," "," "]
[52,"N","2008-04-27","EXEMPT FROM MANDATORY RETIREMENT AND ELIGIBLE FOR PRORATED ANNUITY UPON","RETIREMENT."," "," "," "," "," "," "," "]
[53,"N","2008-04-27","EMPLOYEE IS SUBJECT TO MANDATORY RETIREMENT"," "," "," "," "," "," "," "," "]
[54,"N","2008-04-27","EMPLOYEE'S SCD FOR ENHANCED CBPO RETIREMENT COVERAGE IS"," "," "," "," "," "," "," "," "]
["05A","N","1992-05-17","THIS RATING OF RECORD IS FULLY SUCCESSFUL"," "," "," "," "," "," "," "," "]
["05C","N","1992-01-26","EMPLOYMENT TERMINATES WHEN THE LIMITATION (OR THE EARLIEST IF MORE","THAT THAN ONE) IS REACHED. THERE IS NO AUTHORITY TO PAY FOR SERVICE","THEREFROM WITHOUT APPROPRIATE PERSONNEL ACTION."," "," "," "," "," "," "]
[60,"N","1997-03-09","B"," "," "," "," "," "," "," "," "]
["06A","N","1992-05-17","THE JUSTIFICATION FOR THIS SPECIAL ACT IS"," "," "," "," "," "," "," "," "]
["06C","N","1992-01-26","SAVED SALARY RATE EXPIRES        UNLESS TERMINATED EARLIER BY","APPROPRIATE PERSONNEL ACTION."," "," "," "," "," "," "," "]
["07A","N","1992-05-17","RECIPIENT OF AN EXECUTIVE OFFICE FOR UNITED STATES ATTORNEYS' DIRECTOR'S","AWARD"," "," "," "," "," "," "," "]
["07C","N","1992-01-26","THE WAITING PERIOD FOR YOUR NEXT STEP INCREASE IS      WEEKS FROM","THE ABOVE EFFECTIVE DATE. THIS PERIOD CAN BE CHANGED BY AN","EQUIVALENT INCREASE ACTION, EXTENDED LWOP, OR NON-WORK DAYS IF","INTERMITTENT."," "," "," "," "," "]
["08A","N","1993-01-24","ELIGIBILITY NEXT FULL API WILL BE IN APRIL,    ."," "," "," "," "," "," "," "," "]
["08C","N","1992-01-26","         APPROPRIATION."," "," "," "," "," "," "," "," "]
["09A","N","1993-03-21","YOUR SALARY HAS BEEN ADJUSTED TO REFLECT A CHANGE IN SPECIAL RATE","AND/OR LOCALITY PAY."," "," "," "," "," "," "," "]
["09C","N","1992-01-26","EMPLOYEE IS A PARTICIPANT IN AN ORGANIZED WORK STUDY PROGRAM."," "," "," "," "," "," "," "," "]
[100,"N","1991-06-30","THIS CORRECTS BLOCK 30, RETIREMENT PLAN, FROM CODE ( ) TO CODE ( )","EFFECTIVE (  -  -  ) AND ALL SUBSEQUENT ACTIONS."," "," "," "," "," "," "," "]
{"$rows_left_out":1612}
{"sheet":"Config","index":7,"n_rows":31,"n_cols":10,"rows_kept":31,"cut":false,"hidden":true,"merged":[]}
["AG - Production COPY","empusda.copy.nfc.usda.gov","https",443,"EMPLOYEE","hr","PT_LOCAL","ENG",10,10]
["AG - Production","usda.empowhr.gov","https",443,"EMPLOYEE","hr","PT_LOCAL","ENG",10,10]
["DHS - Production COPY","empdhs.copy.nfc.usda.gov","https",443,"EMPLOYEE","hr","PT_LOCAL","ENG",10,10]
["DHS - Production","dhs.empowhr.gov","https",443,"EMPLOYEE","hr","PT_LOCAL","ENG",10,10]
["DOJ - Production COPY","empdoj.copy.nfc.usda.gov","https",443,"EMPLOYEE","hr","PT_LOCAL","ENG",10,10]
["DOJ - Production  ","doj.empowhr.gov","https",443,"EMPLOYEE","hr","PT_LOCAL","ENG",10,10]
["USDAUAT","empusda.cuat.nfc.usda.gov","https",443,"EMPLOYEE","hr","PT_LOCAL","ENG",10,10]
["DHSUAT","empdhs.cuat.nfc.usda.gov","https",443,"EMPLOYEE","hr","PT_LOCAL","ENG",10,10]
["DOJUAT","empdoj.cuat.nfc.usda.gov","https",443,"EMPLOYEE","hr","PT_LOCAL","ENG",10,10]
["USDAQA","empusda.qa.nfc.usda.gov","https",443,"EMPLOYEE","hr","PT_LOCAL","ENG",10,10]
["DHSQA","empdhs.qa.nfc.usda.gov","https",443,"EMPLOYEE","hr","PT_LOCAL","ENG",10,10]
["DOJQA","empdoj.qa.nfc.usda.gov","https",443,"EMPLOYEE","hr","PT_LOCAL","ENG",10,10]
["USDATEST","empusda.test.nfc.usda.gov","https",443,"EMPLOYEE","hr","PT_LOCAL","ENG",10,10]
["DHSTEST","empdhs.test.nfc.usda.gov","https",443,"EMPLOYEE","hr","PT_LOCAL","ENG",10,10]
["DOJTEST","empdoj.test.nfc.usda.gov","https",443,"EMPLOYEE","hr","PT_LOCAL","ENG",10,10]
["Training","train.empowhr.gov","https",443,"EMPLOYEE","hr","PT_LOCAL","ENG",10,10]
["Development","empowhr.dev.nfc.usda.gov","https",443,"EMPLOYEE","hr","PT_LOCAL","ENG",10,10]
[]
["CREATE","Remarks","NOA","DESCR",null,null,"Check Mail Address Translate Values"]
[null,0,820,"DHS-CS RECOGNITION PAYMENT",null,null,1,"Personnel Office Identifier"]
[null,1,822,"GROUP TIME OFF AWARD-OTHER",null,null,2,"Check Mail Address"]
[null,2,823,"INDIVIDUAL TIME OFF AWARD -OTHER",null,null,3,"Specified Address"]
[null,3,840,"INDIVIDUAL CASH AWARD RB"]
[null,4,841,"GROUP AWARD-CH 45"]
[null,5,846,"INDIVIDUAL TIME-OFF-AWARD"]
[null,6,847,"GROUP TIME-OFF-AWARD"]
[null,7,849,"INDIV CASH AWARD NRB"]
[null,8,886,"LUMP SUM PERF PYMT RB-NILPA"]
[null,9,889,"GROUP AWARD-OTHER"]
[null,10]
{"$rows_left_out":1}