{"text_format":"1","workbook":"xlsx","n_sheets":8,"sheets":["Coversheet","Connect Information","Template","Data Input","Staging & Submission","Errors","Remark Codes-Descriptions","Config"],"not_rendered":{"charts":0,"images":3,"macros":1,"external_links":0,"defined_names":64,"comments":4,"pivot_tables":0},"unopened":[],"bounds":{"document_bytes":16777216,"sheet_cells":100000,"rows_first":2000,"rows_last":500,"rows_between":2000,"halvings":0,"cell_chars":16384,"cell_head_chars":4096},"cells_cut":0,"cells_raw":0,"read":"row_number_cap","date_system":"1900"}

{"sheet":"Coversheet","index":0,"n_rows":18,"n_cols":3,"rows_kept":18,"cut":false,"hidden":false,"merged":[]}
[]
[null,null,"Excel To CI Utility"]
[null,null,"The purpose of this workbook is to upload data from Excel into PeopleSoft using the Component Interface to execute business logic for each transaction. This source workbook contains both worksheets and Excel VBA code modules.  The Worksheets can be copied to other workbooks for distribution without copying the code modules."]
[]
[null,"Process:"]
[null,"1)","Connection Information sheet: The information provided on this sheet is required to create a new template or submit data to the database. You will need to specify environment information as well as information in regard to how each transaction should be handled. The Action will be filled in automatically. By default, character fields which are left blank or only contain blanks will not be submitted for update. There is an option to override this setting."]
[]
[null,"2)","Template sheet: Here you create the template that you are going to use. The template is based upon the structure of a Component Interface on the PeopleSoft database."]
[null,null,"2.1. New Template: When prompted, enter the name of your PeopleSoft User ID, password, and the Component Interface you wish to use. The connect information previously provided is used to retrieve the PeopleSoft Component Interface properties. The Component Interface structure is displayed graphically."]
[null,null,"2.2. Manipulate Template: Here input cells are selected for inclusion on the Data Input and Staging & Submisson sheets.  The purpose of each button provided to allow manipulation of the template is more fully described by mousing over the button on the toolbar."]
[null,null,"2.3. New Data Input: This button copies the selected input cells into the Data Input sheet. The Data Input sheet becomes active, and you will be prompted before the structures and data on that sheet are deleted."]
[]
[null,"3)","Data Input sheet: Here you enter data values for submission to the PeopleSoft database."]
[null,null,"3.1. Stage Data for Submission: The data entered on the Data Input sheet is then staged in hierarchical form in preparation for submission to the database."]
[]
[null,"4)","Staging & Submission sheet: The last step is to format the data and submit to the database."]
[null,null,"4.1. Submit Data: This submits the data to the database.  Your PeopleSoft User ID and Password will be required. Each row submitted is marked with the reply from the database which will either be OK, Warning, or Error."]
[null,null,"4.2. Post Results: This posts the status for each row submitted to the database on the Data Input sheet so that data in a status of error can be corrected and resubmitted."]

{"sheet":"Connect Information","index":1,"n_rows":23,"n_cols":8,"rows_kept":23,"cut":false,"hidden":false,"merged":[],"read":"row_number_cap"}
[]
[]
[]
[]
[null,"Environment:","AG - Production COPY"]
[null,"Web Server Machine Name:",{"$f":"IF(ISNA(VLOOKUP(C5 & \"\",Config!A1:B21,2,FALSE)),\"\", VLOOKUP(C5 & \"\",Z_ConnectTable,2,FALSE))","v":"empusda.copy.nfc.usda.gov"},null,"Optional Keys:"]
[null,"Protocol:",{"$f":"IF(ISNA(VLOOKUP(C5 & \"\",Z_ConnectTable,3,FALSE)),\"\", VLOOKUP(C5 & \"\",Z_ConnectTable,3,FALSE))","v":"https"}]
[null,"HTTP Port:",{"$f":"IF(ISNA(VLOOKUP(C5 & \"\",Z_ConnectTable,4,FALSE)),\"\", VLOOKUP(C5 & \"\",Z_ConnectTable,4,FALSE))","v":443}]
[null,"Portal:",{"$f":"IF(ISNA(VLOOKUP(C5 & \"\",Z_ConnectTable,5,FALSE)),\"\", VLOOKUP(C5 & \"\",Z_ConnectTable,5,FALSE))","v":"EMPLOYEE"}]
[null,"PeopleSoft Site Name:",{"$f":"IF(ISNA(VLOOKUP(C5 & \"\",Z_ConnectTable,6,FALSE)),\"\", VLOOKUP(C5 & \"\",Z_ConnectTable,6,FALSE))","v":"hr"}]
[null,"Node:",{"$f":"IF(ISNA(VLOOKUP(C5 & \"\",Z_ConnectTable,7,FALSE)),\"\", VLOOKUP(C5 & \"\",Z_ConnectTable,7,FALSE))","v":"PT_LOCAL"},null,"NOA:",840,null,{"$f":"VLOOKUP(F11,Config!$C$20:$D$29,2,FALSE)","v":"INDIVIDUAL CASH AWARD RB"}]
[null,"Language Code:",{"$f":"IF(ISNA(VLOOKUP(C5 & \"\",Z_ConnectTable,8,FALSE)),\"\", VLOOKUP(C5 & \"\",Z_ConnectTable,8,FALSE))","v":"ENG"}]
[null,"Number of Remarks:",2]
[null,"Chunking Factor:","40"]
[null,"Error Threshold:","1"]
[null,"Submit Blanks as Input:"]
[null,"Action:","CREATE"]
[null,"Action:"]
[null,"Submit Options"]
[]
[null,"Allow Blanks:"," "]
[null,"Z_AWD_MASSLOAD_CI"]
[null,"Submit Options"]

{"sheet":"Template","index":2,"n_rows":14,"n_cols":59,"rows_kept":14,"cut":false,"hidden":false,"merged":[]}
[]
["Z_AWD_MASSLOAD_CI"]
[]
[null,null,"Collection","Z_AWD_MASSLOAD_CI","Z_AWD_MASSLOAD_CI","Z_AWD_MASSLOAD_CI","Z_AWD_MASSLOAD_CI","Z_AWD_MASSLOAD_CI","Z_AWD_MASSLOAD_CI","Z_AWD_MASSLOAD_CI","Z_AWD_MASSLOAD_CI","Z_AWD_MASSLOAD_CI","Z_AWD_MASSLOAD_CI","Z_AWD_MASSLOAD_CI","Z_AWD_MASSLOAD_CI","Z_AWD_MASSLOAD_CI","Z_AWD_MASSLOAD_CI","Z_AWD_MASSLOAD_CI","Z_AWD_MASSLOAD_CI","Z_AWD_MASSLOAD_CI","Z_AWD_MASSLOAD_CI","Z_AWD_MASSLOAD_CI","Z_AWD_MASSLOAD_CI","Z_AWD_MASSLOAD_CI","Z_AWD_MASSLOAD_CI","Z_AWD_MASSLOAD_CI","Z_AWD_MASSLOAD_CI","Z_AWD_MASSLOAD_CI","Z_AWD_MASSLOAD_CI","Z_AWD_MASSLOAD_CI","Z_AWD_MASSLOAD_CI","Z_AWD_MASSLOAD_CI","Z_AWD_MASSLOAD_CI","Z_AWD_MASSLOAD_CI","Z_AWD_MASSLOAD_CI","Z_AWD_MASSLOAD_CI","Z_AWD_MASSLOAD_CI","Z_AWD_MASSLOAD_CI","Z_AWD_MASSLOAD_CI","Z_AWD_MASSLOAD_CI","Z_AWD_MASSLOAD_CI","Z_AWD_MASSLOAD_CI","Z_AWD_MASSLOAD_CI","Z_AWD_MASSLOAD_CI","Z_AWD_MASSLOAD_CI","Z_AWD_MASSLOAD_CI","Z_AWD_MASSLOAD_CI","Z_AWD_MASSLOAD_CI","Z_IMP_AWD_RMKS","Z_IMP_AWD_RMKS","Z_IMP_AWD_RMKS","Z_IMP_AWD_RMKS","Z_IMP_AWD_RMKS","Z_IMP_AWD_RMKS","Z_IMP_AWD_RMKS","Z_IMP_AWD_RMKS","Z_IMP_AWD_RMKS","Z_IMP_AWD_RMKS","Z_IMP_AWD_RMKS"]
[null,null,"Property","RUN_DTTM","PROCESSNAME","COMPANY","NATIONAL_ID","GVT_SUB_AGENCY","GVT_NOA_CODE","GVT_POI","Z_EFFDT_C","Z_ACTION_DT_C","GVT_STATUS_TYPE","Z_DOC_TYPE","EMPLID","OPRID","GVT_SUGGESTION_NBR","Z_STORED_ACCTG_CD","Z_CASH_AWARD_CD","Z_AWARD_FROM_DT_C","Z_AWARD_TO_DT_C","GVT_TANG_BEN_AMT","Z_AWD_FIRST_YR_SAV","GVT_INTANG_BEN_AMT","Z_AWARD_PAY_CD","GOAL_AMT","Z_AWARD_GROUP","Z_ACCTG_DISTRIB","Z_AWD_AGNCY_CHRGD","Z_AWD_ACCT_STA_CHG","GVT_LEG_AUTH_1","GVT_LEG_AUTH_2","Z_CK_MAIL_ADDR_IND","ADDRESS1_OTHER","ADDRESS2_OTHER","Z_GVT_LEGAUTH1_1ST","Z_GVT_LEGAUTH2_1ST","CITY_OTHER","STATE_OTHER","GVT_PAR_AUTH_D1","GVT_PAR_AUTH_D2","POSTAL_OTHER","COMMENTS","ACTION","ACTION_REASON","Z_TANG_INTANG_BEN","GVT_CONT_EMPLID","Z_LC_RECOMMENDER","GVT_SF50_REMARK","GVT_INSERT_REQD","GVT_REMARK_LINE1","GVT_REMARK_LINE2","GVT_REMARK_LINE3","GVT_REMARK_LINE4","GVT_REMARK_LINE5","GVT_REMARK_LINE6","GVT_REMARK_LINE7","GVT_REMARK_LINE8","GVT_REMARK_LINE9"]
[null,null,"Record Type","0-0-0","0-0-0","0-0-0","0-0-0","0-0-0","0-0-0","0-0-0","0-0-0","0-0-0","0-0-0","0-0-0","0-0-0","0-0-0","0-0-0","0-0-0","0-0-0","0-0-0","0-0-0","0-0-0","0-0-0","0-0-0","0-0-0","0-0-0","0-0-0","0-0-0","0-0-0","0-0-0","0-0-0","0-0-0","0-0-0","0-0-0","0-0-0","0-0-0","0-0-0","0-0-0","0-0-0","0-0-0","0-0-0","0-0-0","0-0-0","0-0-0","0-0-0","0-0-0","0-0-0","0-0-0","1-0-0","1-0-0","1-0-0","1-0-0","1-0-0","1-0-0","1-0-0","1-0-0","1-0-0","1-0-0","1-0-0"]
[null,null,"Field Type","DATETIME","CHARACTER","CHARACTER","CHARACTER","CHARACTER","CHARACTER","CHARACTER","CHARACTER","CHARACTER","CHARACTER","CHARACTER","CHARACTER","CHARACTER","CHARACTER","CHARACTER","CHARACTER","CHARACTER","CHARACTER","NUMBER","NUMBER","NUMBER","CHARACTER","SIGNED_NUMBER","NUMBER","CHARACTER","CHARACTER","CHARACTER","CHARACTER","CHARACTER","CHARACTER","CHARACTER","CHARACTER","CHARACTER","CHARACTER","CHARACTER","CHARACTER","CHARACTER","CHARACTER","CHARACTER","LONG_CHARACTER","CHARACTER","CHARACTER","CHARACTER","CHARACTER","CHARACTER","CHARACTER","CHARACTER","CHARACTER","CHARACTER","CHARACTER","CHARACTER","CHARACTER","CHARACTER","CHARACTER","CHARACTER","CHARACTER"]
[null,null,"Field Length","26","12","3","20","2","3","4","8","8","3","4","11","30","10","1","4","8","8","8","8.2","8","1","8.2","3","27","2","4","3","3","1","55","55","3","3","30","6","25","25","12","0","3","3","1","11","11","3","1","72","72","72","72","72","72","72","72","72"]
[null,null,"Key / Required","Y/ ","Y/ ","Y/ ","Y/ ","Y/ ","Y/ ","Y/ ","Y/ ","Y/ "," / "," / "," / "," / "," / "," / "," / "," / "," / "," / "," / "," / "," / "," / "," / "," / "," / "," / "," / "," / "," / "," / "," / "," / "," / "," / "," / "," / "," / "," / "," / "," / "," / "," / "," / "," / ","Y/ "," / "," / "," / "," / "," / "," / "," / "," / "," / "," / "]
[null,null,"Sequence","1","2","3","4","5","6","7","8","9","10","11","12","13","14","15","16","17","18","19","20","21","22","23","24","25","26","27","28","29","30","31","32","33","34","35","36","37","38","39","40","41","42","43","44","45","46","47","48","49","50","51","52","53","54","55","56"]
["Status","Line No","Record Type","Run Date and Time","Process Name","Agency","*Social Security Number","Sub-Agency","Nature of Action Code","Personnel Office ID","*Effective Date","*Auth Date","Status Type","Document Type","*EmplID","User ID","*Case Number","Use Stored Accounting","*Award Code","Award From Date","Award To Date","Tangible Benefit","First Year Savings","Intangible Benefit","*Pay Code","*Amount / Hours","*Number of Persons","Accounting Distribution","Sub-Agency Charged","Accounting Station Charged","*Legal Authority (1)","Legal Authority (2)","Address Indicator","Address Line 1","Address Line 2","Legal Authority (1) 1st NOA","Legal Authority (2) 1st NOA","City - Other","State - Other","Authority 1 Descr - Part 1","Authority 2 Descr - Part 1","Postal Code - Other","*Justification","Action","*Reason Code","Tangible / Intangible Benefit","Contact Emplid","Recommending Official","SF50 Remark Code","Insertion Required","Remark Line 1","Remark Line 2","Remark Line 3","Remark Line 4","Remark Line 5","Remark Line 6","Remark Line 7","Remark Line 8","Remark Line 9"]
["Template",null,"0-0-0","","CIIMP","","","",820,"","","","COM","110","","","","Y","","","","0","","0","","",1,"","","","","","2","","","","","","","","","","","AWD","","N","",""]
["Template",null,"1-0-0",null,null,null,null,null,null,null,null,null,null,null,null,null,null,null,null,null,null,null,null,null,null,null,null,null,null,null,null,null,null,null,null,null,null,null,null,null,null,null,null,null,null,null,null,null,"","","","","","","","","","",""]
["Template",null,"1-0-0",null,null,null,null,null,null,null,null,null,null,null,null,null,null,null,null,null,null,null,null,null,null,null,null,null,null,null,null,null,null,null,null,null,null,null,null,null,null,null,null,null,null,null,null,null,"","","","","","","","","","",""]

{"sheet":"Data Input","index":3,"n_rows":5,"n_cols":39,"rows_kept":5,"cut":false,"hidden":false,"merged":[]}
[]
["Z_AWD_MASSLOAD_CI"]
["Record Type 0-0-0","Record Type 0-0-0","Record Type 0-0-0","Record Type 0-0-0","Record Type 0-0-0","Record Type 0-0-0","Record Type 0-0-0","Record Type 0-0-0","Record Type 0-0-0","Record Type 0-0-0","Record Type 0-0-0","Record Type 0-0-0","Record Type 0-0-0","Record Type 0-0-0","Record Type 0-0-0","Record Type 0-0-0","Record Type 0-0-0","Record Type 0-0-0","Record Type 0-0-0","Record Type 1-0-0","Record Type 1-0-0","Record Type 1-0-0","Record Type 1-0-0","Record Type 1-0-0","Record Type 1-0-0","Record Type 1-0-0","Record Type 1-0-0","Record Type 1-0-0","Record Type 1-0-0","Record Type 1-0-0","Record Type 1-0-0","Record Type 1-0-0","Record Type 1-0-0","Record Type 1-0-0","Record Type 1-0-0","Record Type 1-0-0","Record Type 1-0-0","Record Type 1-0-0","Record Type 1-0-0"]
["Sub-Agency","*Effective Date","*Auth Date","*EmplID","*Case Number","*Award Code","Award From Date","Award To Date","*Pay Code","*Amount / Hours","Accounting Distribution","Sub-Agency Charged","Accounting Station Charged","*Legal Authority (1)","Legal Authority (2)","Authority 1 Descr - Part 1","Authority 2 Descr - Part 1","*Justification","*Reason Code","SF50 Remark Code","Remark Line 1","Remark Line 2","Remark Line 3","Remark Line 4","Remark Line 5","Remark Line 6","Remark Line 7","Remark Line 8","Remark Line 9","SF50 Remark Code","Remark Line 1","Remark Line 2","Remark Line 3","Remark Line 4","Remark Line 5","Remark Line 6","Remark Line 7","Remark Line 8","Remark Line 9"]
["II","06162024","06162024","999999","2024CTMS","C090","01012024","04302024","0",16000,null,null,null,"VPD",null,null,null,"GOOD WORK","090","YT8",null,null,null,null,null,null,null,null,null,"YT9"]

{"sheet":"Staging & Submission","index":4,"n_rows":14,"n_cols":43,"rows_kept":14,"cut":false,"hidden":false,"merged":[]}
[]
["Z_AWD_MASSLOAD_CI"]
[null,null,null,"Z_AWD_MASSLOAD_CI","Z_AWD_MASSLOAD_CI","Z_AWD_MASSLOAD_CI","Z_AWD_MASSLOAD_CI","Z_AWD_MASSLOAD_CI","Z_AWD_MASSLOAD_CI","Z_AWD_MASSLOAD_CI","Z_AWD_MASSLOAD_CI","Z_AWD_MASSLOAD_CI","Z_AWD_MASSLOAD_CI","Z_AWD_MASSLOAD_CI","Z_AWD_MASSLOAD_CI","Z_AWD_MASSLOAD_CI","Z_AWD_MASSLOAD_CI","Z_AWD_MASSLOAD_CI","Z_AWD_MASSLOAD_CI","Z_AWD_MASSLOAD_CI","Z_AWD_MASSLOAD_CI","Z_AWD_MASSLOAD_CI","Z_AWD_MASSLOAD_CI","Z_AWD_MASSLOAD_CI","Z_AWD_MASSLOAD_CI","Z_AWD_MASSLOAD_CI","Z_AWD_MASSLOAD_CI","Z_AWD_MASSLOAD_CI","Z_AWD_MASSLOAD_CI","Z_AWD_MASSLOAD_CI","Z_AWD_MASSLOAD_CI","Z_AWD_MASSLOAD_CI","Z_AWD_MASSLOAD_CI","Z_IMP_AWD_RMKS","Z_IMP_AWD_RMKS","Z_IMP_AWD_RMKS","Z_IMP_AWD_RMKS","Z_IMP_AWD_RMKS","Z_IMP_AWD_RMKS","Z_IMP_AWD_RMKS","Z_IMP_AWD_RMKS","Z_IMP_AWD_RMKS","Z_IMP_AWD_RMKS"]
[null,null,null,"PROCESSNAME","GVT_SUB_AGENCY","GVT_NOA_CODE","Z_EFFDT_C","Z_ACTION_DT_C","GVT_STATUS_TYPE","Z_DOC_TYPE","EMPLID","GVT_SUGGESTION_NBR","Z_STORED_ACCTG_CD","Z_CASH_AWARD_CD","Z_AWARD_FROM_DT_C","Z_AWARD_TO_DT_C","GVT_TANG_BEN_AMT","GVT_INTANG_BEN_AMT","Z_AWARD_PAY_CD","GOAL_AMT","Z_AWARD_GROUP","Z_ACCTG_DISTRIB","Z_AWD_AGNCY_CHRGD","Z_AWD_ACCT_STA_CHG","GVT_LEG_AUTH_1","GVT_LEG_AUTH_2","Z_CK_MAIL_ADDR_IND","GVT_PAR_AUTH_D1","GVT_PAR_AUTH_D2","COMMENTS","ACTION","ACTION_REASON","Z_TANG_INTANG_BEN","GVT_SF50_REMARK","GVT_REMARK_LINE1","GVT_REMARK_LINE2","GVT_REMARK_LINE3","GVT_REMARK_LINE4","GVT_REMARK_LINE5","GVT_REMARK_LINE6","GVT_REMARK_LINE7","GVT_REMARK_LINE8","GVT_REMARK_LINE9"]
[null,null,null,"0-0-0","0-0-0","0-0-0","0-0-0","0-0-0","0-0-0","0-0-0","0-0-0","0-0-0","0-0-0","0-0-0","0-0-0","0-0-0","0-0-0","0-0-0","0-0-0","0-0-0","0-0-0","0-0-0","0-0-0","0-0-0","0-0-0","0-0-0","0-0-0","0-0-0","0-0-0","0-0-0","0-0-0","0-0-0","0-0-0","1-0-0","1-0-0","1-0-0","1-0-0","1-0-0","1-0-0","1-0-0","1-0-0","1-0-0","1-0-0"]
[null,null,null,"CHARACTER","CHARACTER","CHARACTER","CHARACTER","CHARACTER","CHARACTER","CHARACTER","CHARACTER","CHARACTER","CHARACTER","CHARACTER","CHARACTER","CHARACTER","NUMBER","NUMBER","CHARACTER","SIGNED_NUMBER","NUMBER","CHARACTER","CHARACTER","CHARACTER","CHARACTER","CHARACTER","CHARACTER","CHARACTER","CHARACTER","LONG_CHARACTER","CHARACTER","CHARACTER","CHARACTER","CHARACTER","CHARACTER","CHARACTER","CHARACTER","CHARACTER","CHARACTER","CHARACTER","CHARACTER","CHARACTER","CHARACTER"]
[null,null,null,"12","2","3","8","8","3","4","11","10","1","4","8","8","8","8","1","8.2","3","27","2","4","3","3","1","25","25","0","3","3","1","3","72","72","72","72","72","72","72","72","72"]
[null,null,null,"Y/ ","Y/ ","Y/ ","Y/ ","Y/ "," / "," / "," / "," / "," / "," / "," / "," / "," / "," / "," / "," / "," / "," / "," / "," / "," / "," / "," / "," / "," / "," / "," / "," / "," / ","Y/ "," / "," / "," / "," / "," / "," / "," / "," / "," / "]
[null,null,null,"2","5","6","8","9","10","11","12","14","15","16","17","18","19","21","22","23","24","25","26","27","28","29","30","37","38","40","41","42","43","46","48","49","50","51","52","53","54","55","56"]
["Status","Line No","Record Type","Process Name","Sub-Agency","Nature of Action Code","*Effective Date","*Auth Date","Status Type","Document Type","*EmplID","*Case Number","Use Stored Accounting","*Award Code","Award From Date","Award To Date","Tangible Benefit","Intangible Benefit","*Pay Code","*Amount / Hours","*Number of Persons","Accounting Distribution","Sub-Agency Charged","Accounting Station Charged","*Legal Authority (1)","Legal Authority (2)","Address Indicator","Authority 1 Descr - Part 1","Authority 2 Descr - Part 1","*Justification","Action","*Reason Code","Tangible / Intangible Benefit","SF50 Remark Code","Remark Line 1","Remark Line 2","Remark Line 3","Remark Line 4","Remark Line 5","Remark Line 6","Remark Line 7","Remark Line 8","Remark Line 9"]
["OK",5,"0-0-0","CIIMP","II",820,"06162024","06162024","COM","110","999999","2024CTMS","Y","C090","01012024","04302024","0","0","0",16000,1,null,null,null,"VPD",null,"2",null,null,"GOOD WORK","AWD","090","N"]
[" ",5,"1-0-0",null,null,null,null,null,null,null,null,null,null,null,null,null,null,null,null,null,null,null,null,null,null,null,null,null,null,null,null,null,null,"YT8"]
[" ",5,"1-0-0",null,null,null,null,null,null,null,null,null,null,null,null,null,null,null,null,null,null,null,null,null,null,null,null,null,null,null,null,null,null,"YT9"]
["STOP"]

{"sheet":"Errors","index":5,"n_rows":0,"n_cols":0,"rows_kept":0,"cut":false,"hidden":false,"merged":[]}

{"sheet":"Remark Codes-Descriptions","index":6,"n_rows":1641,"n_cols":12,"rows_kept":1641,"cut":false,"hidden":false,"merged":[]}
["Remark Code","Insertion Required?","Effective Date","Remark Line 1","Remark Line 2","Remark Line 3","Remark Line 4","Remark Line 5","Remark Line 6","Remark Line 7","Remark Line 8","Remark Line 9"]
[7,"N","1990-03-25","UCFE SECURE REMARK REQUIRED"," "," "," "," "," "," "," "," "]
["01A","N","1992-05-17","THIS ACTION IS BASED ON SUSTAINED SUPERIOR PERFORMANCE"," "," "," "," "," "," "," "," "]
["01C","N","1992-01-26","UNDER P.L. 96-8, IS ENTITLED TO CONTINUE FEGLI AND HEALTH BENEFITS.","HAS REEMPLOYMENT RIGHTS IN                                    OR","SUCCESSOR AGENCY UPON SEPARATION FROM THE INSTITUTE, SUBJECT TO SUCH TIM","PERIOD AND OTHER CONDITIONS AS THE PRESIDENT MAY PRESCRIBE."," "," "," "," "," "]
["01H","N","2013-09-01","COMPLETED 3 YEARS CONTINUOUS SERVICE EXCEPTED APPOINTMENT INDIAN","PREFERENCE.  EMPLOYEE ENTITLED TO INDIAN PREFERENCE."," "," "," "," "," "," "," "]
["01P","N","1997-02-01","PAYABLE SALARY LIMITED TO $115,700 BY 5 U.S.C. 5304 (G)(1)"," "," "," "," "," "," "," "," "]
["02A","N","1992-05-17","THIS ACTION IS BASED ON A SPECIAL ACT"," "," "," "," "," "," "," "," "]
["02C","N","1992-01-26","VOLUNTARY SEPARATION WITHOUT A BREAK IN SERVICE FROM COMPETITIVE","SERVICE."," "," "," "," "," "," "," "]
["02H","N","2013-09-01","P.L. 100-47 PROVIDES THAT IHS EMPLOYEES APPOINTED INTO THE EXCEPTED","SERVICE UNDER SCHEDULE A 213 3116 (B)(8) SHALL BE CONVERTED TO A CAREER","COMPETITIVE APPOINTMENT AFTER THREE YEARS CONTINUOUS SERVICE AND","SATISFACTORY PERFORMANCE.  THE THREE CONTINUOUS YEARS OF SERVICE MAY","BEGIN WITH TEMPORARY OR PERMANENT EMPLOYMENT."," "," "," "," "]
["03A","N","1992-05-17","THIS RATING OF RECORD IS OUTSTANDING"," "," "," "," "," "," "," "," "]
["03C","N","1992-01-26","SUBJECT TO CONDITIONS AS SPECIFIED BY LAW, YOU ARE ENTITLED TO","MANDATORY RETENTION RIGHTS WHICH EXPIRE        ."," "," "," "," "," "," "," "]
["03H","Y","2013-09-01","EMPLOYEE ENTITLED TO MARKET PAY IN THE AMOUNT OF $XXX"," "," "," "," "," "," "," "," "]
["04A","N","1992-05-17","THIS RATING OF RECORD IS EXCELLENT"," "," "," "," "," "," "," "," "]
["04C","N","1992-01-26","YOUR WAIVER OF                          INSURANCE BECAME EFFECTIVE THE","DAY PRIOR TO THE EFFECTIVE DATE SHOWN ABOVE."," "," "," "," "," "," "," "]
[50,"N","1997-03-09","A"," "," "," "," "," "," "," "," "]
[52,"N","2008-04-27","EXEMPT FROM MANDATORY RETIREMENT AND ELIGIBLE FOR PRORATED ANNUITY UPON","RETIREMENT."," "," "," "," "," "," "," "]
[53,"N","2008-04-27","EMPLOYEE IS SUBJECT TO MANDATORY RETIREMENT"," "," "," "," "," "," "," "," "]
[54,"N","2008-04-27","EMPLOYEE'S SCD FOR ENHANCED CBPO RETIREMENT COVERAGE IS"," "," "," "," "," "," "," "," "]
["05A","N","1992-05-17","THIS RATING OF RECORD IS FULLY SUCCESSFUL"," "," "," "," "," "," "," "," "]
["05C","N","1992-01-26","EMPLOYMENT TERMINATES WHEN THE LIMITATION (OR THE EARLIEST IF MORE","THAT THAN ONE) IS REACHED. THERE IS NO AUTHORITY TO PAY FOR SERVICE","THEREFROM WITHOUT APPROPRIATE PERSONNEL ACTION."," "," "," "," "," "," "]
[60,"N","1997-03-09","B"," "," "," "," "," "," "," "," "]
["06A","N","1992-05-17","THE JUSTIFICATION FOR THIS SPECIAL ACT IS"," "," "," "," "," "," "," "," "]
["06C","N","1992-01-26","SAVED SALARY RATE EXPIRES        UNLESS TERMINATED EARLIER BY","APPROPRIATE PERSONNEL ACTION."," "," "," "," "," "," "," "]
["07A","N","1992-05-17","RECIPIENT OF AN EXECUTIVE OFFICE FOR UNITED STATES ATTORNEYS' DIRECTOR'S","AWARD"," "," "," "," "," "," "," "]
["07C","N","1992-01-26","THE WAITING PERIOD FOR YOUR NEXT STEP INCREASE IS      WEEKS FROM","THE ABOVE EFFECTIVE DATE. THIS PERIOD CAN BE CHANGED BY AN","EQUIVALENT INCREASE ACTION, EXTENDED LWOP, OR NON-WORK DAYS IF","INTERMITTENT."," "," "," "," "," "]
["08A","N","1993-01-24","ELIGIBILITY NEXT FULL API WILL BE IN APRIL,    ."," "," "," "," "," "," "," "," "]
["08C","N","1992-01-26","         APPROPRIATION."," "," "," "," "," "," "," "," "]
["09A","N","1993-03-21","YOUR SALARY HAS BEEN ADJUSTED TO REFLECT A CHANGE IN SPECIAL RATE","AND/OR LOCALITY PAY."," "," "," "," "," "," "," "]
["09C","N","1992-01-26","EMPLOYEE IS A PARTICIPANT IN AN ORGANIZED WORK STUDY PROGRAM."," "," "," "," "," "," "," "," "]
[100,"N","1991-06-30","THIS CORRECTS BLOCK 30, RETIREMENT PLAN, FROM CODE ( ) TO CODE ( )","EFFECTIVE (  -  -  ) AND ALL SUBSEQUENT ACTIONS."," "," "," "," "," "," "," "]
[101,"N","1985-10-13","YOUR TOUR OF DUTY WILL BE FULL-TIME OR PART-TIME WHEN NEEDED.  YOUR","SERVICES MAY NOT BE REQUIRED AT CERTAIN TIMES DUE TO LACK OF FUNDS, LACK","OF WORK, WEATHER CONDITIONS, OR OTHER UNFORESEEN CIRCUMSTANCES.  IT IS","EXPECTED YOU WILL WORK LESS THAN 1040 HOURS EACH YEAR.  DURING THESE","PERIODS, YOU WILL BE PLACED IN A NON-WORK STATUS."," "," "," "," "]
[102,"N","1985-10-13","TENTATIVE SCD PENDING CERTIFICATION OF PRIOR FEDERAL SERVICE."," "," "," "," "," "," "," "," "]
[103,"N","1985-10-13","YOU ARE NOT SUBJECT TO ANNUAL LEAVE CEILING WHILE SERVING IN THE","SENIOR EXECUTIVE SERVICE (SES)."," "," "," "," "," "," "," "]
[104,"N","1985-10-13","YOUR ANNUAL LEAVE BALANCE OF       ACCUMULATED WHILE IN THE SES BECOMES","YOUR CEILING FOR THE LEAVE YEAR.  ANY ANNUAL LEAVE USED IN EXCESS OF","LEAVE EARNED DURING EACH SUBSEQUENT LEAVE YEAR WILL REDUCE THE ABOVE","BALANCE UNTIL THE NORMAL CARRY-OVER OF 240 HOURS IS ATTAINED."," "," "," "," "," "]
[105,"N","1985-10-13","ANNUAL AND SICK LEAVE BALANCES TO BE TRANSFERRED."," "," "," "," "," "," "," "," "]
[106,"N","1985-10-13","ELIGIBLE TO EARN ANNUAL LEAVE SINCE APPOINTMENT NOW EXCEEDS 90 CALENDAR","DAYS.  CREDIT FOR ANNUAL LEAVE IS RETROACTIVE TO DATE OF INITIAL","APPOINTMENT."," "," "," "," "," "," "]
[107,"N","1985-10-13","INELIGIBLE TO EARN ANNUAL LEAVE BECAUSE APPOINTMENT IS FOR LESS THAN 90","CALENDAR DAYS."," "," "," "," "," "," "," "]
[108,"N","1985-10-13","THIS ACTION TAKEN PENDING A DECISION ON APPLICATION FOR DISABILITY","RETIREMENT."," "," "," "," "," "," "," "]
[109,"N","1985-10-13","ENTITLED TO UNIFORM ALLOWANCE."," "," "," "," "," "," "," "," "]
["10C","N","1992-01-26","COMPLETION OF WORK FOR WHICH EMPLOYED."," "," "," "," "," "," "," "," "]
["10I","N","1990-08-26","WELCOME TO THE INTERNAL REVENUE SERVICE"," "," "," "," "," "," "," "," "]
["10J","N","1991-04-07","TERMINATION IS BASED UPON EXPIRATION OF ASSIGNMENT OR AT VOLUNTEER'S","REQUEST."," "," "," "," "," "," "," "]
[110,"N","1985-10-13","THIS POSITION HAS PROMOTION POTENTIAL TO        ; HOWEVER, PROMOTION IS","NEITHER GUARANTEED, NOR IS THE PROMISE OF PROMOTION IMPLIED."," "," "," "," "," "," "," "]
[111,"N","1985-10-13","THIS EMPLOYEE HAS ELECTED TO PARTICIPATE IN THE MIXED-TOUR PROGRAM WITH","A              SCHEDULE TOUR OF DUTY.  BASED ON THE AGENCY'S FLUCTUATING","WORKLOAD, THE EMPLOYEE WILL REVERT TO INTERMITTENT STATUS, AS NECESSARY."," "," "," "," "," "," "]
[112,"N","1985-10-13","THIS ACTION EFFECTED UNDER 13 USC 24 (A) IS STRICTLY TEMPORARY NOT TO","EXCEED         .  WHEN YOUR SERVICES ARE NO LONGER NEEDED IN THIS","TEMPORARY ASSIGNMENT, YOU WILL REVERT TO YOUR LAST PERMANENT LEVEL WHERE","YOU WILL BE GRANTED ALL RIGHTS AND PRIVILEGES AS IF YOU HAD NOT BEEN","TEMPORARILY PROMOTED."," "," "," "," "]
[113,"N","1985-10-13","THIS ACTION EFFECTED UNDER 13 USC 24 (A) CONTINUES YOUR TEMPORARY","PROMOTION NOT TO EXCEED         .  WHEN YOUR SERVICES ARE NO LONGER","NEEDED IN THIS TEMPORARY ASSIGNMENT, YOU WILL REVERT TO YOUR LAST PERMAN","LEVEL WHERE YOU WILL BE GRANTED ALL RIGHTS AND PRIVILEGES AS IF YOU HAD","NOT BEEN TEMPORARILY PROMOTED."," "," "," "," "]
[114,"N","1986-03-30","TOUR OF DUTY TWO YEARS (SUBJECT TO NEEDS OF SERVICE)."," "," "," "," "," "," "," "," "]
[115,"Y","1986-03-30","EMPLOYEE IS APPOINTED AS A CAREER-CANDIDATE ON A LIMITED APPOINTMENT","NTE @        @, OR NEED FOR SERVICES, OR CONVERSION TO CAREER APPOINTMEN","BASED ON THE FINAL DECISION OF A COMMISSIONING BOARD ESTABLISHED UNDER","THE FS ACT OF 1980, WHICHEVER IS SOONEST."," "," "," "," "," "]
[116,"N","1986-05-11","U.S. OPM SPECIAL TRAINING AGREEMENT, SSS:EDU 5-2, DATED AUGUST 12, 1988."," "," "," "," "," "," "," "," "]
["11C","N","1992-01-26","TRAVEL AND TRANSPORTATION AND OTHER RELOCATION ALLOWANCES ARE IN","THE INTEREST OF THE GOVERNMENT & AUTHORIZED AS PROVIDED BY","PARAGRAPH 5333.5 OF THE CUSTOMS SERVICE TRAVEL GUIDELINES.","THERE ARE CERTAIN EXCEPTIONS THAT REQUIRE SPECIFIC AUTHORIZATION AS","NOTED IN PARAGRAPH CITED. REFUND OF ALL EXPENSES WILL BE REQUIRED IF","THE INCUMBENT LEAVES THE FEDERAL SERVICE WITHIN 12 MONTHS OF THIS","ACTION, EXCEPT IN THE UNUSUAL CIRCUMSTANCES DEFINED IN THE ABOVE"," PARAGRAPH."," "]
["11F","N","1990-01-01","STATEMENT OF DUTIES ATTACHED TO EMPLOYEE COPY"," "," "," "," "," "," "," "," "]
["11I","N","1990-08-26","CONGRATULATIONS ON YOUR PROMOTION"," "," "," "," "," "," "," "," "]
["11J","N","1991-04-07","A DD-214 IS REQUIRED FOR VERIFICATION OF MILITARY SERVICE."," "," "," "," "," "," "," "," "]
["11P","N","1995-01-13","ACTION DOCUMENTS CHANGE IN WORK SCHEDULE CODING.  THERE IS NO CHANGE IN","CONDITIONS OF EMPLOYMENT."," "," "," "," "," "," "," "]
["12C","N","1992-01-26","RETIREMENT CLAIM                          ."," "," "," "," "," "," "," "," "]
["12F","N","1990-01-01","THIS NOTICE IS ISSUED FOR RECORD PURPOSES ONLY"," "," "," "," "," "," "," "," "]
["12I","N","1990-08-26","THANK YOU FOR YOUR SERVICE TO THE IRS"," "," "," "," "," "," "," "," "]
["12J","N","1991-04-07","SCD TO BE COMPLETED UPON RECEIPT OF DOCUMENTATION OF PRIOR CREDITABLE","FEDERAL SERVICE."," "," "," "," "," "," "," "]
["12P","N","2007-02-04","SPECIAL LEO BASE RATE UNDER PUBLIC LAW 101-509"," "," "," "," "," "," "," "," "]
["13C","N","1992-01-26","EMPLOYMENT SUBJECT TO FURLOUGH WHEN SERVICES ARE NOT REQUIRED."," "," "," "," "," "," "," "," "]
["13F","N","1990-01-01","RETROACTIVE DUE TO ADMINISTRATIVE OVERSIGHT"," "," "," "," "," "," "," "," "]
["13I","N","1990-08-26","TEMPORARY REASSIGNMENT NTE        .  UPON COMPLETION EMPLOYEE WILL RETUR","TO THEIR FORMER ORGANIZATION OF ASSIGNMENT"," "," "," "," "," "," "," "]
["13J","N","1991-04-07","NEXT ADMINISTRATIVE PAY INCREASE TO BE EFFECTIVE ONE FULL YEAR FROM","         UNLESS THERE IS RECOGNITION OF \"SLIPPAGE\"."," "," "," "," "," "," "," "]
["14C","N","1992-01-26","ADMINISTRATIVE FURLOUGH IS IN ACCORDANCE WITH CONDITIONS OF APPOINTMENT."," "," "," "," "," "," "," "," "]
["14F","N","1990-01-01","OFFICIAL POSITION DESCRIPTION ATTACHED TO EMPLOYEE COPY"," "," "," "," "," "," "," "," "]
["14I","N","1990-08-26","EMPLOYEE IS EXPECTED TO WORK 6 MONTHS OR MORE EACH YEAR"," "," "," "," "," "," "," "," "]
["14J","N","1991-04-07","EFFECTIVE DATE BASED ON RECOGNITION OF \"SLIPPAGE\"."," "," "," "," "," "," "," "," "]
[150,"N","1985-10-13","EFFECTIVE WITH THIS OVERSEAS ASSIGNMENT, YOUR ANNUAL LEAVE ACCRUAL","CATEGORY IS RAISED TO THE 360 CEILING."," "," "," "," "," "," "," "]
[151,"N","1985-10-13","SALARY INCLUDES PROFICIENCY INCREASE OF STEPS IN ACCORDANCE WITH 3 FAM","873.3."," "," "," "," "," "," "," "]
[152,"N","1985-10-13","UPON NEXT PROMOTION, SALARY MUST REFLECT       ADDITIONAL STEPS NOT","REFLECTED IN THIS LANGUAGE PROFICIENCY INCREASE."," "," "," "," "," "," "," "]
[153,"N","1985-10-13","APPOINTMENT BY THE PRESIDENT AS SECRETARY IN THE DIPLOMATIC SERVICE OF","THE USA."," "," "," "," "," "," "," "]
[154,"N","1985-10-13","APPOINTMENT BY THE PRESIDENT AS CONSULAR OFFICER IN THE DIPLOMATIC SERVI","OF THE USA."," "," "," "," "," "," "," "]
[155,"N","1985-10-13","APPOINTMENT BY THE PRESIDENT AS CONSULAR OFFICER AND SECRETARY IN THE","DIPLOMATIC SERVICE OF THE USA."," "," "," "," "," "," "," "]
[156,"N","1985-10-13","REEMPLOYMENT RIGHTS TO THE CAREER PERSONNEL CATEGORY WHICH CONVERTED TO","LIMITED FS.  CONVERTED FROM"," "," "," "," "," "," "," "]
[157,"N","1985-10-13","TOUR OF DUTY OF 18 MONTHS FOLLOWED BY HOME LEAVE AND TRANSFER (SUBJECT","TO NEEDS OF SERVICE)."," "," "," "," "," "," "," "]
[158,"N","1985-10-13","TOUR OF DUTY OF 2 YEARS FOLLOWED BY HOME LEAVE AND TRANSFER (SUBJECT TO","NEEDS OF SERVICE)."," "," "," "," "," "," "," "]
[159,"N","1985-10-13","TOUR OF DUTY OF 2 YEARS WITH ONE REST AND RECUPERATION TRIP DURING TOUR","(SUBJECT TO NEEDS OF SERVICE)."," "," "," "," "," "," "," "]
["15C","N","1992-01-26","YOU ARE SUBJECT TO CALL AS NEEDED."," "," "," "," "," "," "," "," "]
["15F","N","1990-01-01","THE INCUMBENT OF THIS POSITION IS INCLUDED IN THE FCC BARGAINING","UNIT-LABOR RELATIONS CODE"," "," "," "," "," "," "," "]
["15I","N","1990-08-26","NO PRE-SCHEDULED TOUR OF DUTY"," "," "," "," "," "," "," "," "]
["15J","N","1991-04-07","TRAVEL AND TRANSPORTATION EXPENSES WILL BE PAID BY THE GOVERNMENT","INCLUDING TRANSPORTATION OF HOUSEHOLD EFFECTS AND DEPENDENT FAMILY","MEMBERS."," "," "," "," "," "," "]
[160,"N","1985-10-13","TOUR OF DUTY IS 2 YEARS SUBJECT TO EXTENSION BASED ON PERFORMANCE REVIEW","BY THE FCS ASSIGNMENTS PANEL."," "," "," "," "," "," "," "]
[161,"N","1985-10-13","TOUR OF DUTY OF 4 YEARS WITH HOME LEAVE AFTER 2 YEARS (SUBJECT TO NEEDS","OF SERVICE)."," "," "," "," "," "," "," "]
[162,"N","1985-10-13","TOUR OF DUTY OF 4 YEARS (SUBJECT TO NEEDS OF SERVICE)."," "," "," "," "," "," "," "," "]
[163,"N","1985-10-13","TOUR OF DUTY OF 4 YEARS WITH HOME LEAVE AFTER 2 YEARS AND TWO REST AND","RECUPERATION TRIPS DURING TOUR (SUBJECT TO NEEDS OF SERVICE)."," "," "," "," "," "," "," "]
[164,"N","1985-10-13","TOUR OF DUTY OF 3 YEARS FOLLOWED BY HOME LEAVE AND TRANSFER (SUBJECT TO","NEEDS OF SERVICE)."," "," "," "," "," "," "," "]
[165,"N","1985-10-13","TOUR OF DUTY OF 3 YEARS WITH HOME LEAVE AFTER 18 MONTHS (SUBJECT TO NEED","OF SERVICE)."," "," "," "," "," "," "," "]
[166,"N","1985-10-13","TOUR OF DUTY OF 3 YEARS WITH TWO REST AND RECUPERATION TRIPS DURING TOUR","(SUBJECT TO NEEDS OF SERVICE)."," "," "," "," "," "," "," "]
[167,"N","1986-07-01","EMPLOYEE ELECTED AS A COUNTY COMMITTEE MEMBER"," "," "," "," "," "," "," "," "]
[168,"N","1986-07-01","EMPLOYEE DESIGNATED AS A COUNTY COMMITTEE MEMBER"," "," "," "," "," "," "," "," "]
[169,"N","1986-07-01","EMPLOYEE DESIGNATED AS AN ALTERNATE COUNTY COMMITTEE MEMBER"," "," "," "," "," "," "," "," "]
["16C","N","1992-01-26","        ISSUES."," "," "," "," "," "," "," "," "]
["16F","N","1990-01-01","THE INCUMBENT OF THIS POSITION IS EXCLUDED FROM THE FCC BARGAINING UNITS","FOR THE FOLLOWING REASON-CATEGORY                      LABOR RELATIONS","CODE"," "," "," "," "," "," "]
["16I","N","1990-08-26","APPOINTMENT ON A SEASONAL BASIS AS SERVICES ARE NEEDED"," "," "," "," "," "," "," "," "]
["16J","N","1991-04-07","THIS VACANCY HAS BEEN REVIEWED.  THE DUTIES CANNOT BE REASSIGNED AND","THE POSITION CANNOT BE ABOLISHED WITHOUT SERIOUSLY AFFECTING THE","EXECUTION OF ESSENTIAL FUNCTIONS."," "," "," "," "," "," "]
["17C","N","1992-01-26","THIS APPOINTMENT MAY BE TERMINATED AT ANY TIME IF YOUR SERVICES ARE","NO LONGER NEEDED OR FUNDS ARE NOT AVAILABLE."," "," "," "," "," "," "," "]
["17F","N","1990-01-01","THIS ACTION IS FOR PERSONNEL RECORD PURPOSES ONLY AND MAY NOT BE A LEGAL","NAME CHANGE UNDER STATE LAW. CONTACT YOUR LOCAL SOCIAL SECURITY ADMIN.","OFFICE TO REPORT NAME CHANGE. YOU MAY BE ELIGIBLE TO CHANGE YOUR","HEALTH BENEFITS AND LIFE INSURANCE COVERAGE. CHECK ANY DESIGNATIONS OF","BENEFICIARY YOU MAY HAVE FILED UNDER YOUR OLD NAME."," "," "," "," "]
["17I","N","1990-08-26","TOUR IS 8 HOURS A DAY, 5 DAYS A WEEK, UNTIL CHANGE TO NON-WORK STATUS"," "," "," "," "," "," "," "," "]
["17J","N","1991-04-07","AS THIS TRANSFER IS FOR YOUR PERSONAL CONVENIENCE, AND NOT TO MEET ANY","EMERGENCY IN THE SERVICE, YOUR TRANSPORTATION AND TRAVEL EXPENSES WILL","NOT BE PAID BY THE GOVERNMENT."," "," "," "," "," "," "]
["18C","N","1992-01-26","LIMITATIONS OF PREVIOUS APPOINTMENT REMOVED."," "," "," "," "," "," "," "," "]
["18F","N","1990-01-01","ELIGIBLE FOR HEALTH BENEFITS."," "," "," "," "," "," "," "," "]
["18I","N","1990-08-26","MOVING EXPENSES UNDER PL 89-516 ARE AUTHORIZED"," "," "," "," "," "," "," "," "]
["19C","N","1992-01-26","UPGRADING OF THIS POSITION RESULTS FROM THE INCUMBENT'S ACCRETION","OF HIGHER GRADE DUTIES AND RESPONSIBILITIES."," "," "," "," "," "," "," "]
["19I","N","1990-08-26","MOVING EXPENSES UNDER PL 89-516 ARE NOT AUTHORIZED"," "," "," "," "," "," "," "," "]
["1BC","N","2009-01-04","OPM RECENTLY CHANGED THE NUMBERING SYSTEM FOR COLLECTIVE BARGAINING","UNITS.  THIS NUMBER IS REFLECTED AS \"BARGAINING UNIT STATUS\" ON YOUR","PERSONNEL ACTION."," "," "," "," "," "," "]
["1CP","N","2014-07-27","THIS CERTIFIES THAT THE ABOVE APPLICANT MEETS THE QUALIFICATIONS FOR","APPOINTMENT TO POLICE RECRUIT CLASS        AS PRESCRIBED BY THE U.S.","CAPITOL POLICE BOARD."," "," "," "," "," "," "]
["1EP","N","1992-02-09","EMPLOYEE HAS SUCCESSFULLY COMPLETED THE       SIX MONTHS OF THE","                    TRAINING PROGRAM."," "," "," "," "," "," "," "]
["1SD","Y","2014-01-12","SALARY IN BLOCK 20 INCLUDES LAW ENFORCEMENT SPECIAL DIFFERENTIAL OF","$@          @."," "," "," "," "," "," "," "]
[200,"N","1980-01-01","YOUR FEHB DEDUCTION WILL NOT BE PRORATED, IN ACCORDANCE WITH THE PART-TI","EMPLOYMENT ACT OF 1978."," "," "," "," "," "," "," "]
[201,"N","2014-12-14","FOR THE PURPOSES OF THE AFFORDABLE HEALTH CARE ACT THIS EMPLOYEE IS A","FULL TIME EMPLOYEE AND ELIGIBLE TO ENROLL IN FEHB UNDER SECION 4980H OF","THE INTERNAL REVENUE CODE AND TREASURY REGULATIONS 79 FR 8544, DATED","2014-02-12"," "," "," "," "," "]
[202,"N","1983-12-12","COVERED BY SOCIAL SECURITY AND BY CIVIL SERVICE RETIREMENT AT THE SPECIA","DEDUCTION RATE OF 7 1/2 PERCENT"," "," "," "," "," "," "," "]
[203,"N","1985-03-01","STUDENT VOLUNTEER-EXPECTED TO WORK    HOURS PER WEEK."," "," "," "," "," "," "," "," "]
[204,"N","1985-03-01","STUDENT VOLUNTEER-WORKED      HOURS         THROUGH           ."," "," "," "," "," "," "," "," "]
[208,"Y","1983-01-09","CHANGE OF APPOINTING OFFICE. FORMER EMPLOYING OFFICE WAS @       @."," "," "," "," "," "," "," "," "]
[209,"N","1983-03-06","THIS IS A PRIMARY POSITION UNDER 5 CFR 831 SUBPART I - SPECIAL","RETIREMENT PROVISIONS FOR LAW ENFORCEMENT OFFICERS AND FIREFIGHTRS."," "," "," "," "," "," "," "]
["20C","N","1992-01-26","THIS ACTION REMOVES ELIGIBILITY FOR STANDBY DUTY."," "," "," "," "," "," "," "," "]
["20F","N","1990-01-01","APPOINTMENT AND RATE OF COMPENSATION APPROVED BY THE COMMISSIONER."," "," "," "," "," "," "," "," "]
["20I","N","1990-08-26","NOTIFICATION OF CHANGE IN TOUR OF DUTY WILL BE BY SF-50"," "," "," "," "," "," "," "," "]
["20J","N","1991-04-07","SERVICE CREDITABLE FROM         , COMPLETED 260 DAYS IN PAY STATUS","ENDING"," "," "," "," "," "," "," "]
[210,"N","1983-03-06","THIS IS A SECONDARY POSITION UNDER 5 CFR 831 SUBPART I - SPECIAL","RETIREMENT PROVISIONS FOR LAW ENFORCEMENT OFFICERS AND FIREFIGHTERS."," "," "," "," "," "," "," "]
[211,"N","1984-05-11","LWOP PENDING APPROVAL OF DISABILITY RETIREMENT APPLICATION."," "," "," "," "," "," "," "," "]
[215,"N","1985-03-01","APPOINTMENTS FOR MASTER'S DEGREE CANDIDATES MUST NOT EXCEED 3O MONTHS","FROM DATE OF ENTRANCE INTO GRADUATE SCHOOL."," "," "," "," "," "," "," "]
[216,"N","1985-03-01","APPOINTMENTS FOR DOCTORATE DEGREE CANDIDATES MUST NOT EXCEED 42 MONTHS","FROM DATE OF ENTRANCE INTO GRADUATE SCHOOL."," "," "," "," "," "," "," "]
[217,"N","1985-03-01","UNDER 5 U.S.C. 3111, STUDENT VOLUNTEER IS NOT A FEDERAL EMPLOYEE FOR ANY","PURPOSE OTHER THAN INJURY COMPENSATION AND LAWS RELATED TO THE TORT","CLAIMS ACT.  SERVICE IS NOT CREDITABLE FOR LEAVE ACCRUAL OR ANY OTHER","EMPLOYEE BENEFITS."," "," "," "," "," "]
[219,"N","1981-12-01","OCCUPANCY OF POSITION LIMITED TO RETURN OF FORMER INCUMBENT APPROXIMATEL"," "," "," "," "," "," "," "," "]
["21C","N","1992-01-26","THE AGENCY COUNSELOR OR DEPUTY COUNSELOR HAS REVIEWED A STATEMENT","OF EMPLOYMENT AND FINANCIAL INTERESTS AND HAS DETERMINED THAT NO","CONFLICT OF INTEREST EXISTS."," "," "," "," "," "," "]
["21I","N","1990-08-26","EMPLOYEE INFORMED IN ADVANCE OF REASONS/CONDITIONS OF THE PROMOTION"," "," "," "," "," "," "," "," "]
["21J","N","1991-04-07","INTERMITTENT-NO REGULAR TOUR OF DUTY DURING EACH ADMINISTRATIVE WORK","WEEK."," "," "," "," "," "," "," "]
[220,"N","1981-12-01","SF-85 NOT SUBMITTED BECAUSE EMPLOYEE WAS CLEARED ON PRIOR APPOINTMENT."," "," "," "," "," "," "," "," "]
[221,"N","1981-12-01","SF-86 NOT SUBMITTED BECAUSE"," "," "," "," "," "," "," "," "]
[226,"N","1981-12-01","SUBJECT TO SATISFACTORY RECORD CHECK AND INQUIRY UNDER EO 10450."," "," "," "," "," "," "," "," "]
[227,"N","1981-12-01","SUBJECT TO SATISFACTORY MEDICAL."," "," "," "," "," "," "," "," "]
[228,"N","1981-12-01","SATISFACTORY MEDICAL ON FILE."," "," "," "," "," "," "," "," "]
["22C","N","1992-01-26","     PREMIUM PAY FOR                          DUTY AUTHORIZED","COMPUTED ON THAT PART OF BASIC PAY WHICH DOES NOT EXCEED THE BASIC","PAY FOR GS-10, STEP 1 (5U.S.C. 5545)."," "," "," "," "," "," "]
["22I","N","1990-08-26","DOCUMENT 7107 GIVEN TO EMPLOYEE"," "," "," "," "," "," "," "," "]
["22J","N","1991-04-07","INCUMBENT WILL REVERT TO TENURE GROUP 1 UPON COMPLETION OF 1-YEAR","PROBATION PERIOD."," "," "," "," "," "," "," "]
[234,"N","1982-09-19","ACCRUED ANNUAL LEAVE TO BE RETAINED FOR USE AFTER RESTORATION TO DUTY."," "," "," "," "," "," "," "," "]
["23C","N","1992-01-26","YOU ARE HEREBY RETURNED TO DUTY IN A PAY STATUS FROM ADMINISTRATIVE","FURLOUGH."," "," "," "," "," "," "," "]
["23I","N","1990-08-26","SF-2810 ISSUED"," "," "," "," "," "," "," "," "]
["23J","N","1991-04-07","SF-2809/SF-2817 NOT ON FILE, EMPLOYEE RESIGNED PRIOR TO EXPIRATION OF","THE 31-DAY PERIOD."," "," "," "," "," "," "," "]
[247,"Y","1981-12-01","NAME WAS FORMERLY @                               @"," "," "," "," "," "," "," "," "]
["24C","N","1992-01-26","      ALLOWANCE           ."," "," "," "," "," "," "," "," "]
["24I","N","1990-08-26","LWOP WITHIN SEASON      HOURS"," "," "," "," "," "," "," "," "]
["24J","N","1991-04-07","WITHIN-GRADE INCREASE DUE          EXTENDED DUE TO     HOURS EXCESS","LWOP."," "," "," "," "," "," "," "]
[254,"Y","1981-12-01","THIS APPOINTMENT AS A MEMBER OF THE @        @ COMMITTEE WILL","AUTOMATICALLY TERMINATE ON @        @."," "," "," "," "," "," "," "]
[255,"Y","1981-12-01","ENTITLED TO $@     @ PER DAY IN LIEU OF TRAVEL AND SUBSISTENCE EXPENSES."," "," "," "," "," "," "," "," "]
[256,"N","1981-12-01","CONV TO TEMPORARY APPOINTMENT NEW COMMITTEE ESTABLISHED."," "," "," "," "," "," "," "," "]
["25C","N","1992-01-26","FWS WAGE SCHEDULE REVISED PURSUANT TO 5 U.S.C. 5343(A)(4)."," "," "," "," "," "," "," "," "]
["25I","N","1990-08-26","SEASON FROM          TO"," "," "," "," "," "," "," "," "]
["25J","N","1991-04-07","COMPENSATED UNDER FEDERAL EMPLOYEE COMPENSATION ACT."," "," "," "," "," "," "," "," "]
[268,"N","1981-12-01","ROTATIONAL ASSIGNMENT IN WASHINGTON,D.C.,NTE          TO SERVICE AS","                     ,WITHOUT REGARD TO CS REGS. AND WITH NO REDUCTION I","GRADE. (PL 89-106 AND DPM 930)."," "," "," "," "," "," "]
["26C","N","1992-01-26","ADDITIONAL ANNUAL PREMIUM PAY FOR ADMINISTRATIVELY UNCONTROLLABLE","OVERTIME           ."," "," "," "," "," "," "," "]
["26I","N","1990-08-26","LWOP MATERNITY (LESS THAN 30 DAYS)"," "," "," "," "," "," "," "," "]
["26J","N","1991-04-07","CONFIRMED BY SENATE."," "," "," "," "," "," "," "," "]
[273,"N","1981-12-01","APPOINTED WITHOUT COMPENSATION. WILL RECEIVE TRAVEL ALLOWANCE."," "," "," "," "," "," "," "," "]
[279,"N","1981-12-01","DECREASE IN SEASONAL WORK."," "," "," "," "," "," "," "," "]
["27C","N","1992-01-26","MEMBER OF                          STATE BAR."," "," "," "," "," "," "," "," "]
["27I","N","1990-08-26","LWOP EDUCATION (LESS THAN 30 DAYS)"," "," "," "," "," "," "," "," "]
["27J","N","1991-04-07","HONOR PROGRAM."," "," "," "," "," "," "," "," "]
[288,"N","2005-05-15","HR USE ONLY - RETRO PAYMENT AND/OR RE-VALIDATION SUPPRESSED."," "," "," "," "," "," "," "," "]
["28C","N","1992-01-26","YOUR STATUS AND TENURE IN FEDERAL SERVICE REMAIN UNCHANGED."," "," "," "," "," "," "," "," "]
["28I","N","1990-08-26","LWOP ILLNESS (LESS THAN 30 DAYS)"," "," "," "," "," "," "," "," "]
["28J","N","1991-04-07","NAME CHANGE DUE TO MARRIAGE."," "," "," "," "," "," "," "," "]
[290,"N","1990-06-17","RESEARCH SCIENTIST HAS COMPLETED 3-YEAR EXTENDED PROBATIONARY PERIOD UND","THE USDA DEMONSTRATION PROJECT"," "," "," "," "," "," "," "]
[291,"N","1990-06-17","LUMP SUM CASH PAYMENT AUTHORIZED UNDER THE USDA DEMONSTRATION PROJECT"," "," "," "," "," "," "," "," "]
[292,"N","1990-06-17","DEFERRED CASH PAYMENT AUTHORIZED UNDER THE USDA DEMONSTRATION PROJECT"," "," "," "," "," "," "," "," "]
[293,"N","1990-06-17","INCREMENTAL CASH PAYMENT AUTHORIZED UNDER THE USDA DEMONSTRATION PROJECT"," "," "," "," "," "," "," "," "]
[294,"Y","1990-06-17","SUBJECT TO A 3-YEAR EXTENDED PROBATIONARY PERIOD BEGINNING @________@","AS PART OF A DEMONSTRATION PROJECT ESTABLISHED UNDER 5 U.S.C. 4703."," "," "," "," "," "," "," "]
[295,"N","1990-08-26","INITIAL APPOINTMENT PROBATIONARY PERIOD COMPLETED (LAST DAY EMPLOYEE","SERVES IN A DEMONSTRATION PROJECT POSITION)."," "," "," "," "," "," "," "]
[296,"N","1990-08-26","INITIAL APPOINTMENT PROBATIONARY PERIOD COMPLETED."," "," "," "," "," "," "," "," "]
["29C","N","1992-01-26","ORDERS RECEIVED TO REPORT TO","              ON       ."," "," "," "," "," "," "," "]
["29I","N","1990-08-26","LWOP MATERNITY (MORE THAN 30 DAYS)"," "," "," "," "," "," "," "," "]
["29J","N","1991-04-07","NAME CHANGE DUE TO DIVORCE."," "," "," "," "," "," "," "," "]
["2CP","N","2014-07-27","THIS OFFICER HAS SATISFACTORILY COMPLETED THE COURSE IN POLICE","PROCEDURES AS PRESCRIBED BY THE U.S. CAPITOL POLICE BOARD, AND IS","THEREFORE ENTITLED TO ADDITIONAL COMPENSATION AS PROVIDED BY PUBLIC LAW","90-147."," "," "," "," "," "]
["2EP","N","1992-02-09","EMPLOYEE HAS SUCCESSFULLY COMPLETED THE      YEAR OF THE","                    TRAINING PROGRAM."," "," "," "," "," "," "," "]
[303,"N","1985-03-01","THE ACTION IS IN ACCORDANCE WITH THE APPRENTICESHIP AGREEMENT."," "," "," "," "," "," "," "," "]
[304,"N","1985-03-01","EMPLOYEE INFORMED IN ADVANCE OF THE REASONS AND THE CONDITIONS OF","APPOINTMENT UNDER THE PRESIDENTIAL MANAGEMENT INTERN PROGRAM."," "," "," "," "," "," "," "]
[307,"N","1983-01-01","AD 343 TO ESTABLISH SF2806 HISTORY SENT UNDER REQUEST (    )."," "," "," "," "," "," "," "," "]
[308,"N","1983-12-01","EMPLOYEE HAS AUTHORIZED DEDUCTIONS FOR MILITARY SERVICE DEPOSITS."," "," "," "," "," "," "," "," "]
[309,"N","1981-12-01","ACCEPTED ASC COUNTY EMPLOYMENT WITHOUT A BREAK IN SERVICE. ELIGIBLE TO","TRANSFER LEAVE (5 USC 6308)."," "," "," "," "," "," "," "]
["30C","N","1992-01-26","THIS APPOINTMENT IS SUBJECT TO CERTAIN STATUTORY RESTRICTIONS RELATING","TO CONFLICT OF INTEREST.  COPY OF DEPARTMENTAL REGULATIONS WERE PRE-","VIOUSLY FURNISHED CONCERNING EMPLOYEE RESPONSIBILITY AND CONDUCT."," "," "," "," "," "," "]
["30G","N","1989-04-23","INSUBORDINATION (DELIBERATE AND WILLFUL REFUSAL TO PERFORM ASSIGNED WORK","INSOLENCE (FLAGRANT AND CONTEMPTUOUS DISRESPECT)."," "," "," "," "," "," "," "]
["30I","N","1990-08-26","LWOP EDUCATION (MORE THAN 30 DAYS)"," "," "," "," "," "," "," "," "]
["30J","N","1991-04-07","EMPLOYEE RECEIVED MILITARY COLA OF $          THIS YEAR."," "," "," "," "," "," "," "," "]
["30V","Y","2016-11-05","EMPLOYEE IS ENTITLED TO DISABLED VETERANS LEAVE,  THE CURRENT BALANCE   ","IS @     @ AS OF @     @.  EMPLOYEE'S BEGINNING DATE OF ENTITLEMENT FOR ","DISABLED VETERANS LEAVE IS @     @.                                     ","                                                                       ","                                                                       ","                                                                       ","                                                            "," "," "]
[314,"N","1981-12-01","CONV TO TEMPORARY APPOINTMENT NEW COMMITTEE ESTABLISHED"," "," "," "," "," "," "," "," "]
["31C","N","1992-01-26","YOU WILL CONTINUE TO BE SUBJECT TO CETAIN STATUTORY RESTRICTIONS RELATIN","TO CONFLICT OF INTEREST.  COPY OF DEPARTMENTAL REGULATIONS WERE","PREVIOUSLY FURNISHED CONCERNING EMPLOYEE RESPONSIBILITY AND CONDUCT."," "," "," "," "," "," "]
["31G","N","1989-04-23","FIGHTING ON DUTY OR ON GALLERY PREMISES."," "," "," "," "," "," "," "," "]
["31I","N","1990-08-26","LWOP ILLNESS (MORE THAN 30 DAYS)"," "," "," "," "," "," "," "," "]
["31J","N","1991-04-07","YOUR SERVICE TO THE DEPARTMENT OF JUSTICE HAS BEEN APPRECIATED."," "," "," "," "," "," "," "," "]
[328,"N","1981-12-01","TERMINATION OF APPOINTMENT BECAUSE OF ESTABLISHMENT OF A NEW COMMITTEE."," "," "," "," "," "," "," "," "]
["32C","N","1992-01-26","                 MERIT PROMOTION PLAN."," "," "," "," "," "," "," "," "]
["32G","N","1989-04-23","DRINKING OR POSSESSION OF INTOXICANTS WHILE ON DUTY."," "," "," "," "," "," "," "," "]
["32I","N","1990-08-26","NON-COMPETITITVE ACTION"," "," "," "," "," "," "," "," "]
["32J","N","1991-04-07","AUTHORITY IS 28 USC 548."," "," "," "," "," "," "," "," "]
["33C","N","1992-01-26","PAYMENT WILL BE MADE FOR EACH DAY OR FRACTION OF A DAY THAT YOUR SERVICE","ARE UTILIZED."," "," "," "," "," "," "," "]
["33G","N","1989-04-23","REPORTING FOR DUTY UNDER THE INFLUENCE OF INTOXICANTS TO A DEGREE WHICH","WOULD INTERFERE WITH THE PROPER PERFORMANCE OF DUTY, BE A MENACE TO SAFE","OR BE PREJUDICIAL TO THE MAINTENANCE OF DISCIPLINE AND MORALE AMONG FELL","WORKERS."," "," "," "," "," "]
["33I","N","1990-08-26","FROM APPROVED LWOP SINCE"," "," "," "," "," "," "," "," "]
["33J","N","1991-04-07","AUTHORITY IS 28 USC 542."," "," "," "," "," "," "," "," "]
["34C","N","1992-01-26","LAST PAID AT NIGHT SHIFT RATE OF          P.H."," "," "," "," "," "," "," "," "]
["34G","N","1989-04-23","SELLING OR DISTRIBUTING NARCOTICS"," "," "," "," "," "," "," "," "]
["34I","N","1990-08-26","CAREER LADDER PROMOTION (GS-9 AND ABOVE)"," "," "," "," "," "," "," "," "]
["34J","N","1991-04-07","THIS TERMINATES PREVIOUS TEMPORARY APPOINTMENT."," "," "," "," "," "," "," "," "]
[354,"Y","1981-12-01","THIS APPOINTMENT AS A MEMBER OF THE @        @ COMMITTEE IS HEREBY","TERMINATED."," "," "," "," "," "," "," "]
["35C","N","1992-01-26","EXCEPTION TO THE COMPETITIVE PROCEDURES OF THE CUSTOMS MERIT PROMOTION","PLAN."," "," "," "," "," "," "," "]
["35G","N","1989-04-23","POSSESSING, CONSUMING OR REPORTING FOR DUTY UNDER THE INFLUENCE OF","NARCOTICS."," "," "," "," "," "," "," "]
["35I","N","1990-08-26","CAREER LADDER PROMOTION (GS-7 AND BELOW)"," "," "," "," "," "," "," "," "]
["35J","N","1991-04-07","THIS ACTION IS AN EXCEPTION TO MERIT PROMOTION PROCEDURES."," "," "," "," "," "," "," "," "]
["36C","N","1992-01-26","RETROACTIVE PROMOTION IN ACCORDANCE WITH ARTICLE 17, SECTION 13 OF THE","NATIONAL AGREEMENT BETWEEN NTEU AND U.S. CUSTOMS SERVICE."," "," "," "," "," "," "," "]
["36G","N","1989-04-23","IMMORAL OR INDECENT ACTS, ON THE JOB. MISCONDUCT OFF THE JOB WHICH IS","PREJUDICIAL TO THE IMAGE OR REPUTATION OF THE GALLERY OR THE GOVERNMENT."," "," "," "," "," "," "," "]
["36I","N","1990-08-26","LAST DATE SEPARATING EMPLOYEE WILL BE CARRIED ON THE ROLLS"," "," "," "," "," "," "," "," "]
["36J","N","1991-04-07","MILITARY RETIRED PAY WAIVED, CERTIFICATION ATTACHED."," "," "," "," "," "," "," "," "]
["37A","N","2009-01-28","ASSIGNMENT TO THE PUBLIC HEALTH HUMAN RESOURCES SYSTEM (PHHRS) AUTHORIZE","BY CHAPTER 47 OF 5 U.S.C. AS PUBLISHED IN FEDERAL REGISTER VOL. 74, NO.","17, DATED 01/28/09."," "," "," "," "," "," "]
["37B","N","2009-01-28","MOVEMENT OUT OF THE PUBLIC HEALTH HUMAN RESOURCES SYSTEM (PHHRS)","AUTHORIZED BY CHAPTER 47 OF 5 U.S.C. AS PUBLISHED IN FEDERAL REGISTER","VOL. 74, NO. 17, DATED 01/28/09."," "," "," "," "," "," "]
["37C","N","1992-01-26","EMPLOYEE IS AUTHORIZED      % PREMIUM PAY."," "," "," "," "," "," "," "," "]
["37D","N","2009-01-28","CAREER LADDER PROMOTION UNDER PHHRS."," "," "," "," "," "," "," "," "]
["37E","N","2009-01-28","EMPLOYEE RETAINS ELIGIBILITY FOR THE BENEFITS ASSOCIATED WITH THE CAREER","LADDER \"GRANDFATHER\" PROVISION UNDER PHHRS."," "," "," "," "," "," "," "]
["37F","N","1991-08-11","THE DUTY STATION LISTED IN BLOCK 39 MAY NOT REPRESENT THE OFFICIAL DUTY","STATION AND MAY ONLY REFER TO THE CLOSEST IDENTIFIABLE TOWN OR CITY.","REFER TO LOCAL ASSIGNMENT DOCUMENTATION FOR THE PRIMARY DUTY LOCATION","AND GEOGRAPHICAL LIMITS OF THE OFFICIAL DUTY STATION."," "," "," "," "," "]
["37G","N","1989-04-23","PROMOTION OF GAMBLING."," "," "," "," "," "," "," "," "]
["37H","N","2009-01-28","PAY ADJUSTMENT MADE UNDER PHHRS CAREER LADDER \"GRANDFATHER\" PROVISION."," "," "," "," "," "," "," "," "]
["37I","N","1990-08-26","LUMP SUM PAYMENT WILL NOT BE MADE FOR ALL ANNUAL LEAVE TO YOUR CREDIT AS","OF THE EFFECTIVE DATE OF YOUR SEPARATION"," "," "," "," "," "," "," "]
["37J","N","1991-04-07","SALARY BASED ON RETAINED PAY PLAN, GRADE, STEP OF"," "," "," "," "," "," "," "," "]
["37K","N","2009-01-28","EMPLOYEE NO LONGER COVERED BY THE CAREER LADDER \"GRANDFATHER\" PROVISION","UNDER PHHRS."," "," "," "," "," "," "," "]
["37L","N","2009-01-28","PROMOTION INCREASE EXCEEDS NORMAL PROMOTION PAY INCREASE AUTHORIZED UNDE","PHHRS."," "," "," "," "," "," "," "]
["37M","N","2009-01-28","EMPLOYEE ON PAY RETENTION ENTITLED TO 50% RATE RANGE ADJUSTMENT UNDER","PHHRS."," "," "," "," "," "," "," "]
["37N","N","2009-01-28","EMPLOYEE ON ENHANCED PAY RETENTION ENTITLED TO 100% RATE RANGE ADJUSTMEN","UNDER PHHRS."," "," "," "," "," "," "," "]
["37O","N","2009-01-28","ENHANCED PAY RETENTION HAS EXPIRED."," "," "," "," "," "," "," "," "]
["37P","N","2009-01-28","NO LONGER ELIGIBLE FOR UPPER RANGE EXTENSION - ELIGIBLE FOR PAY RETENTIO"," "," "," "," "," "," "," "," "]
["37Q","N","2009-01-28","PAY ADJUSTMENT UNDER PHHRS AS AUTHORIZED BY CHAPTER 47 OF 5 U.S.C. AS","PUBLISHED IN FEDERAL REGISTER VOL. 74, NO. 17, DATED 01/28/09."," "," "," "," "," "," "," "]
["37R","N","2009-01-28","DEVELOPMENTAL PAY INCREASE (DPI) UNDER PHHRS (INCREASE NOT TO EXCEED 7%","BASIC PAY)."," "," "," "," "," "," "," "]
["37S","N","2009-01-28","WGI BUY-IN UNDER PHHRS."," "," "," "," "," "," "," "," "]
["37T","N","2009-01-28","UPPER RANGE EXTENSION (ABOVE BAND PAY ADJUSTMENT) UNDER PHHRS."," "," "," "," "," "," "," "," "]
["37U","N","2009-01-28","LOWER RANGE EXTENSION (BELOW BAND PAY ADJUSTMENT) UNDER PHHRS."," "," "," "," "," "," "," "," "]
["37V","N","2009-01-28","SALARY CHANGE INCLUDES PHHRS PERFORMANCE PAY INCREASE."," "," "," "," "," "," "," "," "]
["37W","N","2009-01-28","PAY ADJUSTMENT (LESS THAN FULLY SUCCESSFUL) UNDER PHHRS AS AUTHORZED BY","CHAPTER 47 OF 5 U.S.C. AS PUBLISHED IN FEDERAL REGISTER VOL. 74, NO. 17,","DATED 01/28/09."," "," "," "," "," "," "]
["37X","N","2009-01-28","RATING BASED LUMP SUM PERFORMANCE PAYMENT (BONUS) UNDER PHHRS, DUE TO","RANGE MAXIMUM, IN ADDITION TO PAY ADJUSTMENT."," "," "," "," "," "," "," "]
["37Y","N","2009-01-28","RATING BASED LUMP SUM PERFORMANCE PAYMENT (BONUS) UNDER PHHRS, IN LIEU O","PAY ADJUSTMENT."," "," "," "," "," "," "," "]
["37Z","N","2009-01-28","PAY POOL MODAL RATING USED TO DETERMINE PHHRS PERFORMANCE PAY INCREASE."," "," "," "," "," "," "," "," "]
[380,"N","1988-06-19","TERMINATE FDIC HEALTH PLAN ENROLLMENT."," "," "," "," "," "," "," "," "]
[381,"N","1988-06-19","TRANSFER FDIC HEALTH PLAN ENROLLMENT TO THE CARRIER."," "," "," "," "," "," "," "," "]
[383,"N","1981-12-01","CONV TO TEMPORARY APPOINTMENT NEW COMMITTEE ESTABLISHED"," "," "," "," "," "," "," "," "]
[385,"N","2011-07-17","THIS ACTION IS THE RESULT OF AN AUTOMATIC SYSTEM UPDATE.  BECAUSE YOU","FAILED TO MAKE A HEALTH PLAN ELECTION WITHIN 60 DAYS OF BEING ELIGIBLE,","YOUR RIGHT TO DO SO HAS BEEN WAIVED UNTIL THE NEXT OPEN SEASON, OR YOU","HAVE A QUALIFYING LIFE EVENT.  PLEASE CONTACT YOUR HUMAN RESOURCES","OFFICE IF YOU HAVE ANY QUESTIONS."," "," "," "," "]
[388,"N","1981-12-01","TERMINATE FEHB ENROLLMENT."," "," "," "," "," "," "," "," "]
[389,"N","1979-12-01","TRANSFER FEHB ENROLLMENT TO OPM."," "," "," "," "," "," "," "," "]
["38C","N","1992-01-26","EMPLOYEE INFORMED IN ADVANCE OF REASON FOR AND THE CONDITIONS OF THE","PROMOTION."," "," "," "," "," "," "," "]
["38G","N","1989-04-23","GAMBLING WHILE ON DUTY OR ON PREMISES."," "," "," "," "," "," "," "," "]
["38I","N","1990-08-26","TEMPORARY REASSIGNMENT NTE"," "," "," "," "," "," "," "," "]
["38J","N","1991-04-07","SERVICE YEAR BEGINNING DATE CHANGED TO         ."," "," "," "," "," "," "," "," "]
["38W","N","2016-11-27","SERVICING RESPONSIBILITY TRANSFERRED TO THE NFC - POI 3060."," "," "," "," "," "," "," "," "]
[390,"N","1990-01-14","TRANSFER FEHB TO DC RETIREMENT SYSTEM."," "," "," "," "," "," "," "," "]
[391,"N","1995-12-10","TRANSFER COVA RETIREMENT TO ANNUITY SYSTEM"," "," "," "," "," "," "," "," "]
[392,"N","1997-01-06","EMPLOYEE TERMINATED FEHB ENROLLMENT"," - NONPAY STATUS OR INSUFFICIENT PAY STATUS"," "," "," "," "," "," "," "]
[393,"N","1997-01-06","TERMINATED FEHB ENROLLMENT/5 CFR 890.502B(3)AND(5)",{"$f":"- EMPLOYEE FAILED TO RESPOND TO WRITTEN NOTICE DURING A PERIOD OF NONPAY","v":{"$error":"#NAME?"}},"  STATUS OR INSUFFICIENT PAY STATUS"," "," "," "," "," "," "]
[398,"N","1981-12-01","SF-8 FURNISHED."," "," "," "," "," "," "," "," "]
["39C","N","1992-01-26","ACTION EFFECTED TO CHANGE A FEDERAL JUNIOR FELLOWSHIP PARTICIPANT TO","A TEMPORARY APPOINTMENT DURING A STUDY PERIOD."," "," "," "," "," "," "," "]
["39G","N","1989-04-23","FAILURE TO CARRY OUT SPECIFIC VERBAL OR WRITTEN ORDERS OR TO OBSERVE","REGULATIONS PRESCRIBED BY COMPETENT AUTHORITY:","               SAFETY OF PERSONS OR PROPERTY ENDANGERED"," "," "," "," "," "," "]
["39I","N","1990-08-26","SUBJECT TO DRUG SCREENING"," "," "," "," "," "," "," "," "]
["39J","N","1991-04-07","SERVICE YEAR EARNINGS LIMITATION IS $"," "," "," "," "," "," "," "," "]
["3CP","N","2014-07-27","THIS CERTIFIES THAT THE ABOVE OFFICER COMPLETED 30 MONTHS OF","SATISFACTORY SERVICE WITH THE U.S. CAPITOL POLICE, AND IS THEREFORE","ENTITLED TO THE RATING OF PRIVATE FIRST CLASS WITH ADDITIONAL","COMPENSATION AS PROVIDED BY PUBLIC LAW 94-440."," "," "," "," "," "]
[401,"N","1981-12-01","UNDESIRABLE DUTY HOURS."," "," "," "," "," "," "," "," "]
[402,"N","1981-12-01","TOO MUCH JOB PRESSURE."," "," "," "," "," "," "," "," "]
[403,"N","1981-12-01","WORK TOO HARD."," "," "," "," "," "," "," "," "]
[404,"N","1981-12-01","TOO MUCH TRAVEL."," "," "," "," "," "," "," "," "]
[405,"N","1981-12-01","POOR PHYSICAL ENVIRONMENT."," "," "," "," "," "," "," "," "]
[406,"N","1981-12-01","JOB LOCATION TOO FAR FROM RESIDENCE OR TRANSPORTATION INADEQUATE."," "," "," "," "," "," "," "," "]
[407,"N","1981-12-01","DISSATISIFIED WITH AMOUNT OF OVERTIME WORK."," "," "," "," "," "," "," "," "]
[408,"N","1981-12-01","ACCEPTED ASC COUNTY EMPLOYMENT WITHOUT BREAK IN SERVICE. ELIGIBLE TO","TRANSFER LEAVE (5 USC 6308)."," "," "," "," "," "," "," "]
[409,"N","1981-12-01","ACCEPTED EMPLOYMENT IN ANOTHER FEDERAL AGENCY."," "," "," "," "," "," "," "," "]
["40C","N","1992-01-26","POSITION RENUMBERED WITHOUT CHANGE TO DUTIES AND RESPONSIBILITIES."," "," "," "," "," "," "," "," "]
["40G","N","1989-04-23","FAILURE TO CARRY OUT SPECIFIC VERBAL OR WRITTEN ORDERS OR TO OBSERVE","REGULATIONS PRESCRIBED BY COMPETENT AUTHORITY:","               SAFETY OF PERSONS OR PROPERTY NOT ENDANGERED"," "," "," "," "," "," "]
["40I","N","1990-08-26","POSITION FILLED UNDER VA#                        , DATED         , BELOW","FULL PERFORMANCE LEVEL.  PROMOTION THROUGH GS-   MAY BE MADE WITHOUT","FURTHER COMPETITION PROVIDED ADMINISTRATIVE, QUALIFICATION, AND TIME-IN-","GRADE REQUIRMENTS ARE MET; THE ABILITY TO WORK AT THE HIGHER LEVEL HAS","BEEN DEMONSTRATED, AND THERE IS HIGHER LEVEL WORK PERFORMED"," "," "," "," "]
["40J","N","1991-04-07","UNDER FPM LTR 831-80, DATED 02/23/84, SURVIVORS OF DECEASED EMPLOYEES","MAY MAKE, OR COMPLETE A DEPOSIT FOR THE EMPLOYEE'S POST-1956 MILITARY","SERVICE IN ONE LUMP SUM.  TO COMPLETE THE EMPLOYEE'S SERVICE CREDIT","DEPOSIT INITIATED WITH THIS AGENCY, THE UNPAID BALANCE OF $","MUST BE REMITTED TO THIS AGENCY NOT LATER THAN          (DATE OF DEATH","PLUS 76 DAYS).  OPM WILL NOT DELAY FINAL ADJUDICATION OF SURVIVOR","ANNUITY LONGER THAN 90 DAYS."," "," "]
[410,"N","1981-12-01","ACCEPTED EMPLOYMENT IN STATE OR LOCAL GOVERNMENT."," "," "," "," "," "," "," "," "]
[411,"N","1981-12-01","INSUFFICIENT CHALLENGE."," "," "," "," "," "," "," "," "]
[412,"N","1981-12-01","INSUFFICIENT PRESTIGE."," "," "," "," "," "," "," "," "]
[413,"N","1981-12-01","SKILLS NOT SUFFICIENTLY UTILIZED."," "," "," "," "," "," "," "," "]
[414,"N","1981-12-01","DO NOT LIKE OR NOT SUITED TO KIND OF WORK."," "," "," "," "," "," "," "," "]
[415,"N","1981-12-01","JOB NOT IN LINE WITH CAREER PLANS."," "," "," "," "," "," "," "," "]
[416,"N","1981-12-01","NOT ENOUGH RECOGNITION FOR ACCOMPLISHMENTS."," "," "," "," "," "," "," "," "]
[417,"N","1981-12-01","ACCEPTED EMPLOYMENT IN PRIVATE ENTERPRISE."," "," "," "," "," "," "," "," "]
[418,"N","1981-12-01","SEEKING OTHER EMPLOYMENT."," "," "," "," "," "," "," "," "]
[419,"N","1981-12-01","ASSUMING HOUSEHOLD DUTIES."," "," "," "," "," "," "," "," "]
["41C","N","1992-01-26","SATISFACTORILY COMPLETED FULL FIELD INVESTIGATION."," "," "," "," "," "," "," "," "]
["41G","N","1989-04-23","FAILING TO CARRY OUT REGULARLY ASSIGNED DUTIES, INCLUDING FAILURE OR","LATENESS IN MAKING ASSIGNED PATROLS, ETC."," "," "," "," "," "," "," "]
["41I","N","1990-08-26","POSITION FILLED UNDER VA#                         , DATED         .","TEMPORARY PROMOTION MAY BE MADE WITHOUT FURTHER COMPETITION OR EXTENDED","NTE   YEARS"," "," "," "," "," "," "]
["41J","N","1991-04-07","FISCAL YEAR      PERFORMANCE MANAGEMENT AND RECOGNITION SYSTEM (PMRS)","PERFORMANCE AWARD OF $"," "," "," "," "," "," "," "]
[421,"N","1981-12-01","WISH TO MOVE TO DIFFERENT AREA FOR PERSONAL REASONS."," "," "," "," "," "," "," "," "]
["42C","N","1992-01-26","MERIT PAY CASH AWARD BASED ON PERFORMANCE."," "," "," "," "," "," "," "," "]
["42G","N","1989-04-23","CREATING A PUBLIC DISTURBANCE; RUDENESS OR USE OF THREATENING LANGUAGE T","OTHER PERSONS."," "," "," "," "," "," "," "]
["42I","N","1990-08-26","INELIGIBLE FOR WITHIN-GRADE INCREASE"," "," "," "," "," "," "," "," "]
["42J","N","1991-04-07","NEW DUTY STATION.  IS               CORRECT STATE FOR WITHHOLDING TAXES?","IF NOT, NOTIFY PERSONNEL OFFICE IMMEDIATELY."," "," "," "," "," "," "," "]
[431,"N","1981-12-01","NOT ENOUGH PAY."," "," "," "," "," "," "," "," "]
[432,"N","1981-12-01","NOT ENOUGH FRINGE BENEFITS."," "," "," "," "," "," "," "," "]
[433,"N","1981-12-01","NOT ENOUGH PROMOTIONAL OPPORTUNITY."," "," "," "," "," "," "," "," "]
[434,"N","1981-12-01","LACK OF JOB SECURITY."," "," "," "," "," "," "," "," "]
["43C","N","1992-01-26","PER POLICY STATEMENT 3120-05 DATED 6/3/86, THE MAXIMUM PERIOD OF THIS","ASSIGNMENT IS 5 YEARS (AN INITIAL 2 YEAR ASSIGNMENT WITH A POSSIBLE","2 YEAR EXTENSION AND A 1 YEAR EXTENSION FOR EXTENUATING CIRCUMSTANCES)."," "," "," "," "," "," "]
["43G","N","1989-04-23","ABANDONING POST OF DUTY WITHOUT PROPER AUTHORIZATION."," "," "," "," "," "," "," "," "]
["43J","N","1991-04-07","NEW STATE TAX CODE.  IS               CORRECT STATE FOR WITHHOLDING","TAXES?  IF NOT, NOTIFY PERSONNEL OFFICE IMMEDIATELY."," "," "," "," "," "," "," "]
[441,"N","1981-12-01","PERSONAL ILLNESS."," "," "," "," "," "," "," "," "]
[442,"N","1981-12-01","PHYSICAL DISABILITY OTHER THAN RETIREMENT DISABILITY."," "," "," "," "," "," "," "," "]
[443,"N","1981-12-01","PSYCHOLOGICAL OR NERVOUS DISORDERS."," "," "," "," "," "," "," "," "]
[444,"N","1981-12-01","PREGNANCY."," "," "," "," "," "," "," "," "]
["44C","N","1992-01-26","EMPLOYEE ACQUIRED COMPETITIVE STATUS UPON CONVERSION."," "," "," "," "," "," "," "," "]
["44G","N","1989-04-23","ABANDONING POST OF DUTY WITHOUT PROPER AUTHORIZATION (WHERE SAFETY OF","PROPERTY OR PERSONS IS ENDANGERED)."," "," "," "," "," "," "," "]
["44J","N","1991-04-07","CORRECTION IS RETROACTIVE TO APPOINTMENT DATE OF"," "," "," "," "," "," "," "," "]
[451,"N","1981-12-01","DO NOT GET ALONG WITH FELLOW WORKERS."," "," "," "," "," "," "," "," "]
[452,"N","1981-12-01","DO NOT GET ALONG WITH SUPERVISOR."," "," "," "," "," "," "," "," "]
[453,"N","1981-12-01","FAVORITISM IN ASSIGNMENT, PROMOTIONS, ETC."," "," "," "," "," "," "," "," "]
[454,"N","1981-12-01","DISCRIMINATION BECAUSE OF RACE, COLOR, OR NATIONAL ORIGIN."," "," "," "," "," "," "," "," "]
[455,"N","1981-12-01","DISCRIMINATION BECAUSE OF RELIGION."," "," "," "," "," "," "," "," "]
[456,"N","1981-12-01","DISCRIMINATION BECAUSE OF SEX."," "," "," "," "," "," "," "," "]
[457,"N","1981-12-01","DISCRIMINATION BECAUSE OF AGE."," "," "," "," "," "," "," "," "]
["45C","N","1992-01-26","RETURN RIGHTS ARE AS SPECIFIED IN THE NEGOTIATED AGREEMENT, ARTICLE 20,","SECTION 18/19: WITHIN 120 DAYS PRIOR TO THE COMPLETION OF THIS TOUR","OF DUTY AT A CUSTOMS PRECLEARENCE STATION, THE EMPLOYEE WILL SUBMIT A","PRIORITIZED LIST OF AT LEAST 2, UP TO 3 DISTRICTS WITHIN HIS ORIGINAL","REGION AND ONE ADDITIONAL DISTRICT OUTSIDE HIS ORIGINAL REGION TO WHICH","HE PREFERS TO BE REASSIGNED. ABSENT JUST CAUSE, THE EMPLOYEE WILL BE","REASSIGNED TO AN EQUIVALENT VACANCY IN ONE OF THE DESIGNATED DISTRICTS.","YEE HAS RETURN RIGHTS TO SAME/SIMILAR POSITION AT THE SAME GRADE LEVE  H"," HELD PRIOR TO THIS TEMPORARY ASSIGNMENT"]
["45G","N","1989-04-23","RECURRING TARDINESS: BEING LATE FOR WORK (UP TO 30 MINUTES) WITHOUT","ADEQUATE JUSTIFICATION. A PENALTY ACTION MAY BE IMPOSED WHENEVER 3","UNEXCUSED TARDINESSES OCCUR WITHIN A PERIOD OF 2 MONTHS OR LESS."," "," "," "," "," "," "]
["45I","N","1990-08-26","SEPARATION SF-2819 AND SF-2821 PROVIDED TO EMPLOYEE"," "," "," "," "," "," "," "," "]
["45J","N","1991-04-07","CHANGE IS RETROACTIVE TO APPOINTMENT OF"," "," "," "," "," "," "," "," "]
[461,"N","1981-12-01","MARRIAGE."," "," "," "," "," "," "," "," "]
[462,"N","1981-12-01","CHILDREN REQUIRE FULL-TIME ATTENTION."," "," "," "," "," "," "," "," "]
[463,"N","1981-12-01","ILLNESS IN FAMILY."," "," "," "," "," "," "," "," "]
["46C","N","1992-01-26","SATISFACTORILY COMPLETED DRUG SCREENING."," "," "," "," "," "," "," "," "]
["46G","N","1989-04-23","ABSENCE FROM DUTY FOR ONE DAY OR LESS WITHOUT PERMISSION AND WITHOUT","ADEQUATE JUSTIFICATION. INCLUDES TARDINESS OF MORE THAN 30 MINUTES AND","LEAVING THE JOB WITHOUT PERMISSION."," "," "," "," "," "," "]
["46I","N","1990-08-26","SEPARATION SF-293 PROVIDED TO EMPLOYEE"," "," "," "," "," "," "," "," "]
["46J","N","2018-03-18","OPF IS MAINTAINED BY: DOJ EOUSA, 3 CON BUILDING, 7TH FLOOR, WASH, DC ",20530,"                                                                        ","                                                                       ","                                                                       ","                                                                      ","                                                            "," "," "]
[471,"N","1981-12-01","TO FURTHER EDUCATION."," "," "," "," "," "," "," "," "]
[472,"N","1981-12-01","OPPORTUNITY FOR MORE ON-THE-JOB TRAINING."," "," "," "," "," "," "," "," "]
[473,"N","1981-12-01","TO BROADEN EXPERIENCE."," "," "," "," "," "," "," "," "]
[474,"N","1981-12-01","STUDENT RETURNING TO SCHOOL."," "," "," "," "," "," "," "," "]
[475,"N","1981-12-01","FACULTY MEMBER RETURNING TO REGULAR PROFESSION."," "," "," "," "," "," "," "," "]
["47C","N","1992-01-26","INELIGIBLE FOR HEALTH BENEFITS, EMPLOYMENT NTE 20 HOURS IN ANY CALENDAR","WEEK OR 40 HOURS IN ANY CALENDAR WEEK WHICH FALLS WITHIN A VACATION","PERIOD. APPOINTEE MEETS ALL REQUIREMENTS UNDER STAY-IN-SCHOOL CAMPAIGN","AS PROVIDED BY FPM CHAPTER213, APPENDIX F."," "," "," "," "," "]
["47G","N","1989-04-23","ABSENCE FROM DUTY FOR MORE THAN ONE DAY WITHOUT PERMISSION AND WITHOUT","ADEQUATE JUSTIFICATION. (WHEN ABSENCE EXCEEDS 10 DAYS WITHOUT PERMISSION","AND WITHOUT ADEQUATE JUSTIFICATION, THE PENALTY OF REMOVAL MAY BE IMPOSE","FOR THE FIRST OFFENSE.)"," "," "," "," "," "]
["47I","N","1990-08-26","SEPARATION DOCUMENT 7106 PROVIDED TO EMPLOYEE"," "," "," "," "," "," "," "," "]
["47J","N","1991-04-07","OPF IS MAINTAINED BY:  DEPARTMENT OF JUSTICE ATTORNEY PERSONNEL,","ROOM 4311, 10TH & PENN AVE, NW, WASH, DC 20530"," "," "," "," "," "," "," "]
[481,"N","1981-12-01","VOLUNTARY RESIGNATION TO ENTER ARMED FORCES."," "," "," "," "," "," "," "," "]
[482,"N","1981-12-01","RESIGNATION WHILE ON MILITARY FURLOUGH."," "," "," "," "," "," "," "," "]
[483,"N","1981-12-01","SEPARATION BY AGENCY-EMPLOYEE ENTERING ARMED FORCES."," "," "," "," "," "," "," "," "]
[484,"N","1981-12-01","NO RETURN FROM MILITARY FURLOUGH."," "," "," "," "," "," "," "," "]
["48C","N","1992-01-26","IF THIS POSITION DOES NOT BECOME PERMANENT, THE INCUMBENT WILL BE","RETURNED TO THE SAME OR SIMILAR POSITION HE/SHE HELD IN THE REGION","AT THE GRADE LEVEL HELD PRIOR TO THE TEMPORARY PROMOTION/REASSIGNMENT.","SHOULD THE POSITION BECOME PERMANENT, THE SELECTEE WILL RETAIN","PROMOTION WITHOUT FURTHER COMPETITION."," "," "," "," "]
["48G","N","1989-04-23","MISUSE OF SICK LEAVE (USING SICK LEAVE FOR ABSENCE UNRELATED TO ILLNESS","OR MEDICAL CARE)."," "," "," "," "," "," "," "]
["48I","N","1990-08-26","SEPARATION INFORMATION ON WITHDRAWING YOUR TSP ACCOUNT BALANCE AND TSP-1","PROVIDED TO EMPLOYEE"," "," "," "," "," "," "," "]
["48J","N","1991-04-07","ELIGIBILITY FOR ADMINISTRATIVE PAY INCREASE IS ONE FULL YEAR FROM"," "," "," "," "," "," "," "," "]
[499,"N","1981-12-01","                                ."," "," "," "," "," "," "," "," "]
["49C","N","1992-01-26","EMPLOYEE SUBJECT TO TRANSPORTATION, SERVICE, AND REIMBURSEMENT AGREEMENT","REQUIRED BY 5 U.S.C. 5723(B) OR 5724(I),AS APPLICABLE FOR PAYMENT OF MOV","ING EXPENSES,WHICH DOES NOT EXPIRE UNTIL       ."," "," "," "," "," "," "]
["49G","N","1989-04-23","SLEEPING ON DUTY WHERE SAFETY AND SECURITY OF PERSONS OR PROPERTY IS NOT","ENDANGERED."," "," "," "," "," "," "," "]
["49I","N","1990-08-26","SF-8, SF-2821, AND SF-2810 ISSUED"," "," "," "," "," "," "," "," "]
["49J","N","1991-04-07","RETAINED UNDER THE AUTHORITY OF REG. 316.702."," "," "," "," "," "," "," "," "]
["4CP","N","2014-07-27","REALIGNMENT DUE TO CHANGE IN DIVISION ORGANIZATIONAL CHARTS RECEIVED","IN OHR       ."," "," "," "," "," "," "," "]
[501,"Y","1998-06-21","SICK LEAVE BALANCE AS OF THE DAY BEFORE EFFECTIVE DATE OF THIS ACTION IS","@        @."," "," "," "," "," "," "," "]
[502,"N","1987-10-01","AMOUNT IN BLOCK 32 REPRESENTS A LUMP SUM PRO RATA SHARE OF THE EQUIVALEN","OF ANY WITHIN-GRADE INCREASE OR MERIT INCREASE WHICH WOULD HAVE BEEN DUE"," "," "," "," "," "," "," "]
[503,"N","1987-10-01","ENTITLED TO SUPERVISORY/MANAGERIAL DIFFERENTIAL AT THE RATE OF 6% OF","SALARY.  THE SUPERVISORY/MANAGERIAL DIFFERENTIAL IS CONSIDERED A PART OF","BASE PAY."," "," "," "," "," "," "]
[504,"N","1987-10-01","ENTITLED TO SUPERVISORY/MANAGERIAL DIFFERENTIAL AT THE RATE OF 3% OF","SALARY.  THE SUPERVISORY/MANAGERIAL DIFFERENTIAL IS CONSIDERED A PART OF","BASE PAY."," "," "," "," "," "," "]
[505,"N","1998-03-29","MAY EXCEED UP TO 6% OF MAXIMUM RATE OF PAY BAND BASED ON PERFORMANCE."," "," "," "," "," "," "," "," "]
[507,"N","1987-10-01","RECRUITMENT ALLOWANCE OF $          TO BE PAID IN A LUMP SUM.  SERVICE","AGREEMENT HAS BEEN SIGNED."," "," "," "," "," "," "," "]
[508,"N","1987-10-01","RECRUITMENT ALLOWANCE OF $            TO BE PAID IN INCREMENTS.  SERVICE","AGREEMENT HAS BEEN SIGNED."," "," "," "," "," "," "," "]
[509,"N","1987-10-01","ZSP SEC.10 P.L. 99-574"," "," "," "," "," "," "," "," "]
["50C","N","1992-01-26","TRAINING AGREEMENT EXECUTED."," "," "," "," "," "," "," "," "]
["50G","N","1989-04-23","SLEEPING ON DUTY WHERE SAFETY OF PERSONS OR PROPERTY IS ENDANGERED."," "," "," "," "," "," "," "," "]
["50I","N","1990-08-26","SF-8 AND SF-2821 ISSUED"," "," "," "," "," "," "," "," "]
["50J","N","1991-04-07","DANGER PAY ENTITLEMENT FROM    % TO    %."," "," "," "," "," "," "," "," "]
[510,"Y","1987-10-01","APPOINTMENT IS SUBJECT TO COMPLETION OF A ONE TO THREE YEAR INITIAL","PROBATIONARY PERIOD BEGINNING @        @."," "," "," "," "," "," "," "]
[511,"Y","1987-10-01","APPOINTMENT IS SUBJECT TO COMPLETION OF A ONE TO THREE YEAR TRIAL PERIOD","BEGINNING @         @."," "," "," "," "," "," "," "]
[512,"N","1987-10-01","DEMONSTRATION PROJECT POSITION ABOVE IS EQUIVALENT TO GRADE","STEP        .  IN DETERMINING EQUIVALENT GS GRADE, BASE PAY REDUCED BY","LOCALITY PAYMENT OF      %."," "," "," "," "," "," "]
[513,"N","1987-10-01","DEMONSTRATION PROJECT POSITION ABOVE IS EQUIVALENT TO       .SALARY FALL","BETWEEN STEP       AND STEP     ."," "," "," "," "," "," "," "]
[514,"N","1987-10-01","DEMONSTRATION PROJECT POSITION ABOVE IS EQUIVALENT TO     . SALARY","EXCEEDS STEP 10. EMPLOYEE ELIGIBLE FOR PAY RETENTION."," "," "," "," "," "," "," "]
[515,"N","1987-10-01","RETENTION ALLOWANCE OF $       TO BE PAID IN INCREMENTS.  SERVICE AGREEM","HAS BEEN SIGNED."," "," "," "," "," "," "," "]
[516,"Y","1990-03-25","PAYABLE SALARY LIMITED TO $@          @ BY P.L. 99-574, NBS DEMONSTRATIO","PROJECT"," "," "," "," "," "," "," "]
[517,"N","1988-04-28","ACCEPTED BELATED TRANSFER ELECTION FOR 1987 OPEN SEASON UNDER AUTHORITY","OF 5 CFR 846.204(A)."," "," "," "," "," "," "," "]
["51C","N","1992-01-26","UNIFORM ALLOWANCE AUTHORIZED."," "," "," "," "," "," "," "," "]
["51G","N","1989-04-23","FALSIFICATION OR UNLAWFUL CONCEALMENT, REMOVAL, MUTILATION, OR DESTRUCTI","OF ANY OFFICIAL DOCUMENTS OR RECORDS."," "," "," "," "," "," "," "]
["51I","N","1990-08-26","SF-8 AND SF-2810 ISSUED"," "," "," "," "," "," "," "," "]
["51J","N","1991-04-07","EMPLOYMENT IS NTE 18 MONTHS AND AT FULL PAY."," "," "," "," "," "," "," "," "]
[520,"N","1981-12-01","ELIGIBLE FOR DIFFERENTIAL AND ALLOWANCE IN ACCORDANCE WITH STANDARDIZED","REGULATIONS."," "," "," "," "," "," "," "]
[521,"N","1981-12-01","ELIGIBLE FOR POST ALLOWANCE IN ACCORDANCE WITH STANDARDIZED REGULATIONS."," "," "," "," "," "," "," "," "]
[522,"N","1981-12-01","TOUR OF DUTY - TWO YEARS FROM DATE OF ARRIVAL AT POST OF DUTY."," "," "," "," "," "," "," "," "]
[523,"N","1981-12-01","IN CONTINUATION OF PRESENT TOUR OF DUTY ABROAD."," "," "," "," "," "," "," "," "]
[524,"N","1981-12-01","HOME LEAVE WILL BE EARNED ON BASIS OF AVAILABILITY FOR WORLD WIDE","ASSIGNMENT."," "," "," "," "," "," "," "]
[525,"N","1981-12-01","THIS POSITION IS UNDER SCHEDULE A AND IS OUTSIDE THE COMPETITIVE CIVIL -","SERVICE. IN ACCEPTING THIS APPOINTMENT THE INCUMBENT UNDERSTANDS THAT TH","APPOINTMENT IS TERMINABLE UPON NOTICE THEREOF."," "," "," "," "," "," "]
[526,"N","1981-12-01","U.S. RESIDENT."," "," "," "," "," "," "," "," "]
[527,"N","1981-12-01","INELIGIBLE FOR HOME LEAVE."," "," "," "," "," "," "," "," "]
[528,"N","1981-12-01","ELIGIBLE TO ACCUMULATE 30 DAYS OF ANNUAL LEAVE."," "," "," "," "," "," "," "," "]
[529,"N","1981-12-01","HOME LEAVE WILL BE EARNED ON BASIS OF POST DIFFERENTIAL."," "," "," "," "," "," "," "," "]
["52C","N","1992-01-26","WELCOME TO HEADQUARTERS."," "," "," "," "," "," "," "," "]
["52G","N","1989-04-23","LENDING MONEY FOR PROFIT ON NGA PREMISES TO ANY OTHER PERSON; BORROWING","MONEY FROM A SUBORDINATE EMPLOYEE OR SECURING HIS ENDORSEMENT ON A LOAN."," "," "," "," "," "," "," "]
["52I","N","1990-08-26","SF-2821 ISSUED"," "," "," "," "," "," "," "," "]
["52J","N","1991-04-07","ALTHOUGH THE FEDERAL EMPLOYEES' RETIREMENT SYSTEM (FERS) COVERAGE IS","EFFECTIVE 01/01/87, DUE TO TECHNICAL ADMENDMENTS TO THE FERS ACT, FERS","EMPLOYEE DEDUCTIONS AND AGENCY CONTRIBUTIONS COMMENCE 01/04/87."," "," "," "," "," "," "]
["52M","N","2010-03-28","                         ."," "," "," "," "," "," "," "," "]
[530,"N","1988-07-03","THIS EMPLOYEE WILL WORK SIX 24-HOUR DAYS PER PAY PERIOD","AND WILL RECEIVE 25 PERCENT STANDBY PAY IN LIEU OF","OVERTIME,HOLIDAY PAY,AND NIGHT DIFFERENTIAL."," "," "," "," "," "," "]
["53C","N","2003-03-09","WELCOME TO CUSTOMS AND BORDER PROTECTION."," "," "," "," "," "," "," "," "]
["53G","N","1989-04-23","UNETHICAL OR IMPROPER USE OF OFFICIAL AUTHORITY OR CREDENTIALS, OR","UNAUTHORIZED DISCLOSURE OR USE OF OFFICIAL INFORMATION."," "," "," "," "," "," "," "]
["53I","N","1990-08-26","SF-8 AND SF-2819 ISSUED"," "," "," "," "," "," "," "," "]
["53J","N","1991-04-07","THIS IS A TEMPORARY ASSIGNMENT AT EMPLOYEES'S REQUEST.  UPON COMPLETION","OF THE ASSIGNMENT, YOU WILL BE RETURNING TO YOUR FORMER POSITION, OR","A POSITION OF EQUIVALENT GRADE AND PAY."," "," "," "," "," "," "]
[540,"Y","1989-12-31","S.C. DATES FOR LEAVE, RIF, AND/OR RETIREMENT ADJUSTED BY @   @ DAYS","COMPUTED FROM @        @ INT HRS WORKED DURING @     @ ELAPSED CALENDAR","DAYS. PREVIOUS DATES WERE LEAVE @        @, RIF @        @, AND/OR","RET @813     @."," "," "," "," "," "]
[541,"N","1991-12-29","S.C. DATES FOR TSP, LEAVE, RIF, AND/OR RETIREMENT ADJUSTED BY          I","HRS WORKED DURING     ELAPSED CALENDAR DAYS AND      HOURS NONPAY STATUS","PREVIOUS DATES WERE TSP         , LEAVE         , RIF         ,","AND/OR RET         ."," "," "," "," "," "]
[542,"N","1991-12-29","S.C. DATES FOR TSP, LEAVE, RIF, AND/OR RETIREMENT ADJUSTED BY      HOURS","EXCESS NONPAY STATUS.  PREVIOUS DATES WERE TSP         , LEAVE         ,","RIF         , AND/OR RET         ."," "," "," "," "," "," "]
[543,"Y","1989-12-31","S.C. DATES FOR RIF, AND/OR RETIREMENT ADJUSTED BY @   @ DAYS COMPUTED FR","@        @ INT. HRS WORKED DURING @   @ ELAPSED CALENDAR DAYS. PREVIOUS","DATES WERE RIF @        @ AND/OR RET. @        @."," "," "," "," "," "," "]
[544,"Y","1982-09-20","TOTAL @      @ HOURS NONPAY STATUS RECORDED THIS CALENDAR YEAR."," "," "," "," "," "," "," "," "]
[545,"Y","1981-12-01","@   @ INT DAYS WORKED TOWARD COMPLETION OF WAITING PERIOD FOR CAREER","TENURE SINCE THE COMMENCING DATE WAS LAST REPORTED BY NFC ON @        @."," "," "," "," "," "," "," "]
[546,"Y","1981-12-01","@   @ INT DAYS WORKED TOWARD COMPLETION OF CURRENT WAITING PERIOD FOR WG","SINCE THE COMMENCING DATE LAST ADJUSTED ON @        @."," "," "," "," "," "," "," "]
[547,"Y","1981-12-01","@   @ INT DAYS WORKED TOWARD THE COMPLETION OF PROBATIONARY PERIOD SINCE","THE COMMENCING DATE WAS LAST ADJUSTED BY NFC ON @        @."," "," "," "," "," "," "," "]
[548,"Y","1981-12-01","@   @ DAYS EXCESS NONPAY STATUS RECORDED."," "," "," "," "," "," "," "," "]
[549,"Y","1981-12-01","@      @ HOURS NONPAY STATUS RECORDED."," "," "," "," "," "," "," "," "]
["54C","N","1992-01-26","POSITION APPROVED UNDER 5 USC SECTION 8336(C)."," "," "," "," "," "," "," "," "]
["54G","N","1989-04-23","VIOLATING NGA REGULATIONS PROHIBITING THE SOLICIATION OR ACCEPTANCE OF","GIFTS, LOANS, GRATUITIES, FAVORS, ETC., FROM PERSONS, FIRMS, OR","CORPORATIONS WITH WHOM EMPLOYEES HAVE OFFICIAL RELATIONS."," "," "," "," "," "," "]
["54I","N","1990-08-26","AS A RESULT OF THIS ACTION, YOUR RETIRMENT CODE HAS BEEN CHANGED TO"," "," "," "," "," "," "," "," "]
["54J","N","1991-04-07","EMPLOYEE IS RETURNING FROM A TEMPORARY CHANGE TO LOWER GRADE."," "," "," "," "," "," "," "," "]
[550,"Y","1981-12-01","@      @ HOURS NONPAY STATUS RECORDED."," "," "," "," "," "," "," "," "]
[551,"N","1981-12-01","REFLECTS TOUR CHANGE FROM FULL-TIME."," "," "," "," "," "," "," "," "]
[552,"N","1981-12-01","REFLECTS TOUR CHANGE FROM PART-TIME."," "," "," "," "," "," "," "," "]
[553,"N","1981-12-01","REFLECTS TOUR CHANGE FROM INTERMITTENT."," "," "," "," "," "," "," "," "]
[555,"N","1987-08-02","RETROACTIVELY ADJUSTS SCD TO REFLECT PLACEMENT IN SEASONAL STATUS IN","COMPLIANCE WITH FPM CHAPTER 340, ISSUED 5/4/84."," "," "," "," "," "," "," "]
["55C","N","1992-01-26","EMPLOYEE WILL NOT BE PERMITTED ACCESS TO COMPUTER SYSTEMS, INTEGRITY OR","BACKGROUND INVESTIGATIONS AND OTHER SENSITIVE INFORMATION UNTIL HIS/HER","BACKGROUND INVESTIGATION IS SUCESSFULLY COMPLETED."," "," "," "," "," "," "]
["55G","N","1989-04-23","VIOLATION OF NGA REGULATIONS REGARDING FINANCIAL INTEREST OR TRANSACTION","WHICH CONFLICT WITH OFFICIAL DUTIES AND RESPONSIBILITIES."," "," "," "," "," "," "," "]
["55I","N","1990-08-26","NON-WORK STATUS SINCE"," "," "," "," "," "," "," "," "]
["55J","N","1991-04-07","APPOINTMENT IS SUBJECT TO THE SUCCESSFUL COMPLETION OF A FULL-FIELD","BACKGROUND INVESTIGATION."," "," "," "," "," "," "," "]
[560,"N","1981-12-01","STANDARD OPTIONAL INSURANCE: DECLINED."," "," "," "," "," "," "," "," "]
[561,"N","1981-12-01","STANDARD OPTIONAL INSURANCE: NOT ELIGIBLE TO CONTINUE."," "," "," "," "," "," "," "," "]
[562,"N","1981-12-01","STANDARD OPTIONAL INSURANCE: ELIGIBLE TO CONTINUE: COVERAGE BEGAN"," "," "," "," "," "," "," "," "]
[563,"N","1981-12-01","CONV TO TEMPORARY APPOINTMENT NEW COMMITTEE ESTABLISHED"," "," "," "," "," "," "," "," "]
[564,"N","1981-12-01","TERMINATE FEHB - NOT ENROLLED SINCE FIRST OPPORTUNITY."," "," "," "," "," "," "," "," "]
[565,"N","1981-12-01","TERMINATE FEHB - NOT ENROLLED FIVE YEARS."," "," "," "," "," "," "," "," "]
[566,"N","1981-12-01","TERMINATE FEHB - NO SURVIVOR ELIGIBLE TO CONTINUE HEALTH BENEFITS."," "," "," "," "," "," "," "," "]
[567,"N","1981-12-01","BASIC LIFE INSURANCE: ELECTED       REDUCTION."," "," "," "," "," "," "," "," "]
[568,"N","1981-12-01","ADDITIONAL OPTIONAL INSURANCE: DECLINED."," "," "," "," "," "," "," "," "]
[569,"N","2000-07-03","ADDITIONAL OPTIONAL INSURANCE: ELIGIBLE TO CONTINUE: COVERAGE BEGAN","      ; LOWEST MULTIPLE DURING LAST FIVE YEARS - ; ELECTED      REDUCTIO"," "," "," "," "," "," "," "]
["56C","N","1992-01-26","POSITION APPROVAL FOR PRIMARY/SECONDARY COVERAGE UNDER THE PROVISION OF","5 U.S.C. 8336(C)."," "," "," "," "," "," "," "]
["56G","N","1989-04-23","KNOWINGLY MAKING FALSE STATEMENTS WHICH ARE SLANDEROUS OR DEFAMATORY ABO","OTHER EMPLOYEES OR OFFICIALS."," "," "," "," "," "," "," "]
["56I","N","1990-08-26","REASON FOR LATE"," "," "," "," "," "," "," "," "]
["56J","N","1991-04-07","CONGRATULATIONS!  THIS BONUS IS AWARDED FOR YOUR PARTICIPATION IN DEA'S","FOREIGN LANGUAGE BONUS PROGRAM.  IT IS COMPUTED ON YOUR BASE SALARY AS","OF THE LAST FULL PAY PERIOD PRIOR TO THE END OF THE LAST FISCAL YEAR","(SEPTEMBER 30TH)."," "," "," "," "," "]
[570,"N","1981-12-01","ADDITIONAL OPTIONAL INSURANCE: NOT ELIGIBLE TO CONTINUE."," "," "," "," "," "," "," "," "]
[571,"N","1981-12-01","FAMILY OPTIONAL INSURANCE: DECLINED."," "," "," "," "," "," "," "," "]
[572,"N","2000-07-03","FAMILY OPTIONAL INSURANCE: ELIGIBLE TO CONTINUE: COVERAGE BEGAN","LOWEST MULTIPLE DURING LAST 5 YEARS -   ; ELECTED       REDUCTION."," "," "," "," "," "," "," "]
[573,"N","1981-12-01","FAMILY OPTIONAL INSURANCE: NOT ELIGIBLE TO CONTINUE."," "," "," "," "," "," "," "," "]
[574,"N","1998-01-01","BASIC LIFE INSURANCE WAIVED."," "," "," "," "," "," "," "," "]
["57C","N","1992-01-26","POSITION APPROVAL FOR RIGOROUS/SECONDARY COVERAGE UNDER PROVISION OF 5","U.S.C. 8412(D)."," "," "," "," "," "," "," "]
["57G","N","1989-04-23","THEFT OR ATTEMPTED THEFT OF GOVERNMENT OR NGA PROPERTY OR THE PROPERTY O","OTHER EMPLOYEES. (IN ARRIVING AT THE PENALTY, CONSIDERATION SHOULD BE GI","TO VALUE OF PROPERTY STOLEN AND WHETHER VOLUNTARY RESTITUTION WAS MADE)"," "," "," "," "," "," "]
["57I","N","1990-08-26","ANNUAL DATE FOR EMPLOYEE IS"," "," "," "," "," "," "," "," "]
["57J","N","1991-04-07","EMPLOYEE HAS BEEN ADVISED THAT ASSIGNMENT TO A SUPERVISORY OR SENIOR","LITIGATION COUNSEL POSITION IS TEMPORARY AND THAT ANY RIGHTS TO A","HIGHER SUPERVISORY/SENIOR LITIGATION  COUNSEL SALARY ACCRUE ONLY SO","LONG AS HE/SHE IS AN INCUMBENT OF SUCH A POSITION."," "," "," "," "," "]
["58G","N","1989-04-23","UNAUTHORIZED USE OF NGA PROPERTY (OTHER THAN MOTOR VEHICLES) OR LOSS OF","DAMAGE TO NGA PROPERTY THROUGH CARELESSNESS OR WHEN PROPERTY INVOLVED IS","SMALL VALUE."," "," "," "," "," "," "]
["58I","N","1990-08-26","ACTION LATE DUE TO ADMINISTRATIVE OVERSIGHT"," "," "," "," "," "," "," "," "]
["58J","N","1991-04-21","EXPECTED TO WORK    HOURS PER WEEK."," "," "," "," "," "," "," "," "]
["59G","N","1989-04-23","UNAUTHORIZED USE OF NGA PROPERTY (OTHER THAN MOTOR VEHICLES) OR LOSS OF","DAMAGE TO NGA PROPERTY THROUGH MALICIOUSNESS OR INTENT, OR WHEN PROPERTY","INVOLVED IS OF SIGNIFICANT VALUE."," "," "," "," "," "," "]
["59I","N","1990-08-26","FROM SEASONAL TO PERMANENT"," "," "," "," "," "," "," "," "]
["59J","N","1991-04-21","LEAVE TO BE TRANSFERRED."," "," "," "," "," "," "," "," "]
[600,"N","1981-12-01","SCD'S FOR LEAVE AND RIF ADJUSTED BY       YEARS     MONTHS      DAYS OF","ASC COUNTY OFFICE SERVICE IN ACCORDANCE WITH PL 90-367 DATED JUNE 29,196"," "," "," "," "," "," "," "]
[605,"N","1982-12-12","PROMOTION POTENTIAL TO"," "," ","PROMOTION POTENTIAL TO (INSERT PAY PLAN AND GRADE)\u001c","\u001c","\u001c"," "," "," "]
[606,"N","1981-12-01","THE FEDERAL GOVERNMENT CONTRIBUTES 50% OR LESS OF EMPLOYEE'S SALARY",{"$f":"- IPA.","v":{"$error":"#NAME?"}}," "," "," "," "," "," "," "]
[607,"N","1982-12-12","TO BE PLACED ON AGENCY'S REPROMOTION PRIORITY LIST FOR TWO YEARS."," "," "," "," "," "," "," "," "]
[608,"N","1986-10-01","DETAILED TO AN UNCLASSIFIED POSITION"," "," "," "," "," "," "," "," "]
[609,"N","1986-10-01","DETAILED TO                         UNDER THE INTERGOVERNMENTAL PERSONNE","ACT (IPA)."," "," "," "," "," "," "," "]
["60G","N","1989-04-23","REMOVING A WEAPON FROM NGA PROPERTY."," "," "," "," "," "," "," "," "]
["60I","N","1990-08-26","WGI PROCESSED SIMULTANEOUSLY WITH PROMOTION/REASSIGNMENT/CLG"," "," "," "," "," "," "," "," "]
["60J","N","2002-09-01","THIS APPOINTMENT IS SUBJECT TO COMPLETION OF AN INITIAL TRIAL PERIOD,","BEGINNING ON           .  FOR EMPLOYEES WITH VETERANS PREFERENCE, THAT","PERIOD IS ONE YEAR.  FOR EMPLOYEES NOT ELIGIBLE FOR PREFERENCE, THAT PER","IS TWO YEARS.  THE RIGHT TO APPEAL A DISCHARGE OR OTHER DISCIPLINARY ACT","DURING THE TRIAL PERIOD IS LIMITED."," "," "," "," "]
[612,"N","1981-12-01","AUTOMATIC WITHIN GRADE INCREASE AND FWS AREA INCREASE","APPLIED AS OF EFFECTIVE DATE OF THIS ACTION."," "," "," "," "," "," "," "]
[613,"N","1981-12-01","AUTOMATIC WITHIN GRADE INCREASE APPLIED AS OF EFFECTIVE","DATE OF THIS ACTION."," "," "," "," "," "," "," "]
[614,"N","1981-12-01","ADJUSTMENT DUE TO APPLICATION OF FWS AREA INCREASE."," "," "," "," "," "," "," "," "]
[615,"N","2024-01-14","SALARY UNDER 44 USC 305."]
[616,"N","1981-11-14","NFC USE ONLY"," "," "," "," "," "," "," "," "]
[617,"N","1982-12-12","ELIGIBLE TO CONTINUE CIVIL SERVICE RETIREMENT AND CURRENT BENEFITS,","NO BREAK IN SERVICE."," "," "," "," "," "," "," "]
[619,"Y","1981-12-01","7 1/2% RETIREMENT DISCONTINUED @        @ UNDER P.L. 93-350."," "," "," "," "," "," "," "," "]
["61I","N","1990-08-26","FROM APPROVED LWOP SINCE"," "," "," "," "," "," "," "," "]
[620,"N","1984-01-01","COVERAGE UNDER SOCIAL SECURITY AND           RETIREMENT SYSTEM AT THE",".94% TRANSITIONAL RATE IS EFFECTIVE FROM DATE OF"," "," "," "," "," "," "," "]
[623,"N","1981-12-01","TEMPORARY APPOINTMENT LIMITED TO           ; INELIGIBLE FOR HEALTH & LIF","INSURANCE BENEFITS OR CIVIL SERVICE RETIREMENT."," "," "," "," "," "," "," "]
[624,"N","1981-12-01","THIS POSITION IS UNDER SCHEDULE C AND IS OUTSIDE THE COMPETITIVE CIVIL","SERVICE.  IN ACCEPTING THIS APPOINTMENT THE INCUMBENT UNDERSTANDS THAT T","APPOINTMENT IS TERMINABLE UPON NOTICE THEROF."," "," "," "," "," "," "]
[626,"N","1987-04-20","EMPLOYEE MUST NOT WORK MORE THAN 100 DAYS THIS FISCAL YEAR."," "," "," "," "," "," "," "," "]
[628,"N","1981-12-01","BASED ON MEMORANDUM OF UNDERSTANDING BETWEEN                           A","                          DATED"," "," "," "," "," "," "," "]
["62I","N","1990-08-26","20% COLA"," "," "," "," "," "," "," "," "]
[630,"N","1984-09-16","ALT TOUR:  FT           PAY PERIODS:  PT           PAY PERIODS:  INT","PAY PERIODS."," "," "," "," "," "," "," "]
[634,"N","1981-12-01","TEMPORARY PROMOTION - EMPLOYEE INFORMED IN ADVANCE OF THE REASONS FOR AN","THE CONDITIONS OF THE TEMPORARY PROMOTION."," "," "," "," "," "," "," "]
[635,"N","1981-12-01","CAREER PROMOTION - EMPLOYEE WAS SELECTED COMPETITIVELY FOR A PREVIOUS","POSITION."," "," "," "," "," "," "," "]
["63I","N","1990-08-26","22.5% COLA"," "," "," "," "," "," "," "," "]
[640,"N","1981-12-01","THIS ACTION PREPARED TO REPORT THE END OF THE FEGLI 12-MONTH NONPAY STAT","COVERAGE."," "," "," "," "," "," "," "]
["64I","N","1990-08-26","SUBJECT TO INVESTIGATION"," "," "," "," "," "," "," "," "]
[659,"N","1988-11-06","CODE 1 IN BLK 28 INDICATES REEMPL ANN-CSRS."," "," "," "," "," "," "," "," "]
["65I","N","1990-08-26","CHANGE IN ORGANIZATIONAL SEGMENT CODE"," "," "," "," "," "," "," "," "]
[660,"N","1988-11-06","CODE 2 IN BLK 28 INDICATES RET OFFICER."," "," "," "," "," "," "," "," "]
[661,"N","1988-11-06","CODE 3 IN BLK 28 INDICATES RET ENLISTED."," "," "," "," "," "," "," "," "]
[662,"N","1988-11-06","CODE 4 IN BLK 28 INDICATES RET OFF/REEMPL ANN-CSRS."," "," "," "," "," "," "," "," "]
[663,"N","1988-11-06","CODE 5 IN BLK 28 INDICATES RET ENL/REEMPL ANN-CSRS."," "," "," "," "," "," "," "," "]
[664,"N","1988-11-06","CODE 9 IN BLK 28 INDICATES NOT APPLICABLE."," "," "," "," "," "," "," "," "]
[665,"N","1988-11-06","CODE A IN BLK 28 INDICATES REEMPL ANN-FERS."," "," "," "," "," "," "," "," "]
[666,"N","1988-11-06","CODE B IN BLK 28 INDICATES FORMER ANN-FERS."," "," "," "," "," "," "," "," "]
[667,"N","1988-11-06","CODE C IN BLK 28 INDICATES RET OFF/REEMPL ANN-FERS."," "," "," "," "," "," "," "," "]
[668,"N","1988-11-06","CODE D IN BLK 28 INDICATES RET OFF/FORMER ANN-FERS."," "," "," "," "," "," "," "," "]
[669,"N","1988-11-06","CODE E IN BLK 28 INDICATES RET ENL/REEMPL ANN-FERS."," "," "," "," "," "," "," "," "]
["66I","N","1990-08-26","PUBLICATION 905 GIVEN TO EMPLOYEE"," "," "," "," "," "," "," "," "]
[670,"N","1988-11-06","CODE F IN BLK 28 INDICATES RET ENL/FORMER ANN-FERS."," "," "," "," "," "," "," "," "]
["67I","N","1990-08-26","UPON RETURN TO DUTY YOU HAVE 31 DAYS TO RE-ELECT COVERAGE"," "," "," "," "," "," "," "," "]
["68I","N","1990-08-26","CHANGES ORIGINAL              COVERAGE"," "," "," "," "," "," "," "," "]
["69I","N","1990-08-26","TOTAL CREDITABLE SERVICE DURING APPOINTMENT WAS    YEARS    MONTHS"," "," "," "," "," "," "," "," "]
[700,"Y","1985-03-31","PMRS PAY CASH AWARD $@        @."," "," "," "," "," "," "," "," "]
[701,"Y","1985-03-31","PMRS PERFORMANCE AWARD $@        @."," "," "," "," "," "," "," "," "]
[702,"N","1993-01-01","SALARY BLOCK CONTAINS SEPARATION INCENTIVE AMOUNT"," "," "," "," "," "," "," "," "]
[703,"N","2024-01-14","PAY INCREASE AUTHORIZED BY CORPORATION CEO MEMO DATED January 4,2024."]
[704,"Y","1982-12-26","SALARY SET AT $@        @; PAYMENT LIMITED TO $68,700."," "," "," "," "," "," "," "," "]
[705,"N","2023-01-01","PAY INCREASE AS AUTHORIZED BY THE DIRECTOR OF THE CONGRESSIONAL BUDGET","OFFICE. AUTHORIZATION GRANTED BY THE CONGRESSIONAL BUDGET AND","IMPOUNDMENT CONTROL ACT OF 1974, AS AMENDED."]
[706,"N","2020-01-05","FEDERAL PAY INCREASE DUE TO 13901 SIGNED 12/26/19.  SALARY INCLUDES A","GENERAL INCREASE AND A LOCALITY PAYMENT (OR OTHER GEOGRAPHICAL","ADJUSTMENT), APPLICABLE IN THIS AREA."]
[707,"N","2024-01-14","SALARY INCLUDES 4.7% INCREASE BASE PAY AND A LOCALITY ADJUSTMENT","(OR OTHER GEOGRAPHICAL ADJUSTMENT) APPLICABLE IN THIS AREA."]
[708,"N","2023-01-01","Annual Basic Pay Adjustment"]
[709,"N","2001-01-13","EMPLOYEE IS ENTIITLED TO THE HIGHER OF THE IT SPECIAL RATE SALARY OR","LOCALITY PAY SALARY FOR THE GEOGRAPHIC AREA. BLOCK 20A SHOWS THE IT","SPECIAL SALARY RATE WHICH IS THE EMPLOYEE'S UNDERLYING RATE OF BASIC PAY","FOR SOME PAY ADMINISTRATION PURPOSES. BLOCK 20B SHOWS THE ACTUAL LOCALIT","PAYMENT WHICH IS THE LOCALITY PAY RATE (BLOCK 20C) LESS THE IT SPECIAL","SALARY RATE (BLOCK 20A)."," "," "," "]
["70I","N","1990-08-26","VOLUNTARY WAIVER OF ALL LIFE INSURANCE COVERAGE"," "," "," "," "," "," "," "," "]
[711,"N","1985-10-13","THIS EMPLOYEE HAS ELECTED TO PARTICIPATE IN THE MIXED-TOUR PROGRAM WITH","A PART TIME SCHEDULE TOUR OF DUTY. BASED ON THE AGENCY'S FLUCTUATING","WORKLOAD, THE EMPLOYEE WILL REVERT TO INTERMITTENT STATUS, AS NECESSARY."," "," "," "," "," "," "]
[712,"N","1985-10-13","THIS EMPLOYEE HAS ELECTED TO PARTICIPATE IN THE MIXED-TOUR PROGRAM WITH","A FULL TIME SCHEDULE TOUR OF DUTY. BASED ON THE AGENCY'S FLUCTUATING","WORKLOAD, THE EMPLOYEE WILL REVERT TO INTERMITTENT STATUS, AS NECESSARY."," "," "," "," "," "," "]
[713,"N","2001-01-14","RETIREMENT DEDUCTION RATE DECREASED BY .004"," "," "," "," "," "," "," "," "]
[714,"N","2000-01-02","PAY INCREASES AUTHORIZED BY THE ATTORNEY GENERAL PURSUANT TO 28 U.S.C. 5","SALARY INCLUDES A GENERAL INCREASE OF 3.8 PERCENT ROUNDED AND/OR A LOCAL","PAYMENT (OR OTHER GEOGRAPHIC ADJUSTMENT) APPLICABLE IN THIS AREA.  LOCAL","PAY MAY BE TRUNCATED TO AVOID PAY INVERSION OR TO COMPLY WITH PAY CEILIN"," "," "," "," "," "]
[715,"N","2024-01-14","PAY INCREASE AUTHORIZED BY FSA PM NOTICE 3079."]
[716,"N","2002-12-29","BENEFIT RATE CHANGE AUTHORIZED BY PUBLIC LAW 107-228"," "," "," "," "," "," "," "," "]
[717,"N","2000-11-18","PER MEMO DATED 9/18/00 THIS REALIGNMENT IS EFFECTIVE 10/01/00.\tHOWEVER,DUE TO PROCESSING ISSUES,THIS PERSONNEL ACTION IS EFFECTIVE\t11/17/00.\t \t \t \t \t \t \r\n718\tN\t1999-01-03 00:00:00.000\tPAY INCREASE AUTHORIZED BY PL-105-33-111-ST-251.\t \t \t \t \t \t \t \t \r\n719\tN\t2006-01-08 00:00:00.000\tPAY INCREASES AUTHORIZED BY THE ATTORNEY GENERAL PURSUANT TO 28 U.S.C.\t548. LOCALITY PAY MAY BE TRUNCATED TO COMPLY WITH PAY CEILING.\t \tFOR GRADES ABOVE 01.\t \t \t \t \t \r\n71I\tN\t1990-08-26 00:00:00.000\tFROM PERMANENT TO SEASONAL\t \t \t \t \t \t \t \t \r\n720\tN\t2024-01-14 00:00:00.000\tSALARY INCLUDES A GENERAL INCREASE OF 4.7% ROUNDED AND A LOCALITY\tPAYMENT (OR OTHER GEOGRAPHIC ADJUSTMENT) APPLICABLE IN THIS AREA.\t\t\t\t\t\t\t\r\n721\tN\t2024-01-14 00:00:00.000\tSALARY INCLUDES A SPECIAL RATE INCREASE OF 4.7 PERCENT. EMPLOYEE\tRECEIVES NO OTHER ADJUSTMENT BECAUSE SPECIAL RATE PROVIDES HIGHEST\tPAY ENTITLEMENT.\t\t\t\t\t\t\r\n722\tN\t2024-01-14 00:00:00.000\tSALARY INCLUDES A GS RATE INCREASED BY 4.7 PERCENT PLUS A LOCALITY\tPAYMENT(OR OTHER GEOGRAPHIC ADJUSTMENT) APPLICABLE IN THIS AREA.\tEMPLOYEE'S UNDERLYING SPECIAL RATE, WHICH IS USED FOR CERTAIN PAY.\tADMINISTRATION PURPOSES, ALSO IS INCREASED BY 4.7 PERCENT.\t\t\t\t\t\r\n723\tN\t2024-01-14 00:00:00.000\tSALARY INCLUDES A LAW ENFORCEMENT SPECIAL BASE RATE INCREASE OF 4.7\tPERCENT AND A LOCALITY PAYMENT (OR OTHER GEOGRAPHIC ADJUSTMENT)\tAPPLICABLE IN THIS AREA.\t\t\t\t\t\t\r\n724\tN\t2024-01-14 00:00:00.000\tEMPLOYEE IS ENTITLED TO A CONTINUED RATE\" UNDER 5 CFR 531.307 OR","531.703, WHICH IS BEING INCREASED BY THE DOLLAR AMOUNT OF THE 4.7","PERCENT INCREASE IN THE EMPLOYEE'S UNDERLYING GS RATE."]
[725,"N","1995-01-08","SALARY INCLUDES A RETAINED RATE (ADJUSTED BY ONE-HALF OF THE DOLLAR AMOU","OF THE INCREASE IN THE MAXIMUM RATE OF BASIC PAY PAYABLE FOR THE GRADE O","THE EMPLOYEE'S CURRENT POSITION) AND A LOCALITY PAYMENT (OR OTHER","GEOGRAPHIC ADJUSTMENT) APPLICABLE IN THIS AREA."," "," "," "," "," "]
[726,"N","1995-01-08","EMPLOYEE'S CONTINUED RATE IS TERMINATED BECAUSE A HIGHER RATE IS NOW","APPLICABLE."," "," "," "," "," "," "," "]
[727,"N","1995-01-08","SALARY WHICH INCLUDES LOCALITY-BASED PAYMENT WILL BE USED TO CALCULATE","SALARY-BASED BENEFITS ONLY."," "," "," "," "," "," "," "]
[728,"N","1995-01-08","EMPLOYEES WHO RECEIVE AVAILABILITY PAY ARE NOT ELIGIBLE FOR AUO. ANY","ENTITLEMENT TO AUO TERMINATES UPON RECEIPT OF AVAILABILITY PAY."," "," "," "," "," "," "," "]
["72I","N","1990-08-26","FROM INTERMITTENT TO SEASONAL"," "," "," "," "," "," "," "," "]
[730,"Y","1995-09-03","SUBJECT TO COMPLETION OF TWO YEAR PROBATIONARY PERIOD BEGINNING @"," "," "," "," "," "," "," "," "]
[731,"N","1995-09-03","UNDER THE PROVISIONS OF P.L. 103-82 DATED 9-21-93 AN EMPLOYEE ACQUIRES N","COMPETITIVE ELIGIBILITY FOR APPOINTMENT TO THE COMPETITIVE SERVICE UPON","MEETING THE APPROPRIATE CONDITIONS AS PRESCRIBED BY OPM."," "," "," "," "," "," "]
[732,"N","1995-09-03","COMPLETED OPM REQUIREMENTS FOR NON-COMPETITIVE ELIGIBILITY FOR APPOINTME","IN THE COMPETITIVE SERVICE UNDER THE PROVISIONS OF P.L. 103-82."," "," "," "," "," "," "," "]
[733,"N","1999-01-03","SERVICE CREDIT FOR RETIREMENT, AND LEAVE ACCRUAL PURPOSE CONTINUES FOR U","TO A MAXIMUM OF SIX MONTHS OF NONPAY STATUS TIME PER CALENDAR YEAR."," "," "," "," "," "," "," "]
[734,"N","1995-09-03","THIS ACTION DOCUMENTS YOUR CONVERSION INTO THE CORPORATION'S ALTERNATIVE","PERSONNEL SYSTEM. AUTHORITY FOR CHANGE: P.L. 103-82 DATED 9-21-93."," "," "," "," "," "," "," "]
[735,"N","1995-09-03","THIS DOCUMENTS YOUR GENERAL APPOINTMENT"," "," "," "," "," "," "," "," "]
[736,"N","1995-09-03","THIS DOCUMENTS YOUR TERM APPOINTMENT"," "," "," "," "," "," "," "," "]
[737,"N","1995-09-03","THIS DOCUMENTS YOUR DISCRETIONARY APPOINTMENT"," "," "," "," "," "," "," "," "]
[738,"N","1995-09-03","THIS DOCUMENTS YOUR INDEFINITE APPOINTMENT"," "," "," "," "," "," "," "," "]
[739,"N","1999-06-06","NON-FEDERAL EMPLOYEE UNDER TEMPORARY APPOINTMENT."," "," "," "," "," "," "," "," "]
["73I","N","1990-08-26","NON-PAY DAYS SINCE DATE OF LAST EQUIVALENT INCREASE"," "," "," "," "," "," "," "," "]
[740,"N","1999-06-06","NON-FEDERAL EMPLOYEE UNDER PERMANENT APPOINTMENT."," "," "," "," "," "," "," "," "]
[741,"N","2002-01-13","SALARY WHICH INCLUDES LOCALITY BASED PAYMENT WILL BE USED TO CALCULATE","SALARY BASED BENEFITS ONLY."," "," "," "," "," "," "," "]
[742,"N","2005-05-01","EFFECTIVE MAY 1, 2005, UNDER 5 U.S.C. 5305(H), AN EMPLOYEE'S ENTITLEMENT","TO A SPECIAL RATE IS ELIMINATED IF THE EMPLOYEE IS ENTITLED TO A HIGHER","LOCALITY RATE OF PAY UNDER 5 U.S.C. 5304. SINCE YOUR LOCALITY RATE OF PA","IS HIGHER THAN YOUR SPECIAL RATE, YOU ARE NO LONGER ENTITLED TO A SPECIA","RATE. THE TERMINATION OF YOUR SPECIAL RATE WILL NOT RESULT IN A LOSS OF","PAY. BLOCK 20A REFLECTS YOUR NEW GENERAL SCHEDULE RATE OF PAY. BLOCK 20B","SHOWS YOUR NEW LOCALITY ADJUSTMENT. BLOCK 20C, ADJUSTED BASIC PAY, IS NO","ED BY THIS ACTION.                                                    CH","CHANGES PAY RATE DETERMINANT CODE IN BLOCK 29 TO 0."]
[743,"N","2005-05-15","EFFECTIVE MAY 1, 2005, UNDER 5 U.S.C. 5305(H), AN EMPLOYEE'S ENTITLEMENT","TO A SPECIAL RATE IS ELIMINATED IF THE EMPLOYEE IS ENTITLED TO A HIGHER","LOCALITY RATE OF PAY UNDER 5 U.S.C. 5304. SINCE YOUR LOCALITY RATE OF PA","IS HIGHER THAN YOUR SPECIAL RATE, YOU ARE NO LONGER ENTITLED TO A SPECIA","RATE. THE TERMINATION OF YOUR SPECIAL RATE WILL NOT RESULT IN A LOSS OF","PAY. BLOCK 20A REFLECTS YOUR NEW RATE OF BASIC PAY UNDER TABLE 0491 FOR","$0.00 LOCALITY ADJUSTMENT. BLOCK 20C, ADJUSTED BASIC PAY, ALSO REFLECTS","YOUR NEW SPECIAL RATE"," "]
[744,"N","2005-05-15","EFFECTIVE MAY 1, 2005, UNDER 5 U.S.C. 5305(A)(1), THE MAXIMUM SPECIAL RA","AUTHORIZED WAS INCREASED FROM THE EX-V RATE TO THE EX-IV RATE. AS A","RESULT, THE PAYABLE SPECIAL RATES FOR STEPS 08, 09, AND 10 OF GS-15 FOR","SPECIAL RATE TABLE 0576 WERE INCREASED. SINCE YOUR NEW SPECIAL RATE IS","HIGHER THAN YOUR LOCALITY RATE, YOU ARE NO LONGER ENTITLED TO A LOCALITY","PAYMENT, BLOCK 20A REFLECTS YOUR NEW SPECIAL RATE, BLOCK 20B SHOWS A","$0.00 LOCALITY ADJUSTMENT. BLOCK 20C, ADJUSTED BASIC PAY, ALSO REFLECT","YOUR NEW SPECIAL RATE"," "]
[745,"N","2010-08-15","SALARY INCLUDES A 7.7% INCREASE IN LOCALITY-BASED PAYMENT TOTALING 16.52","(IN BLOCK 20B) DUE TO THE SUPPLEMENTAL APPROPRIATIONS ACT 2009 (PL111-32","SIGNED JUNE 24, 2009"," "," "," "," "," "," "]
[748,"N","1994-12-11","REASON FOR TERMINATION: ELIMINATION OF COUNTY COMMITTEE"," "," "," "," "," "," "," "," "]
["74I","N","1990-08-26","DUE TO REORGANIZATION"," "," "," "," "," "," "," "," "]
[750,"N","1995-10-01","REASON FOR FURLOUGH: ABSENCE OF A FY 1996 APPROPRIATION OR A CONTINUING","RESOLUTION."," "," "," "," "," "," "," "]
["75I","N","1990-08-26","CERTIFICATION HAS BEEN MADE THAT EMPLOYEE IS EXPECTED TO WORK 6 MONTHS O","MORE EACH YEAR."," "," "," "," "," "," "," "]
["75J","N","2005-05-15","BASED ON ANNUAL PAY REVIEW, INCREASE IN GRADE WITH NO INCREASE IN BASIC","PAY, DUE TO BUDGETARY CONSTRAINTS."," "," "," "," "," "," "," "]
[760,"N","2006-01-08","LOCALITY PAYMENT ACTION TO UPDATE ALTERNATE-GEOGRAPHIC-PERCENT FOR","OVERTIME PURPOSES ONLY."," "," "," "," "," "," "," "]
[761,"N","2006-01-08","ANNUAL MERIT INCREASE."," "," "," "," "," "," "," "," "]
[762,"N","2006-01-08","FEDERAL PAY INCREASE DUE TO: 5 U.S.C. 5303, SECTION 843 OF PUBLIC LAW","109-115, AND EXECUTIVE ORDER 13393, SIGNED 12/22/2005."," "," "," "," "," "," "," "]
[763,"N","2009-01-04","FEDERAL PAY INCREASE DUE TO LETTER DATED DECEMBER 23,2008 ISSUED BY THE","LIBRARIAN OF CONGRESS"," "," "," "," "," "," "," "]
[764,"N","2006-01-08","FEDERAL WAGE SYSTEM INCREASE APPROVED BY FEDERAL COORDINATED WAGE BOARD.","RETROACTIVE DUE TO DELAY IN RECEIVING APPROVED WAGE SCHEDULE."," "," "," "," "," "," "," "]
[765,"N","1997-09-14","REASON FOR TEMPORARY APPOINTMENT: TEMPORARY DISASTER EMPLOYEE."," "," "," "," "," "," "," "," "]
[766,"N","2007-01-07","PAY ADJUSTMENT APPROVED BY THE ADMINISTRATOR ON 01/07/2007 TO MAINTAIN","EXECUTIVE'S RELATIVE POSITION IN THE PAY RANGE."," "," "," "," "," "," "," "]
["76I","N","1990-08-26","COMPETITIVE ACTION."," "," "," "," "," "," "," "," "]
["76J","N","2005-05-15","BASED ON ANNUAL PAY REVIEW, NO GRADE OR BASIC PAY INCREASE, DUE TO","BUDGETARY CONSTRAINTS."," "," "," "," "," "," "," "]
[770,"N","1994-10-16","CHANGES DATA ELEMENT IN BLOCK 35."," "," "," "," "," "," "," "," "]
[771,"N","1995-01-22","THIS DOCUMENTS THE CORPORATION REORGANIZATION EFFECTIVE DECEMBER 1, 1994","AUTHORITY FOR CHANGE IS ANNOUNCEMENT OF OCTOBER 21, 1994."," "," "," "," "," "," "," "]
[772,"N","1992-12-27","PAY INCREASE AUTHORIZED BY THE DEPUTY ATTORNEY GENERAL ON DEC. 11, 1992"," "," "," "," "," "," "," "," "]
[773,"N","1991-06-30","THANK YOU FOR YOUR EFFORT ON BEHALF OF THE DECENNIAL CENSUS."," "," "," "," "," "," "," "," "]
[774,"N","1991-03-24","1991 MINIMUM WAGE RATE INCREASE"," "," "," "," "," "," "," "," "]
[775,"N","1987-06-07","I AGREE THAT THE SICK LEAVE BALANCE SHOWN IS CORRECT","EMPLOYEE SIGNATURE                       DATE"," "," "," "," "," "," "," "]
[776,"N","1986-10-12","NON-FEDERAL EMPLOYEE"," "," "," "," "," "," "," "," "]
[777,"N","1984-12-09","THIS ACTION REFLECTS A CHANGE IN SERVICING AGENCY UNDER WHICH OFFICE OF","PERSONNEL IS ASSUMING PERSONNEL PROCESSING FUNCTIONS."," "," "," "," "," "," "," "]
[778,"N","2024-01-14","FEDERAL PAY INCREASE DUE TO E.O. 14113 SIGNED 12/21/23."]
[779,"N","1984-10-14","SPECIAL SALARY INCREASE AUTHORIZED UNDER 5 USC 5303."," "," "," "," "," "," "," "," "]
["77A","N","1994-07-10","THIS PAY ADJUSTMENT IF EFFECTIVE RETROACTIVE TO JULY 10, 1994.  RETROACT","PAYMENTS WILL BE MADE THROUGH MANUAL PROCESSING."," "," "," "," "," "," "," "]
["77I","N","1990-08-26","EMPLOYEE INFORMED ON 00/00/00 OF ELIGIBILITY FOR COVERAGE BASED ON","DETERMINATION THAT PROBABLE PERIOD OF SERVICE WILL AMOUNT TO AT LEAST 6","MONTHS."," "," "," "," "," "," "]
[780,"N","1992-12-27","SALARY INCLUDES AN ADJUSTMENT TO THE NEW 12/31/92 MINIMUM OF THE GRADE"," "," "," "," "," "," "," "," "]
[781,"N","1984-10-14","YOUR SALARY WAS IN THE LOWER 1/3 OF YOUR GRADE PAY RANGE - YOUR COMPOSIT","RATING ENTITLED YOU TO A FULL STEP INCREASE."," "," "," "," "," "," "," "]
[782,"N","1984-10-14","YOUR SALARY WAS IN THE UPPER 2/3 OF YOUR GRADE PAY RANGE - YOUR","COMPOSITE RATING ENTITLED YOU TO A FULL STEP INCREASE."," "," "," "," "," "," "," "]
[783,"N","1984-10-14","YOUR SALARY WAS IN THE UPPER 2/3 OF YOUR GRADE PAY RANGE - YOUR","COMPOSITE RATING ENTITLED YOU TO HALF OF A STEP INCREASE."," "," "," "," "," "," "," "]
[784,"N","1984-10-14","YOUR SALARY WAS IN THE UPPER 2/3 OF YOUR GRADE PAY RANGE - YOUR","COMPOSITE RATING ENTITLED YOU TO A THIRD OF A STEP INCREASE."," "," "," "," "," "," "," "]
[785,"Y","1988-01-10","NEW SALARY INCLUDES A PERFORMANCE PAY INCREASE OF $@        @"," "," "," "," "," "," "," "," "]
[786,"N","1988-01-10","NEW SALARY INCLUDES ZERO PERFORMANCE PAY INCREASE."," "," ","A ZERO MERIT INCREASE\"."," "," "," "," "," "]
[787,"N","1988-01-10","INELIGIBLE FOR PERFORMANCE PAY INCREASE BECAUSE SALARY IS ALREADY AT OR","ABOVE THE MAXIMUM RATE OF BASIC PAY FOR THE EMPLOYEE'S POSITION."," ","EMPLOYEE'S POSITION\".  PRESENTLY, THE REMARK INCLUDES THE WORK MERIT","INSTEAD OF PERFORMANCE PAY INCREASE."," "," "," "," "]
[788,"N","1994-09-04","THE INDIVIDUAL IS A VOLUNTEER MEMBER OF AMERICORP AND IS NOT CONSIDERED","FEDERAL EMPLOYEE NOR IS THIS PERSON ENTITLED TO FUTURE BENEFITS BASED ON","THE VOLUNTEER SERVICE."," "," "," "," "," "," "]
[789,"Y","1988-01-10","NEW SALARY INCLUDES A PERFORMANCE PAY INCREASE OF $@        @  FULL","AMOUNT OF PERFORMANCE PAY INCREASE ENTITLEMENT CANNOT BE GRANTED BECAUSE","THE ENTITLEMENT WOULD CAUSE THE MAXIMUM RATE TO BE EXCEEDED.","PAY INCREASE ENTITLEMENT CANNOT BE GRANTED BECAUSE THE ENTITLEMENT WOULD","CAUSE THE MAXIMUM RATE TO BE EXCEEDED\".  PRESENTLY, THE REMARK INCLUDES","THE WORK MERIT INSTEAD OF PERFORMANCE PAY INCREASE."," "," "," "]
["78I","N","1990-08-26","SUMMER AIDE PROGRAM. EMPLOYEE TO PERFORM SIMPLE, ROUTINE, REPETITIVE","OFFICE DUTIES. TOTAL WORK UNDER THIS APPOINTMENT MUST NOT EXCEED 700","HOURS."," "," "," "," "," "," "]
[790,"N","1993-01-01","AWARD HOURS MUST BE USED WITHIN 1 YEAR"," "," "," "," "," "," "," "," "]
[791,"N","1993-01-01","AWARD HOURS MUST BE USED WITHIN 1 YEAR."," "," "," "," "," "," "," "," "]
[792,"N","1994-04-17","SALARY IN BLOCK 20 CONSISTS OF A COMBINATION OF A SPECIAL SALARY RATE AN","A PARTIAL LOCALITY PAYMENT.  AMOUNT OF THE LOCALITY PAYMENT IS SHOWN IN","BLOCK 20B."," "," "," "," "," "," "]
[793,"N","1994-01-01","NON-CASH AWARD PROCESSED IN ACCORDANCE WITH SPECIAL ANNOUNCEMENT 94-20,","DATED 06/21/94"," "," "," "," "," "," "," "]
[794,"N","1994-01-01","SALARY BLOCK CONTAINS TOTAL CASH AWARD AMOUNT, INCLUDING TAXES WITHHELD."," "," "," "," "," "," "," "," "]
[795,"N","1994-05-01","CHANGES POSITION SENSITIVITY CODE TO 5"," "," "," "," "," "," "," "," "]
[796,"N","1994-05-01","CHANGES POSITION SENSITIVITY CODE TO 6"," "," "," "," "," "," "," "," "]
[797,"N","1994-10-16","CERTIFICATION BY AGENCY HEAD EFFECTIVE 10/31/94."," "," "," "," "," "," "," "," "]
[799,"N","1982-01-01","PINE ERROR RELEASE CODE - WHEN PRD CODE IS NOT REQUIRED"," "," "," "," "," "," "," "," "]
["79I","N","1990-08-26","ASSIGNMENT TO A NON-CLERICAL PERSONNEL OR TRAINING POSITION."," "," "," "," "," "," "," "," "]
["79L","N","2012-01-01","AWARD HOURS MUST BE USED WITHIN 6 MONTHS                                ","                                                                        ","                                                                        ","                                                                       ","                                                                       ","                                                                       ","                                                            "," "," "]
["7A2","N","2004-04-01","TOTAL WORK UNDER THIS APPT MUST NOT EXCEED 180 DAYS."," "," "," "," "," "," "," "," "]
["7A3","N","2004-04-01","APPOINTMENT MADE UNDER GENERAL AGREEMENT WITH THE OFFICE OF PERSONNEL","MANAGEMENT."," "," "," "," "," "," "," "]
["7A4","N","2004-04-01","EMPLOYEE WILL WORK A PART-TIME TOUR OF DUTY BASED ON THE BLS CPI","ANNUAL CALENDAR. A COPY OF THE CALENDAR IS IN THE OPF. EMPLOYEE IS","EXPECTED TO WORK HOURS IN ADDITION TO SCHEDULED TOUR AS NEEDED.","NUMBER OR WEEKS PER CALENDAR YEAR     AND AVERAGE HOURS PER WEEK     ."," "," "," "," "," "]
["7A5","N","2004-04-01","THIS APPOINTMENT MAY BE TERMINATED AT ANY TIME IF YOUR SERVICES ARE","NO LONGER NEEDED OR FUNDS ARE NOT AVAILABLE."," "," "," "," "," "," "," "]
["7A6","N","2004-04-01","THIS VOLUNTEER IS EXPECTED TO SERVE    HOURS PER WEEK."," "," "," "," "," "," "," "," "]
["7A7","N","2004-04-01","ESTIMATED EMPLOYEE WILL WORK     DAYS DURING THE SERVICE YEAR."," "," "," "," "," "," "," "," "]
["7A8","N","2004-04-01","NO REGULAR TOUR OF DUTY ESTABLISHED.  NOT ELIGIBLE FOR ANNUAL OR","SICK LEAVE."," "," "," "," "," "," "," "]
["7AA","N","2004-04-01","CONVERTED FROM EXCEPTED SERVICE WITHOUT BREAK IN SERVICE."," "," "," "," "," "," "," "," "]
["7AB","N","2004-04-01","EXERCIES REEMPLOYMENT RIGHTS UNDER REG 352-204."," "," "," "," "," "," "," "," "]
["7AC","N","2004-04-01","NO PRIOR FEDERAL SERVICE."," "," "," "," "," "," "," "," "]
["7AD","N","2004-04-01","REGULAR TOUR OF DUTY ESTABLISHED; ELIGIBLE FOR ANNUAL AND SICK","LEAVE ACCRUAL."," "," "," "," "," "," "," "]
["7AE","N","2004-04-01","SERVICE TO BE VERIFIED."," "," "," "," "," "," "," "," "]
["7AG","N","2004-04-01","SUBJECT TO MEETING PHYSICAL REQUIREMENTS OF POSITION."," "," "," "," "," "," "," "," "]
["7AH","N","2004-04-01","SUBJECT TO TRANSFER WITHIN THE REGION."," "," "," "," "," "," "," "," "]
["7AI","N","2004-04-01","SUBJECT TO INTERSTATION TRANSFER."," "," "," "," "," "," "," "," "]
["7AJ","N","2004-04-01","SUBJECT TO TRANSFER WITHIN AND BETWEEN THE REGION AS THE EFFICIENCY","OF THE SERVICE MAY REQUIRE."," "," "," "," "," "," "," "]
["7AL","N","2004-04-01","REGULAR TOUR OF DUTY ESTABLISHED CONSISTING OF ONE OR MORE DAYS DURING","EACH ADMINISTRATIVE WORKWEEK.  ELIGIBLE FOR ANNUAL AND SICK LEAVE.","PAYMENT AUTHORIZED FOR HOLIDAY NOT WORKED IF IT OCCURS IN REGULAR","TOUR OF DUTY."," "," "," "," "," "]
["7AM","N","2004-04-01","THIS APPOINTMENT IS SUBJECT TO MEETING SPECIAL CONDITIONS OF EMPLOYMENT","FOR THE POSITION."," "," "," "," "," "," "," "]
["7AN","N","2004-04-01","SUBJECT TO SATISFACTORY PERFORMANCE OF ASSIGNED DUTIES AND SATISFACTORY","PROGRESS UNDER EMPLOYEE'S PROGRAM OF EDUCATION AND TRAINING."," "," "," "," "," "," "," "]
["7AO","N","2004-04-01","THIS EMPLOYEE IS SUBJECT TO MEETING THE SPECIAL CONDITIONS FOR THIS","POSITION."," "," "," "," "," "," "," "]
["7AP","N","2004-04-01","EMPLOYEE'S REGULAR TOUR OF DUTY INCLUDES SUNDAY."," "," "," "," "," "," "," "," "]
["7AQ","N","2004-04-01","REGULAR TOUR OF DUTY NO LONGER INCLUDES SUNDAYS."," "," "," "," "," "," "," "," "]
["7AR","N","2004-04-01","SUBJECT TO MEETING THE REQUIRED MEDICAL CLEARANCE AND SATISFACTORY","SUITABILITY INVESTIGATION."," "," "," "," "," "," "," "]
["7AS","N","2004-04-01","EMPLOYEE'S WORK WEEK IS SCHEDULED TO BE 40 HOURS ON A ROTATING BASIS.","EMPLOYEE AUTHORIZED NIGHT DIFFERENTIAL AND PREMIUM PAY FOR WORK ON","SUNDAY AND HOLIDAYS WHEN WORK ON THESE DAYS FALL WITHIN WORK SCHEDULE."," "," "," "," "," "," "]
["7AU","N","2004-04-01","SERVES AT THE PLEASURE OF THE PRESIDENT."," "," "," "," "," "," "," "," "]
["7AV","N","2004-04-01","SERVES AT THE PLEASURE OF THE SECRETARY."," "," "," "," "," "," "," "," "]
["7AW","N","2004-04-01","POSITION COVERED UNDER THE ETHICS IN GOVERNMENT ACT-FINANCIAL DISCLOSURE","TO BE REQUESTED."," "," "," "," "," "," "," "]
["7AX","N","2004-04-01","INELIGIBLE FOR ANNUAL LEAVE ACCRUALS."," "," "," "," "," "," "," "," "]
["7AY","N","2004-04-01","POSITION LIMITED TO THE COMPLETION OF REQUIREMENTS OF LAW SCHOOL","GRADUATION."," "," "," "," "," "," "," "]
["7B1","N","2004-04-01","THIS PAY ADJUSTMENT (MOVEMENT TO A NEW SES PAY SYSTEM) REFLECTS SES","MEMBERS' NEW RATE OF BASIC PAY EFFECTIVE JANUARY 11, 2004.  THIS ACTION","COMBINES THE SES MEMBERS' 2003 RATE OF BASIC PAY WITH ANY LOCALITY","PAYMENT IN EFFECT IMMEDIATELY PRIOR TO JANUARY 11, 2004.  IN ADDITION,","THIS NEW PAY SYSTEM ELIMINATES THE SIX (6) ES PAY LEVELS AND ESTABLISHES","A SINGLE PAY BAND."," "," "," "]
["7BA","N","2004-04-01","HEALTH BENEFITS COVERAGE CONTINUES.  EMPLOYEE'S SHARE WILL BE PAID","DIRECTLY BY THEM TO THE DEPARTMENT'S OFFICE OF ACCOUNTING AND PAYMENT","SERVICES."," "," "," "," "," "," "]
["7BC","N","2004-04-01","RETROACTIVE ADJUSTMENT TO FEGLI DEDUCTIONS REQUIRED."," "," "," "," "," "," "," "," "]
["7BD","N","2004-04-01","YOUR FEDERAL GROUP LIFE INSURANCE WILL TERMINATE 31 DAYS AFTER EFFECTIVE","DATE.  YOU MAY CONTINUE INSURANCE COVERAGE WITHOUT MEDICAL EXAMINATION","BY CONVERTING TO AN INDIVIDUAL POLICY.  TO CONVERT COMPLETE THE ENCLOSED","SF 2821, AGENCY CERTIFICATION OF INSURANCE STATUS, ACCORDING TO","INSTRUCTION ON THE FORM AND SEND IT TO THE O/FEGLI, 4 E 24TH ST, NY","WITHIN 31 DAYS AFTER EFFECTIVE DATE, OR WITHIN 15 DAYS AFTER DATE IN ITE","8 OF SF 2821, WHICHEVER GIVES YOU MORE TIME."," "," "]
["7BE","N","2004-04-01","HEALTH BENEFITS WILL BE TRANSFERRED."," "," "," "," "," "," "," "," "]
["7BF","N","2004-04-01","NO RETIREMENT DEDUCTIONS WILL BE MADE IN ACCORDANCE WITH SECTION","  OF THE CIVIL SERVICE RETIREMENT ACT."," "," "," "," "," "," "," "]
["7BG","N","2004-04-01","ACTION EFFECTED TO CHANGE A FEDERAL JUNIOR FELLOWSHIP PARTICIPANT TO A","TEMPORARY APPOINTMENT DURING A STUDY PERIOD."," "," "," "," "," "," "," "]
["7BJ","N","2004-04-01","AWARDED SECRETARY OF LABOR'S CAREER SERVICE AWARD.  ONE YEAR OF PAID","LEAVE FOR STUDY AND RESEARCH RELATED TO DEPARTMENTAL OBJECTIVES AND","PERSONAL CAREER GOALS COMMENCING ON THE EFFECTIVE DATE OF THIS ACTION."," "," "," "," "," "," "]
["7BK","N","2004-04-01","EMPLOYEE HAS EXECUTED A SERVICE COMMITMENT WITH           WHICH EXPIRES","  -  -  ."," "," "," "," "," "," "," "]
["7CB","N","2004-04-01","ADMINISTRATIVE ERROR."," "," "," "," "," "," "," "," "]
["7CC","N","2004-04-01","RETROACTIVE PAY ADJUSTMENT DUE EMPLOYEE FROM   -  -   TO   -  -  ."," "," "," "," "," "," "," "," "]
["7CD","N","2004-04-01","RETROACTIVE PAY ADJUSTMENT DUE GOVERNMENT FROM   -  -   TO   -  -  ."," "," "," "," "," "," "," "," "]
["7CE","N","2004-04-01","RETROACTIVE LEAVE ADJUSTMENT DUE."," "," "," "," "," "," "," "," "]
["7CF","N","2009-07-05","SALARY INCLUDES A BASE PAY INCREASE AND/OR A LOCALITY PAYMENT","APPLICABLE IN THIS AREA."," ","SALARY INCLUDES A BASE PAY INCREASE AND/OR A LOCALITY PAYMENT APPLICABLE","IN THIS AREA"," "," "," "," "]
["7CG","N","2009-07-05","SALARY INCLUDES A MERIT PAY INCREASE AND A LOCALITY PAYMENT APPLICABLE I","THIS AREA."," "," "," "," "," "," "," "]
["7CH","N","2009-07-05","LUMP SUM DUE TO CAP ON BASE PAY AND/OR TOTAL SALARY IN ACCORDANCE WITH","CFTC PAY POLICY."," "," "," "," "," "," "," "]
["7CL","N","2023-01-01","SALARY INCLUDES A GENERAL INCREASE OF 2% ROUNDED AND A LOCALITY PAYMENT","(OR OTHER GEOGRAPHICAL ADJUSTMENT), APPLICABLE IN THE AREA."]
["7D1","N","2004-04-01","THIS IS A CAREER ENHANCEMENT PROGRAM POSITION."," "," "," "," "," "," "," "," "]
["7D2","N","2004-04-01","EMPLOYEE HAS NOW REACHED THE TARGETED POSITION UNDER THE CAREER","ENHANCEMENT PROGRAM."," "," "," "," "," "," "," "]
["7D4","N","2004-04-01","LIFE INSURANCE WILL BE TRANSFERRED TO OPM."," "," "," "," "," "," "," "," "]
["7EA","N","2004-04-01","EMPLOYEE CONTINUES TO BE SUBJECT TO A SATISFACTORY PROBATIONARY OR TRIAL","PERIOD OF 1 YEAR."," "," "," "," "," "," "," "]
["7EB","N","2004-04-01","THE EMPLOYEE WAS INFORMED IN ADVANCE OF THE CONDITION(S) OF THIS POSITIO"," "," "," "," "," "," "," "," "]
["7FE","N","2024-01-14","PAY INCREASE DUE TO ADMINISTRATOR MEMO SIGNED 01/08/2024."]
["7K1","N","2004-04-01","THIS ACTION INVOLVES MOVEMENT FROM A NONSUPERVISORY POSITION TO","SUPERVISORY POSITION."," "," "," "," "," "," "," "]
["7K2","N","2004-04-01","PREVIOUSLY COMPETED FOR                  , ANNOUNCEMENT                ."," "," "," "," "," "," "," "," "]
["7K3","N","2004-04-01","NOT SUBJECT TO CLASSIFICATION ACT.  POSITION DESCRIPTION NUMBER AND SERI","FOR REFERENCE PURPOSE ONLY."," "," "," "," "," "," "," "]
["7K4","N","2004-04-01","FROM REASSIGNMENT NTE   -  -  ."," "," "," "," "," "," "," "," "]
["7K5","N","2004-04-01","PROJECTED POSITION TO BE REVIEWED WITHIN     DAYS."," "," "," "," "," "," "," "," "]
["7K6","N","2004-04-01","RESULT OF CORRECTION OF PREVIOUS CLASSIFICATION ERROR."," "," "," "," "," "," "," "," "]
["7K7","N","2004-04-01","THIS IS A DETAIL TO UNCLASSIFIED DUTIES NOT TO EXCEED 120 DAYS."," "," "," "," "," "," "," "," "]
["7K8","N","2004-04-01","MERIT STAFFING EXCEPTION-TEMPORARY APPOINTMENT LESS THAN ONE YEAR."," "," "," "," "," "," "," "," "]
["7K9","N","2004-04-01","THIS PROMOTION MAY BE MADE PERMANENT OR EXTENDED FOR AN ADDITIONAL","YEAR WITHOUT FURTHER COMPETITION."," "," "," "," "," "," "," "]
["7KA","N","2004-04-01","EMPLOYEE CONSENTED TO ACCEPT POSITION AT LOWER GRADE."," "," "," "," "," "," "," "," "]
["7KB","N","2004-04-01","THIS POSITION LIMITED TO INCUMBENT ONLY."," "," "," "," "," "," "," "," "]
["7KC","N","2004-04-01","THIS ACTION APPROVED AS REQUIRED BY APPROPRIATE SECRETARY ORDER ON","DELEGATION AND REDELEGATION OF PERSONNEL MANAGEMENT AUTHORITY."," "," "," "," "," "," "," "]
["7KD","N","2004-04-01","RESULT OF CLASSIFICATION SURVEY."," "," "," "," "," "," "," "," "]
["7KE","N","2004-04-01","MERIT STAFFING EXCEPTION-PRIOR COMPETITION."," "," "," "," "," "," "," "," "]
["7KF","N","2004-04-01","MERIT STAFFING SELECTION."," "," "," "," "," "," "," "," "]
["7KG","N","2004-04-01","MERIT STAFFING EXCEPTION."," "," "," "," "," "," "," "," "]
["7KH","N","2004-04-01","MERIT STAFFING EXCEPTION-CAREER LADDER PROMOTION."," "," "," "," "," "," "," "," "]
["7KI","N","2004-04-01","MERIT STAFFING EXCEPTION-ENTRANCE LEVEL POSITION."," "," "," "," "," "," "," "," "]
["7KJ","N","2004-04-01","MERIT STAFFING EXCEPTION-EXERCISING REEMPLOYMENT RIGHTS."," "," "," "," "," "," "," "," "]
["7KK","N","2004-04-01","MERIT STAFFING EXCEPTION-MATERIAL MODIFICATION OF DUTIES."," "," "," "," "," "," "," "," "]
["7KL","N","2004-04-01","MERIT STAFFING EXCEPTION-REDESCRIPTION OF DUTIES."," "," "," "," "," "," "," "," "]
["7KM","N","2004-04-01","MERIT STAFFING EXCEPTION-TRAINING AGREEMENT."," "," "," "," "," "," "," "," "]
["7KN","N","2004-04-01","POSITION FILLED BELOW ESTABLISHED OR ANTICIPATED GRADE."," "," "," "," "," "," "," "," "]
["7KO","N","2004-04-01","YOU WILL BE RETURNED TO YOUR PERMANENT POSITION OR A COMPARABLE POSITION"," "," "," "," "," "," "," "," "]
["7KP","N","2004-04-01","MATERIAL MODIFICATION OF DUTIES."," "," "," "," "," "," "," "," "]
["7KQ","N","2004-04-01","CAREER PROMOTION THROUGH ACCRETION OF HIGHER LEVEL OF DUTIES."," "," "," "," "," "," "," "," "]
["7KR","N","2004-04-01","TYPE OF APPOINTMENT, POSITION, GRADE, OCCUPATIONAL SERIES, AND SALARY","REMAIN UNCHANGED."," "," "," "," "," "," "," "]
["7KS","N","2004-04-01","THIS IS AN UPWARD MOBILITY POSITION."," "," "," "," "," "," "," "," "]
["7KU","N","2004-04-01","THIS POSITION IS INSIDE THE BARGAINING UNIT-LOCAL 12."," "," "," "," "," "," "," "," "]
["7KV","N","2004-04-01","THIS POSITION IS INSIDE THE BARGAINING UNIT-NCFLL."," "," "," "," "," "," "," "," "]
["7KW","N","2004-04-01","THIS POSITION IS INSIDE THE BARGAINING UNIT-NULI."," "," "," "," "," "," "," "," "]
["7KX","N","2004-04-01","THIS POSITION IS OUTSIDE THE BARGAINING UNIT."," "," "," "," "," "," "," "," "]
["7KY","N","2004-04-01","THIS POSITION IS INSIDE THE BARGAINING UNIT-NTEU CHAPTER 211."," "," "," "," "," "," "," "," "]
["7KZ","N","2004-04-01","THIS ACTION IS IN ACCORDANCE WITH REDUCTION-IN-FORCE PROCEDURES."," "," "," "," "," "," "," "," "]
["7LA","N","2004-04-01","MERIT STAFFING EXCEPTION-REASSIGNMENT TO POSITION WITH NO GREATER","PROMOTION POTENTIAL THAN POSITION CURRENTLY HELD."," "," "," "," "," "," "," "]
["7M1","N","2004-04-01","SALARY INCREASE BASED ON                                         ."," "," "," "," "," "," "," "," "]
["7MB","N","2004-04-01","THIS ACTION EFFECTED UNDER THE FOREIGN ASSISTANCE ACT OF 1961 AS AMENDED"," "," "," "," "," "," "," "," "]
["7MC","N","2004-04-01","STANDARD REGULATION (GOVERNMENT CIVILIAN FOREIGN AREA, CH 500, SEC 550)","APPLY TO THIS APPOINTMENT.  SALARY AND POST DIFFERENTIAL ARE LIMITED TO","ONE HUNDRED DOLLARS LESS THAN PER ANNUM SALARY OF THE EXECUTIVE LEVEL I.","PAYMENT TO BE MADE ON BIWEEKLY BASIS.  ANNUAL LEAVE CEILING OF 360 HOURS","POST DIFFERENTIAL OF 20% WILL BEGIN ON ARRIVAL AT POST."," "," "," "," "]
["7MD","N","2004-04-01","REEMPLOYMENT RIGHTS IN THE BUREAU OF INTERNATION LABOR AFFAIRS, OFFICE O","PROGRAM DEVELOPMENT AND COORDINATION, DIVISION OF INTERNATIONAL TECHNICA","ASSISTANCE, WASHINGTON, DC."," "," "," "," "," "," "]
["7ME","N","2004-04-01","APPOINTMENT SUBJECT TO CONDITIONS OF \"EMPLOYMENT AGREEMENT FOR PERSONS","ASSIGNED TO POSTS OUTSIDE THE CONTINENTAL U.S.\""," "," "," "," "," "," "," "]
["7MF","N","2004-04-01","SELECTED FROM REEMPLOYENT PRIORITY LIST DATED   -  -  ."," "," "," "," "," "," "," "," "]
["7MG","N","2004-04-01","EMPLOYEE CHANGED TO LOWER GRADE WITHOUT PERSONAL CAUSE AND NOT AT","EMPLOYEE'S REQUEST."," "," "," "," "," "," "," "]
["7MH","N","2004-04-01","THIS ACTION IS IN ACCORDANCE WITH ADVERSE ACTION PROCEDURES."," "," "," "," "," "," "," "," "]
["7MI","N","2004-04-01","SUCCESSOR POSITION-EMPLOYEE RETAINED IN THE COMPETITIVE SERVICE."," "," "," "," "," "," "," "," "]
["7MJ","N","2004-04-01","TRANSFER IS AT NO EXPENSE TO THE GOVERNMENT."," "," "," "," "," "," "," "," "]
["7MK","N","2004-04-01","TRANSFER IS AT THE EXPENSE OF THE GOVERNMENT."," "," "," "," "," "," "," "," "]
["7ML","N","2004-04-01","THIS ACTION HAS BEEN APPROVED BY THE ASSISTANT SECRETARY FOR","ADMINISTRATIVE AND MANAGEMENT."," "," "," "," "," "," "," "]
["7MM","N","2004-04-01","ENTITLED TO SPECIAL CONSIDERATION FOR REPROMOTION UNTIL   -  -  ."," "," "," "," "," "," "," "," "]
["7MN","N","2004-04-01","WITH REEMPLOYMENT RIGHTS IN THE DEPARTMENT OF LABOR."," "," "," "," "," "," "," "," "]
["7MO","N","2004-04-01","IT IS ESTIMATED THAT EMPLOYEE WILL SERVE     DAYS DURING THE 365 DAY","PERIOD BEGINNING   -  -  . HE/SHE IS A SPECIAL GOVERNMENT EMPLOYEE."," "," "," "," "," "," "," "]
["7MQ","N","2004-04-01","NON-PAY STATUS TOTALED     WORKDAYS."," "," "," "," "," "," "," "," "]
["7MR","N","2004-04-01","THIS ACTION IS BASED ON PERFORMANCE APPRAISAL DATED         ."," "," "," "," "," "," "," "," "]
["7MS","N","2004-04-01","IT IS ESTIMATED THAT EMPLOYEE WILL SERVE      DAYS DURING THE 365-DAY","PERIOD BEGINNING   -  -  . HE/SHE IS A REGULAR GOVERNMENT EMPLOYEE."," "," "," "," "," "," "," "]
["7MT","N","2004-04-01","THIS TRANSFER IS NOT FOR YOUR CONVENIENCE. EXPENSES WILL BE ALLOWED IN","ACCORDANCE WITH PL 89-554, APPROVED 9-6-66 AS AMENDED, & REGULATIONS","ISSUED THEREUNDER BY GAO TRAVEL AUTHORIZATION WHICH IS MADE A PART OF TH","TRANSFER WILL BE ISSUED, TRAVEL SHALL NOT COMMENCE & GOVERNMENT SHALL NO","BE OBLIGATED FOR ANY EXPENSE OF THIS TRANSFER UNTIL EMPLOYMENT AGREEMENT"," HAS BEEN SIGNED AND RETURNED TO THE APPOINTING OFFICE AND FORM 100-3 HA","BEEN SIGNED BY THE APPROPRIATE FISCAL OFFICER."," "," "]
["7MU","N","2004-04-01","THIS ACTION CORRECTS THE SALARY TO REFLECT MERIT INCREASE OF","OCTOBER 13, 1985."," "," "," "," "," "," "," "]
["7MV","N","2004-04-01","NAME CHANGED DUE TO A COURT ORDER."," "," "," "," "," "," "," "," "]
["7MW","N","2004-04-01","POSITION SUBJECT TO DRUG TESTING."," "," "," "," "," "," "," "," "]
["7MX","N","2004-04-01","SALARY       THE                                      ."," "," "," "," "," "," "," "," "]
["7MY","N","2004-04-01","EMPLOYEE NOT ENTITLED TO A PAY ADJUSTMENT."," "," "," "," "," "," "," "," "]
["7MZ","N","2004-04-01","SALARY MADE ABOVE THE MINIMUM."," "," "," "," "," "," "," "," "]
["7NA","N","2004-04-01","RETAINS SEVERANCE PAY ENTITLEMENT."," "," "," "," "," "," "," "," "]
["7P1","N","2019-01-06","Results of the Foreign Service Selection Board."]
["7P2","N","2024-01-14","FEDERAL PAY INCREASE INCLUDES A BASIC PAY INCREASE OF 4.7%. THE PAY","ADJUSTMENT IS AUTHORIZED BY TITLE 14 WITH DHS APPROVAL DATED 02/05/19","AND MATCHES INCREASE AUTHORIZED IN E.O. 14113."]
["7P3","N","2016-01-10","EMPLOYEE COMPENSATED AT THE RATE PROVIDED FOR LEVEL III OF THE EXECUTIVE"," SCHEDULE, PLUS 3%."]
["7P4","N","2016-01-10","EXECUTIVE SCHEDULE OFFICIALS ARE NOT AUTHORIZED TO RECEIVE LOCALITY PAY","MENTS"]
["7PA","N","2004-04-01","PAY RATE IS SUBJECT TO RETROACTIVE ADJUSTMENT UPON VERIFICATION OF PRIOR","SERVICE."," "," "," "," "," "," "," "]
["7PB","N","2004-04-01","PLUS COST OF LIVING ALLOWANCE."," "," "," "," "," "," "," "," "]
["7PC","N","2004-04-01","SALARY SUBJECT TO DEDUCTIONS OF ANNUITY AS COMPUTED BY OPM."," "," "," "," "," "," "," "," "]
["7PD","N","2004-04-01","SALARY DOES NOT EXCEED HIGHEST RATE LEGALLY PAYABLE."," "," "," "," "," "," "," "," "]
["7PE","N","2004-04-01","WITHIN GRADE INCREASE EFFECTIVE SAME DAY HAS BEEN PROCESSED."," "," "," "," "," "," "," "," "]
["7PF","N","2004-04-01","COMPENSATION SHALL BE PAID AT THE FULL DAILY RATE FOR EACH FULL DAY","SERVICE IS PERFORMED AND/OR TRAVEL BEYOND NORMAL COMMUTING IS REQUIRED T","PROVIDE SERVICE. FOR PARTIAL DAYS ON WHICH SERVICE OR NON-COMMUTING TRAV","IS PERFORMED, COMPENSATION SHALL BE PAID AT THE RATE OF 1/8 OF THE DAILY","RATE FOR EACH HOUR ROUNDED TO THE NEAREST WHOLE DOLLAR. NO COMPENSATION","SHALL BE PAID FOR DAYS ON (WHICH ONLY TRAVEL IS PERFORMED, IF SUCH TRAVE","DOES NOT OCCUR DURING NORMAL HOURS.)"," "," "]
["7PG","N","2004-04-01","SALARY DOES NOT EXCEED HIGHEST RATE LEGALLY PAYABLE AND SET IN ACCORDANC","WITH SECTIONS 416.6 AND 432.4 OF THE AID MANUAL."," "," "," "," "," "," "," "]
["7PH","N","2004-04-01","RATE OF BASIC PAY IS LIMITED BY SECTION 5308 OF TITLE V OF THE U.S. CODE","TO THE RATE FOR LEVEL V OF THE EXECUTIVE SCHEDULE."," "," "," "," "," "," "," "]
["7PI","N","2004-04-01","TOTAL ANNUAL PAY AND ALLOWANCE MUST NOT EXCEED          . ANNUAL LEAVE","CEILING OF 360 HOURS."," "," "," "," "," "," "," "]
["7PJ","N","2004-04-01","EMPLOYEE ENTITLED TO HIGHEST PREVIOUS RATE OF                        ."," "," "," "," "," "," "," "," "]
["7PK","N","2004-04-01","ADDITIONAL COMPENSATION AT THE RATE OF 1/8TH OF THE DAILY RATE STATED IN","ITEM 25 FOR EACH ADDITIONAL HOUR IS AUTHORIZED FOR TIME WORKED IN EXCESS","OF 8 HOURS ON ANY WORKDAY UNDER APPROPRIATE AUTHORIZATION OR APPROVAL, B","TOTAL PAY FOR THE DAY MAY NOT EXCEED THE MAXIMUM RATE OF GS-15."," "," "," "," "," "]
["7PL","N","2004-04-01","ADDITIONAL COMPENSATION AT THE RATE OF 1/8 OF THE DAILY RATE STATED IN","ITEM 25 FOR EACH HOUR IS AUTHORIZED FOR TIME WORKED ON SATURDAY AFTER","COMPLETION OF THE REGULAR 40 HOUR WORKWEEK, BUT TOTAL PAY FOR THE DAY","MAY NOT EXCEED THE MAXIMUM RATE OF GS-15."," "," "," "," "," "]
["7PM","N","2004-04-01","AS A RESULT OF THIS PERSONNEL ACTION, YOUR RIGHTS TO HAVE UNION DUES","WITHHELD TERMINATES."," "," "," "," "," "," "," "]
["7PN","N","2004-04-01","NO LUMP SUM LEAVE PAYMENT."," "," "," "," "," "," "," "," "]
["7PQ","N","2004-04-01","EMPLOYEE BECAME SUBJECT TO 7 1/2% FERS DEDUCTION EFFECTIVE   -  -  ."," "," "," "," "," "," "," "," "]
["7Q1","N","2004-04-01","SALARY BLOCKS CONTAINS AWARD AMOUNT IN WHOLE HOUR INCREMENTS."," "," "," "," "," "," "," "," "]
["7RC","N","2004-04-01","HEALTH CONDITION REQUIRES THAT EMPLOYMENT BE TERMINATED."," "," "," "," "," "," "," "," "]
["7RD","N","2004-04-01","PENDING DISABILITY RETIREMENT."," "," "," "," "," "," "," "," "]
["7RE","N","2004-04-01","TO ENTER LAW PRACTICE."," "," "," "," "," "," "," "," "]
["7RL","N","2004-04-01","ACCEPTED EMPLOYMENT WITHOUT BREAK IN SERVICE. ELIGIBLE TO TRANSFER LEAVE"," "," "," "," "," "," "," "," "]
["7S1","N","2004-04-01","EMPLOYEE RETIRED VOLUNTARILY BASED ON AGE AND SERVICE."," "," "," "," "," "," "," "," "]
["7S2","N","2004-04-01","REFUSED EXTENSION OF APPOINTMENT."," "," "," "," "," "," "," "," "]
["7S3","N","2004-04-01","EMPLOYEE RETIRED TO TAKE ADVANTAGE OF COST OF LIVING ANNUITY BONUS."," "," "," "," "," "," "," "," "]
["7S4","N","2004-04-01","SEPARATION DUE TO CHANGE IN ADMINISTRATION."," "," "," "," "," "," "," "," "]
["7SN","N","2004-04-01","DOCTOR RECOMMENDS JOB LESS HARMFUL TO HEALTH."," "," "," "," "," "," "," "," "]
["7SO","N","2004-04-01","DOCTOR RECOMMENDS TERMINATION BECAUSE OF HEALTH."," "," "," "," "," "," "," "," "]
["7SP","N","2004-04-01","SEEKING FULL-TIME EMPLOYMENT."," "," "," "," "," "," "," "," "]
["7SQ","N","2004-04-01","DUE TO LACK OF FUNDS."," "," "," "," "," "," "," "," "]
["7SR","N","2004-04-01","BODILY HARM."," "," "," "," "," "," "," "," "]
["7SS","N","2004-04-01","CONDUCT UNBECOMING TO A FEDERAL EMPLOYEE."," "," "," "," "," "," "," "," "]
["7ST","N","2004-04-01","BRIBERY."," "," "," "," "," "," "," "," "]
["7SU","N","2004-04-01","MISUSE OF GOVERNMENT EMPLOYMENT/OFFICIAL POSITION/OFFICIAL INFORMATION."," "," "," "," "," "," "," "," "]
["7SW","N","2004-04-01","VOLUNTARILY RETIRED TO OBTAIN RETIREMENT BENEFITS. NO OTHER INFORMATION","AVAILABLE."," "," "," "," "," "," "," "]
["7SX","N","2004-04-01","VOLUNTARILY RETIRED IN LIEU OF INVOLUNTARY SEPARATION DUE TO RIF","SITUATION."," "," "," "," "," "," "," "]
["7SY","N","2004-04-01","VOLUNTARILY RETIRED IN LIEU OF DISABILITY RETIREMENT."," "," "," "," "," "," "," "," "]
["7SZ","N","2004-04-01","VOLUNTARILY RETIRED IN LIEU OF CHANGE TO LOWER GRADE."," "," "," "," "," "," "," "," "]
["7TA","N","2004-04-01","EMPLOYEE ACQUIRED COMPETITIVE STATUS UPON APPOINTMENT."," "," "," "," "," "," "," "," "]
["7TB","N","2004-04-01","YOU WILL BE IN GROUP II FOR RIF PURPOSES AS LONG AS YOU ARE IN THIS","POSITION AND THE FORMER INCUMBENT HAS REEMPLOYMENT RIGHTS."," "," "," "," "," "," "," "]
["7TC","N","2004-04-01","EMPLOYEE ACQUIRED COMPETITIVESTATUS UPON CONVERSION."," "," "," "," "," "," "," "," "]
["7TD","N","2004-04-01","EMPLOYEE MEETS ALL REQUIREMENTS FOR CONVERSION UNDER THE CITED AUTHORITY"," "," "," "," "," "," "," "," "]
["7TE","N","2004-04-01","EMPLOYEE DOES NOT ACQUIRE A COMPETITIVE STATUS UNDER THIS APPOINTMENT."," "," "," "," "," "," "," "," "]
["7TF","N","2004-04-01","CONVERSION BASED ON BEING ADMITTED TO STATE BAR."," "," "," "," "," "," "," "," "]
["7TG","N","2004-04-01","AUO PERCENTAGE RATE ESTABLISHED AT ************ EFFECTIVE **-**-**."," "," "," "," "," "," "," "," "]
["7TH","N","2004-04-01","AUO PERCENTAGE RATE CEASES EFFECTIVE **-**-**."," "," "," "," "," "," "," "," "]
["7TI","N","2004-04-01","EMPLOYEE SELECTED FROM AN OFFICE OF PERSONNEL MANAGEMENT CERTIFICATE AND","WILL BE IN TENURE GROUP II UNTIL COMPLETION OF PROBATIONARY PERIOD."," "," "," "," "," "," "," "]
["7Z1","N","2004-04-01","THIS STUDENT LOAN PAYMENT IS MADE FOR RECRUITMENT PURPOSES."," "," "," "," "," "," "," "," "]
["7Z2","N","2004-04-01","THIS STUDENT LOAN PAYMENT IS MADE FOR RETENTION PURPOSES."," "," "," "," "," "," "," "," "]
["7Z3","N","2004-04-01","WITH THIS PAYMENT, DOL HAS PAID A TOTAL OF $***** TOWARD THE LIFETIME","MAXIMUM OF $*****.**."," "," "," "," "," "," "," "]
["7Z4","N","2004-04-01","SF-8, SF-2810, SF-2821, AND SF-293 ISSUED."," "," "," "," "," "," "," "," "]
["7Z5","N","2008-01-06","THIS IS A REIMBURSABLE DETAIL"," "," "," "," "," "," "," "," "]
["7Z6","N","2008-01-06","NON COMPETITIVELY SELECTED FROM"," "," "," "," "," "," "," "," "]
["7ZA","N","2004-04-01","SF 2815 ISSUED."," "," "," "," "," "," "," "," "]
["7ZC","N","2004-04-01","SF-2821 AND SF-2810 ISSUED."," "," "," "," "," "," "," "," "]
["7ZI","N","2004-04-01","SF-2800, SF-1153, FE-6 & CERTIFICATE OF DEATH SUBMITTED."," "," "," "," "," "," "," "," "]
["7ZJ","N","2004-04-01","SF-2800, SF-1153, AND CERTIFICATE OF DEATH SUBMITTED."," "," "," "," "," "," "," "," "]
["7ZK","N","2004-04-01","SF-1153, FE-6 AND CERTIFICATE OF DEATH SUBMITTED."," "," "," "," "," "," "," "," "]
["7ZL","N","2004-04-01","SF-1153, AND CERTIFICATE OF DEATH SUBMITTED."," "," "," "," "," "," "," "," "]
["7ZM","N","2007-10-01","IN THE LINE OF DUTY"," "," "," "," "," "," "," "," "]
["7ZN","N","2004-04-01","SF-8 AND SF-2801-1 ISSUED."," "," "," "," "," "," "," "," "]
["7ZO","N","2004-04-01","OPM FORM 1437 ISSUED TO EMPLOYEE."," "," "," "," "," "," "," "," "]
["7ZP","N","2004-04-01","SF-293 ISSUED."," "," "," "," "," "," "," "," "]
["7ZQ","N","2004-04-01","SF-8, SF-2818, SF-2801-1, AND SF-293 ISSUED."," "," "," "," "," "," "," "," "]
["7ZR","N","2004-04-01","EMPLOYEE MUST PAY HIS SHARE OF HEALTH INSURANCE COST DURING PERIOD OF","NON-PAY STATUS OR WHEN PAY IS INSUFFICIENT TO COVER INSURANCE PREMIUMS."," "," "," "," "," "," "," "]
["7ZT","N","2004-04-01","FORWARD SF-2806 AND LEAVE RECORD TO U.S. DEPARTMENT OF","LABOR                                         ."," "," "," "," "," "," "," "]
["7ZU","N","2004-04-01","WITHIN GRADE INCREASE GRANTED RETROACTIVELY DUE TO RECEIPT OF LATE","PERFORMANCE APPRAISAL."," "," "," "," "," "," "," "]
["7ZV","N","2004-04-01","TSP-18 ISSUED."," "," "," "," "," "," "," "," "]
["7ZW","N","2004-04-01","RETURN SF 2809 AND SF 2817 TO THE PERSONNEL OFFICE NO LATER THAN **_**_*"," "," "," "," "," "," "," "," "]
["7ZX","N","2004-04-01","EMPLOYEE WILL WORK A PART-TIME TOUR OF DUTY BASED ON THE BLS CPI ANNUAL","CALENDAR. A COPY OF THE CALENDAR IS IN THE OPF. EMPLOYEE IS EXPECTED","TO WORK HOURS IN ADDITION TO SCHEDULED TOUR AS NEEDED, NUMBER OF WEEKS","PER CALENDAR YEAR **** AND AVERAGE HOURS PER WEEK**."," "," "," "," "," "]
["7ZY","N","2004-04-01","ICTAP PROVISIONS WERE SATISFIED UNDER MERIT STAFFING ANNOUNCEMENT #****."," "," "," "," "," "," "," "," "]
["7ZZ","N","2004-04-01","CORRECTS SALARY TO INCLUDE A LOCALITY-BASED PAYMENT OF   %."," "," "," "," "," "," "," "," "]
[800,"N","1977-06-21","THIS ACTION CANCELS THE FOLLOWING ACTION(S) WHICH OCCURED AFTER THE","OFFICIAL TERMINATION:"," "," "," "," "," "," "," "]
[801,"N","1983-01-09","THIS REMARK CODE HAS NO OUTPUT LANGUAGE."," "," "," "," "," "," "," "," "]
["80G","N","1991-06-16","THIS POSITION IS COVERED UNDER THE SPECIAL LAW ENFORCEMENT RETIREMENT","PROVISIONS OF 5 USC 8336 (C) AND 5 USC 8412 (D) AS CONTROL NUMBER","(        )."," "," "," "," "," "," "]
["80I","N","1992-02-23","ELIGIBLE TO ELECT COVERAGE UNDER FEDERAL EMPLOYEES RETIREMENT SYSTEM","(FERS) WITHIN SIX MONTH OF THE EFFECTIVE DATE OF THIS PERSONNEL ACTION.","SF-3109 PROVIDED EMPLOYEE."," "," "," "," "," "," "]
[810,"N","1987-10-01","REASSIGNMENT TO DEMONSTRATION PROJECT - ALTERNATIVE PERSONNEL MANAGEMENT","SYSTEM - AS AUTHORIZED BY NBS AUTHORIZATION ACT FOR FISCAL YEAR 1987."," "," "," "," "," "," "," "]
[811,"N","1987-10-01","THIS ACTION INVOLVES CHANGE IN PAY SYSTEM AND POSITION NUMBERING SYSTEM.","THERE IS NO CHANGE IN APPOINTMENT OR POSITION TITLE."," "," "," "," "," "," "," "]
[812,"N","1987-10-31","AMOUNT IN BLOCK 32 REPRESENTS A LUMP SUM PRO RATA SHARE OF THE EQUIVALEN","OF ANY WITHIN-GRADE INCREASE OR MERIT INCREASE WHICH WOULD HAVE BEEN DUE"," "," "," "," "," "," "," "]
[813,"Y","1990-03-25","PAYABLE SALARY LIMITED TO $@          @ BY P. L. 99-574, NBS DEMONSTRATI","PROJECT."," "," "," "," "," "," "," "]
["81I","N","1992-02-23","VRA PROGRAM REVISED BY PL 102-16, MARCH 22, 1991. (PER FPM LETTER 307-15","DATED 06/24/91, PAGE 3, #7, ATTACHED)."," "," "," "," "," "," "," "]
[825,"N","1993-02-10","SALARY INCLUDES INCREASE OF STEPS ON LANGUAGE PROFICIENCY IN","ACCORDANCE WITH FAS NOTICE 899 DATED 02/10/93."," "," "," "," "," "," "," "]
[830,"N","1997-11-09","REASSIGMENT TO DEMONSTRATION PROJECT - ALTERNATIVE PERSONNEL MANAGEMENT","SYSTEM - AS AUTHORIZED BY 5 U.S.C. 4703"," "," "," "," "," "," "," "]
["85P","Y","1993-10-08","AMOUNT IN BLOCK 20-B INCLUDES THE SPECIAL PAY ADJUSTMENT FOR LAW        ","ENFORCEMENT OFFICERS OF $@          @.                                  ","                                                                        ","                                                                       ","                                                                       ","                                                                       ","                                                            "," "," "]
["86P","N","2004-01-11","CORRECTS ITEMS 20, 20A, 20B, 20C, AND IF APPLICABLE, 20D TO REFLECT     ","THE RETROACTIVE PAY INCREASE AUTHORIZED BY EXECUTIVE ORDER 13332.       ","                                                                        ","                                                                       ","                                                                       ","                                                                       ","                                                            "," "," "]
[888,"N","1982-05-02","CORRECTION TO MERIT PAY SALARY OF RECORD"," "," "," "," "," "," "," "," "]
["88P","N","2004-01-11","CORRECTS ITEMS 20, 20A, 20B, 20C, AND IF APPLICABLE, 20D TO REFLECT     ","THE RETROACTIVE PAY INCREASE AUTHORIZED BY EXECUTIVE ORDER 13332.       ","                                                                        ","                                                                       ","                                                                       ","                                                                       ","                                                            "," "," "]
[894,"N","1981-01-01","INELIGIBLE FOR STEP INCREASE BECAUSE SALARY IS ALREADY AT THE MAXIMUM RA","OF BASIC PAY FOR EMPLOYEE'S CLASS."," ","INELIGIBLE FOR STEP INCREASE BECAUSE SALARY IS ALREADY AT THE MAXIMUM RA","OF BASIC PAY FOR EMPLOYEE'S CLASS."," "," "," "," "]
[899,"Y","1982-04-04","RETAINED GRADE @   @ - @    @ - @   @, @   @/@   @ $@         @ @   @"," "," "," "," "," "," "," "," "]
[900,"N","1982-03-23","CONTRIBUTIONS TO THE CIVIL SERVICE RETIREMENT FUND CEASE COB OF DAY","PRECEDING THE EFFECTIVE DATE OF THIS ACTION.  CONTRIBUTIONS TO THE","EMPLOYEE'S CREDIT IN THE CIVIL SERVICE RETIREMENT FUND TO BE TRANSFERRED","IN ACCORDANCE WITH SECTION 805 (C)(1) OF THE FS ACT OF 1980."," "," "," "," "," "]
[901,"N","1981-12-01","CONTRIBUTIONS TO THE FOREIGN SERVICE RETIREMENT AND DISABILITY SYSTEM TO","COMMENCE"," "," "," "," "," "," "," "]
[902,"N","1981-12-01","NOMINATED          CONFIRMED          ATTESTED"," "," "," "," "," "," "," "," "]
[903,"N","1981-12-01","YOU HAVE REEMPLOYMENT RIGHTS AS A CIVIL SERVICE EMPLOYEE UNDER SEC.310 O","FS ACT OF 1980."," "," "," "," "," "," "," "]
[904,"N","1981-12-01","AS A CAREER CANDIDATE UNDER SECTION 306(A)(2) PRE CAREER FOREIGN SERVICE","OFFICER FOR A PERIOD NOT TO EXCEED 5 YEARS OR THE FINAL DECISION OF A","TENURING BOARD ESTABLISHED UNDER SECTION 306(B) OF THE FS ACT OF 1980,","WHICHEVER IS SOONER."," "," "," "," "," "]
[905,"N","1981-12-01","REEMPLOYMENT FOREIGN SERVICE ANNUITANT. RETIRED UNDER FOREIGN SERVICE","RETIREMENT SYSTEM ON SALARY AT TIME OF RETIREMENT. RECEIPT OF ANNUITY","SUBJECT TO LIMITATION OF SEC. 872 OF THE FOREIGN SERVICE ACT."," "," "," "," "," "," "]
[906,"N","1981-12-01","AS A CAREER CANDIDATE UNDER SECTION 306 (A)(1) PRE CAREER FP FOR A PERIO","NOT TO EXCEED 5 YEARS, OR THE FINAL DECISION OF A TENURING BOARD","ESTABLISHED UNDER SECTION 306-B OF THE FS ACT OF 1980, WHICHEVER IS SOON"," "," "," "," "," "," "]
[907,"N","1981-12-01","AS A CAREER CANDIDATE UNDER SECTION 306(A)(2) PRE CAREER FOREIGN SERVICE","OFFICER FOR A PERIOD NOT TO EXCEED 4 YEARS, OR THE FINAL DECISION OF A","TENURING BOARD ESTABLISHED UNDER SECTION 306(B) OF THE FS ACT OF 1980,","WHICHEVER IS SOONER."," "," "," "," "," "]
[908,"N","1981-12-01","EMPLOYEE HAS GUARANTEED PLACEMENT RIGHTS DURING PROBATION."," "," "," "," "," "," "," "," "]
[909,"N","1981-12-01","APPOINTMENT LIMITED TO FIVE YEARS OR NEED OF EMPLOYEE'S SERVICES, WHICH","EVER IS LESS."," "," "," "," "," "," "," "]
[910,"N","1981-12-01","APPOINTMENT LIMITED TO     YEARS OR NEED OF EMPLOYEE'S SERVICES, WHICHEV","IS LESS."," "," "," "," "," "," "," "]
[911,"N","1981-12-01","CONVERTED FROM"," "," "," "," "," "," "," "," "]
[912,"N","1981-12-01","APPOINTED BY THE PRESIDENT AS FSO            CONSULAR OFFICER AND","SECRETARY IN THE DIPLOMATIC SERVICE OF THE U.S.A."," "," "," "," "," "," "," "]
[913,"N","1981-12-01","INCUMBENT CURRENTLY SERVING AS"," "," "," "," "," "," "," "," "]
[914,"N","1981-12-01","SERVICE CREDIT FOR RETIREMENT, REDUCTION-IN-FORCE, AND LEAVE ACCURAL","PURPOSES CONTINUES FOR UP TO A MAXIMUM OF SIX MONTHS IN NONPAY STATUS","PER CALENDAR YEAR."," "," "," "," "," "," "]
[915,"N","1981-12-01","IN CONTINUATION OF PROBATIONARY PERIOD BEGINNING          ENDING"," "," "," "," "," "," "," "," "]
[916,"N","1981-12-01","APPOINTMENT BY THE PRESIDENT TO THE CLASS OF            IN THE SENIOR","FOREIGN SERVICE OF THE U.S.A."," "," "," "," "," "," "," "]
[917,"N","1981-12-01","EMPLOYEE SEPARATED FROM        ON"," "," "," "," "," "," "," "," "]
[918,"N","1981-12-01","EMPLOYEE CONTINUES TO HOLD A COMMISION AS A FOREIGN SERVICE OFFICER."," "," "," "," "," "," "," "," "]
[919,"N","1981-12-01","TYPE OF APPOINTMENT, LEVEL, AND SALARY REMAIN UNCHANGED."," "," "," "," "," "," "," "," "]
[920,"N","1981-12-01","EMPLOYEE IN LWOP STATUS UNTIL COB EFFECTIVE DATE OF THIS ACTION."," "," "," "," "," "," "," "," "]
[921,"N","1983-06-12","TRANSFER FEHBA ENROLLMENT TO DEPARTMENT OF STATE"," "," "," "," "," "," "," "," "]
[922,"N","1983-09-04","PENDING RECONFIRMATION AS A CAREER FOREIGN SERVICE OFFICER"," "," "," "," "," "," "," "," "]
[923,"N","1984-11-11","IN ACCORDANCE WITH SECTION 403 OF THE FS ACT OF 1980, PAYABLE SALARY","LIMITED TO THE MAXIMUM RATE OF PAY PRESCRIBED FOR GS-15 OF THE GENERAL","SCHEDULE UNDER SECTION 5332 OF TITLE 5, UNITED STATES CODE."," "," "," "," "," "," "]
[924,"N","1987-01-01","PENDING CONFIRMATION AND ATTESTATION AS A FOREIGN SERVICE OFFICER, EMPLO","IS CONVERTED TO CAREER FOREIGN SERVICE STATUS."," "," "," "," "," "," "," "]
[925,"N","1987-07-01","EMPLOYEE ELECTED COVERAGE UNDER FSPS."," "," "," "," "," "," "," "," "]
[926,"N","1987-07-01","EMPLOYEE IS AUTOMATICALLY COVERED UNDER FSPS"," "," "," "," "," "," "," "," "]
[927,"N","1988-01-01","REASON FOR TEMPORARY APPOINTMENT:  1990 CENSUS"," "," "," "," "," "," "," "," "]
[928,"N","1988-01-01","EMPLOYEE'S WORK SCHEDULE IS A MIXED TOUR WITH A (FULL-TIME/PART-TIME)","SCHEDULE TOUR OF DUTY. BASED ON THE AGENCY'S FLUCTUATING WORKLOAD, THE","EMPLOYEE WILL REVERT TO INTERMITTENT STATUS AS NECESSARY."," "," "," "," "," "," "]
[929,"N","1988-01-01","THIS POSITION IS TEMPORARY NOT TO EXCEED ONE YEAR UNDER SCHEDULE A AND","IS OUTSIDE THE COMPETITIVE CIVIL SERVICE."," ","IN ACCEPTING THIS APPOINTMENT THE INCUMBENT UNDERSTANDS THAT THE","APPOINTMENT IS TERMINABLE UPON NOTICE THEREOF."," "," "," "," "]
[930,"N","1988-07-03","THIS ACTION CONTINUES YOUR TEMPORARY APPOINTMENT NOT TO EXCEED THE DATE","REFLECTED IN ITEM  5B."," "," "," "," "," "," "," "]
[931,"N","1988-01-01","THE CONDITIONS OF A TEMPORARY APPOINTMENT UNDER SCHEDULE A AS LISTED ON","YOUR ORIGINAL APPOINTMENT SF-50 REMAIN IN EFFECT."," "," "," "," "," "," "," "]
[932,"N","1988-01-01","MIXED TOUR WORK SCHEDULE CONTINUES TO REMAIN IN EFFECT."," "," "," "," "," "," "," "," "]
[933,"N","1988-01-01","IF PREVIOUSLY COVERED BY BENEFITS, COVERAGE CONTINUES."," "," "," "," "," "," "," "," "]
[934,"N","1988-01-01","REASON FOR TERMINATION:  LACK OF WORK."," "," "," "," "," "," "," "," "]
[935,"N","1988-01-01","SALARY IS SUBJECT TO CHANGE DURING PERIOD OF EMPLOYMENT UNDER THIS","AUTHORITY."," "," "," "," "," "," "," "]
[936,"N","1988-05-08","PAY ADJUSTED TO   /  /  /        /   EFFECTIVE      ."," "," "," "," "," "," "," "," "]
[937,"N","1982-01-01","FORWARDING ADDRESS=","     \"        \"   :"," "," "," "," "," "," "," "]
[938,"N","2003-09-01","ADMINISTRATIVE CHANGE ONLY. ASSIGNMENT OF NEW IDENTIFYING NUMBER TO","EMPLOYEE'S SERVICING PERSONNEL OFFICE. WESTERN HUMAN RESOURCE","ZONE LETTER 11/8/02."," "," "," "," "," "," "]
[998,"Y","1992-05-17","OFFICIAL WORKING TITLE IS @                                      @"," "," "," "," "," "," "," "," "]
[999,"N","1981-12-01","FOR NFC USE - TEMPORARILY ASSIGNED REMARK CODE  WITH VARIABLE  CONTENT."," "," "," "," "," "," "," "," "]
["9A1","N","1986-05-30","SALARY WOULD BE $          IF NOT LIMITED BY THE PAY CAP"," "," "," "," "," "," "," "," "]
["9A2","N","1986-05-30","RESIGNED BECAUSE"," "," "," "," "," "," "," "," "]
["9A3","N","1986-05-30","STAFF REDUCTION NOTICE DATED:"," "," "," "," "," "," "," "," "]
["9A4","N","1986-05-30","ADVANCED STEP APPROVED BY MANAGEMENT COMMITTEE MEMBER ON   /  /  ."," "," "," "," "," "," "," "," "]
["9A5","N","1986-05-30","AE SALARY RATE APPROVED BY THE SECRETARY ON:"," "," "," "," "," "," "," "," "]
["9A6","N","1986-05-30","APPOINTMENT IS SUBJECT TO COMPLETION OF 6 MONTH PROBATIONARY PERIOD","BEGINNING (DATE)."," "," "," "," "," "," "," "]
["9A7","N","1986-05-30","CHANGES SCD FROM          TO REFLECT ONLY CREDITABLE SERVICE."," "," "," "," "," "," "," "," "]
["9A8","N","1986-05-30","TOUR OF DUTY IS THE FIRST           HOURS WITHIN THE ADMINISTRATIVE WORK","WEEK.  ( SSH  1200, CHAPTER 610, SECTION 3B)."," "," "," "," "," "," "," "]
["A01","N","1982-06-28","APPOINTMENT IS ON A SEASONAL BASIS; THE EMPLOYEE IS SUBJECT TO RELEASE T","NONPAY STATUS AND RECALL TO DUTY TO MEET WORKLOAD REQUIREMENTS AS A","CONDITION OF EMPLOYMENT IN ACCORDANCE WITH THE ATTACHED AGREEMENT."," "," "," "," "," "," "]
["A02","N","1982-06-28","APPOINTMENT IS ON AN ON-CALL BASIS; THE EMPLOYEE IS SUBJECT TO RELEASE T","NONPAY STATUS AND RECALL TO DUTY TO MEET WORKLOAD REQUIREMENTS AS A","CONDITION OF EMPLOYMENT IN ACCORDANCE WITH THE ATTACHED AGREEMENT."," "," "," "," "," "," "]
["A03","N","1992-03-08","THIS APPOINTMENT IS INTENDED TO CONTINUE FOR TWO YEARS.  UPON","SATISFACTORY COMPLETION OF 2-YEAR TRIAL PERIOD, YOU WILL BE","NONCOMPETITIVELY CONVERTED TO CAREER-CONDITIONAL OR CAREER","APPOINTMENT.  IF PERFORMANCE IS NOT SATISFACTORY OR YOU FAIL TO","SATISFACTORILY COMPLETE PROGRAM, EMPLOYMENT WILL BE TERMINATED."," "," "," "," "]
["A06","N","2009-09-27","MAY WORK FULL TIME IN ANY PERIOD SCHOOL IS CLOSED; OTHERWISE, EMPLOYMENT","MAY NOT EXCEED 20 HOURS IN ANY CALENDAR WEEK."," "," "," "," "," "," "," "]
["A07","Y","1994-12-25","EMPLOYMENT UNDER THIS APPOINTMENT MUST NOT EXCEED @      @ HOURS A YEAR."," "," "," "," "," "," "," "," "]
["A08","Y","1994-12-25","EMPLOYMENT UNDER THIS AND PREVIOUS APPOINTMENT MUST NOT EXCEED @      @","HOURS A YEAR."," "," "," "," "," "," "," "]
["A11","Y","1982-06-01","EMPLOYMENT UNDER THIS APPOINTMENT MUST NOT EXCEED @      @","WORKING DAYS A YEAR."," "," "," "," "," "," "," "]
["A12","Y","1981-12-01","EMPLOYMENT UNDER THIS AND PREVIOUS APPOINTMENT MUST NOT EXCEED @   @","WORKING DAYS A YEAR."," "," "," "," "," "," "," "]
["A17","N","1981-12-01","AS A  REEMPLOYED ANNUITANT, YOU SERVE AT THE WILL OF THE APPOINTING","OFFICER."," "," "," "," "," "," "," "]
["A21","N","1980-01-01","TEMP EMPLOYEES SERVE UNDER APPTS LIMITED TO 1 YEAR OR LESS & ARE\tSUBJECT TO TERMINATION AT ANY TIME W/O USE OF ADVERSE ACTION OR\tREDUCTION-IN-FORCE PROCEDURES.  A TEMP APPT DOES NOT CONFER ELIGIBILITY\tTO BE PROMOTED OR  REASSIGNED TO OTHER POSITIONS, OR THE ABILITY TO BE\tNONCOMPETITIVELY  CONVERTED TO A CAREER CONDITIONAL APPT.\t \t \t \t \r\nA22\tN\t1981-12-01 00:00:00.000\tTHIS APPOINTMENT CANNOT BE RENEWED. UPON ADMISSION TO THE BAR, YOU WILL\tELIGIBLE FOR APPOINTMENT AS ATTORNEY IN ACCORDANCE WITH AGENCY APPOINTME\tPROCEDURES.\t \t \t \t \t \t \r\nA25\tN\t1992-03-08 00:00:00.000\tTHIS ACTION PROVIDES RELIEF REQUIRED BY PUBLIC LAW 101-12, PENDING\tFINAL DECISION OF THE MSPB.\t \t \t \t \t \t \t \r\nA2M\tN\t2003-08-01 00:00:00.000\tCS CERT NO ______________WTO\t \t \t \t \t \t \t \t \r\nA30\tN\t1994-12-16 00:00:00.000\tTHIS APPOINTMENT DOES NOT CONFER ELIGIBILITY TO BE NONCOMPETITIVELY\tCONVERTED TO CAREER CONDITIONAL OR CAREER APPOINTMENT.\t \t \t \t \t \t \t \r\nA32\tN\t2012-07-10 00:00:00.000\tTHIS APPOINTMENT DOES NOT CONFER ELIGIBILITY TO BE NONCOMPETITIVELY\tCONVERTED TO A TERM, CAREER OR CAREER-CONDITIONAL APPOINTMENT IN THE\tCOMPETITIVE SERVICE.\t \t \t \t \t \t \r\nA35\tN\t2012-07-10 00:00:00.000\tTHIS APPOINTMENT MAY CONFER ELIGIBILITY TO BE NONCOMPETITIVELY CONVERTED\tTO A TERM, CAREER OR CAREER CONDITIONAL APPOINTMENT IN THE COMPETITVE\tSERVICE.\t \t \t \t \t \t \r\nA36\tN\t2012-07-10 00:00:00.000\tTHE DURATION OF A PATHWAYS APPOINTMENT UNDER SCH D IS A TRIAL PERIOD.\t \t \t \t \t \t \t \t \r\nA37\tN\t2012-07-10 00:00:00.000\tAPPOINTMENT CANNOT EXCEED 2 YEARS PLUS ANY AGENCY APPROVED EXTENSION OF\tMORE THAN 120 DAYS.UPON SATISFACTORY COMPLETION OF THE PROGRAM YOU MAY\tBE NONCOMPETITIVELY CONVERTED TO A PERMANENT APPOINTMENT. IF YOUR\tPERFORMANCE IS NOT SATISFACTORY OR IF YOU FAIL TO SATISFACTORILY\tCOMPLETE THIS PROGRAM EMPLOYMENT WILL BE TERMINATED.\t \t \t \t \r\nA38\tN\t2012-07-10 00:00:00.000\tEMPLOYEE INFORMED IN ADVANCE OF THE CONDITIONS OF APPOINTMENT UNDER THE\tPATHWAYS PROGRAMS.\t \t \t \t \t \t \t \r\nA39\tN\t2012-07-10 00:00:00.000\tTHIS APPT IS INTENDED TO CONTINUE THUR COMPLETION OF ED & WORK REQ AN\tAGENCY MAY NONCOMPETITIVELY APPOINT YOU TO A TERM, CAREER OR CAREER COND\tAPPT IN THE COMP SERV WITHIN 120 DAYS AFTER SATISFACTORY COMPLETION OF\tYOUR ED PROG AND SATISFACTORY COMPLETION OF AT LEAST 640 HRS OF CAREER\tRELATED WORK EXP. THE WORK EXP MUST HAVE BEEN  COMPLETED PRIOR TO OR\tCONCURRENTLY WITH  THE COMPLETION OF THE REQ OF YOUR ED PROGRAM.\t \t \t \r\nA40\tN\t2012-07-10 00:00:00.000\tEMPLOYEE IS A PMF FROM CLASS 2009, 2010, 2011, AND 2012 ELIGIBLE FOR    \tCONVERSION UNDER THE PROVISIONS OF E.O.13562 AND 5 CFR 362.110          \t                                                                        \t                                                                       \t                                                                       \t                                                                       \t                                                            \t \t \r\nAC1\tN\t1991-06-05 00:00:00.000\tEMPLOYMENT IS TEMPORARY AND OF UNCERTAIN DURATION.\t \t \t \t \t \t \t \t \r\nAC2\tN\t1991-06-05 00:00:00.000\tTHIS BASIC RATE INCLUDES A 10% NIGHT SHIFT DIFFERENTIAL.\t \t \t \t \t \t \t \t \r\nAC3\tN\t1991-06-05 00:00:00.000\tSERVICE CREDIT FOR RETIREMENT AND LEAVE ACCURAL PURPOSES CONTINUES FOR\tUP TO A MAXIMUM OF 6 MONTHS IN A NONPAY STATUS PER CALENDAR YEAR.\t \t \t \t \t \t \t \r\nAC4\tY\t1991-06-05 00:00:00.000\tSALARY RATE INDICATED IN BLOCK 12 AND/OR 20 DOES NOT INCLUDE FRINGE\tBENEFITS OR SHIFT DIFFERENTIAL.  YOU ARE ENTITLED TO AN ADDITIONAL\t$@00.00@ PER HOUR FOR FRINGE BENEFITS. FRINGE BENEFITS ARE EXCLUDED\tIN THE COMPUTATION OF OVERTIME AND SHIFT DIFFERENTIAL.\t \t \t \t \t \r\nAC5\tN\t1993-01-10 00:00:00.000\tTHIS TEMPORARY APPOINTMENT SHALL REMAIN IN EFFECT UNTIL\tOTHERWISE ORDERED BY THE ARCHITECT OF THE CAPITOL.\t \t \t \t \t \t \t \r\nAC6\tN\t1993-01-10 00:00:00.000\tEMPLOYEE ELIGIBLE FOR 1% TSP GOVERNMENT CONTRIBUTION\tBEGINNING (  /  /  ).\t \t \t \t \t \t \t \r\nAF1\tN\t1993-12-26 00:00:00.000\tEMPLOYEE COVERED BY CUSTOMS OFFICER PAY REFORM ACT: P.L. 103-66.\t \t \t \t \t \t \t \t \r\nAM1\tN\t2000-10-09 00:00:00.000\tLIMITED CAREER EXTENSION (LCE) IS BASED ON THE RANK LIST APPROVED BY\tTHE      SFS CONSOLIDATED SELECTION BOARD AND ON THE AGENCY'S PROJECTED\tFOREIGN SERVICE EMPLOYMENT NEEDS.\t \t \t \t \t \t \r\nAM2\tN\t2000-10-09 00:00:00.000\tTHIS ACTION REFLECTS YOUR COMMISSION AS A CAREER FOREIGN SERVICE OFFICER\tCONSULAR OFFICER AND SECRETARY IN THE DIPLOMATIC SERVICE.\t \tTHE DATE OF THE PRESIDENT'S NOMINATION TO THE SENATE WAS  /  /     .\tTHE DATE OF THE SENATE CONFIRMATION WAS  /  /    , AND THE\tPRESIDENT'S ATTESTATION DATE WAS  /  /    .\t \t \t \r\nAM3\tN\t2000-10-09 00:00:00.000\tINFORMATION REFLECTED IN THIS PERSONNEL ACTION IS AS OF THE DATE OF\tSIGNATURE WHICH MAY DIFFER FROM THE INFORMATION AS OF THE EFFECTIVE\tDATE OF THIS ACTION.\t \t \t \t \t \t \r\nAM4\tN\t2002-10-08 00:00:00.000\tPROMOTIONS IN ACCORDANCE WITH THE PROVISIONS OF SECTIONS\t601 (A) AND 602 (B) OF THE FSA OF 1980 AND OF ADS CHAPTER 422.\tTHE PROMOTION IS BASED ON THE RECOMMENDATION OF THE      AID\tFOREIGN SERVICE PERFORMANCE BOARD FOR THE   /  /    TO   /  /\tRATING CYCLE.\t \t \t \t \r\nAM5\tN\t2002-10-08 00:00:00.000\tPROMOTIONS INTO AND WITHIN THE SENIOR FOREIGN SERVICE ARE APPOINTMENTS\tBY THE PRESIDENT (SEC 302 (A) OF THE FSA OF 1980).\t \t \t \t \t \t \t \r\nAM6\tN\t2000-10-09 00:00:00.000\tTHE DATE OF THE PRESIDENT'S NOMINATION TO THE SENATE WAS  /  /     .\tTHE DATE OF THE SENATE CONFIRMATION WAS  /  /    , AND THE\tPRESIDENT'S ATTESTATION DATE WAS  /  /    .\t \t \t \t \t \t \r\nAM7\tN\t2002-10-08 00:00:00.000\tTIME IN CLASS (TIC) EXPIRES   /  /    .\t \t \t \t \t \t \t \t \r\nAM8\tN\t2002-10-08 00:00:00.000\tEFFECTIVE   /  /    , EMPLOYEE IS ELIGIBLE TO ACCRUE 90-DAY ANNUAL LEAVE\tMAXIMUM LIMITATION ON ACCUMULATION OF LEAVE (SEE GOVERNMENT MANAGEMENT\tREFORM ACT OF 1994, P.L 103-356, DTD OCTOBER 13, 1994).\t \t \t \t \t \t \r\nAM9\tN\t2001-05-01 00:00:00.000\tDIFFICULT TO STAFF INCENTIVE DIFFERENTIAL FROM   /  /   TO    /  /  .\""," "," "," "," "," "," "," "," "]
["B01","N","1981-12-01","CANCELLED HEALTH BENEFITS"," "," "," "," "," "," "," "," "]
["B02","N","1981-12-01","ELECTED NOT TO ENROLL FOR HEALTH BENEFITS."," "," "," "," "," "," "," "," "]
["B03","N","1981-12-01","INELIGIBLE FOR HEALTH BENEFITS."," "," "," "," "," "," "," "," "]
["B04","N","1981-12-01","INELIGIBLE FOR LEAVE."," "," "," "," "," "," "," "," "]
["B07","N","2017-03-05","INELIGIBLE FOR HEALTH BENEFITS IF YOU ARE A TEMPORARY, SEASONAL, OR","INTERMITTENT EMPLOYEE WHO IS EXPECTED TO WORK A SCHEDULE OF LESS THAN","130 HOURS IN A CALENDAR MONTH OR YOU ARE EXPECTED TO WORK AT LEAST","130 HOURS IN A CALENDAR MONTH BUT FOR LESS THAN 90 DAYS"," "," "," "," "," "]
["B08","N","2017-03-05","ELIGIBLE FOR HEALTH BENEFITS"," "," "," "," "," "," "," "," "]
["B30","N","2009-02-01","CHANGES SCD-LEAVE FROM        UPON EMPLOYEE'S RETIREMENT FROM THE","UNIFORMED SERVICE."," "," "," "," "," "," "," "]
["B31","Y","1989-12-31","CHANGES SCD FROM @        @TO REFLECT @        @ HOURS WORKED UNDER","INTERMITTENT APPOINTMENTS(S)."," "," "," "," "," "," "," "]
["B32","Y","1982-09-19","CHANGES SCD FROM @        @ TO REFLECT EXCESS TIME IN NONPAY STATUS DURI","CALENDAR YEAR @    @."," "," "," "," "," "," "," "]
["B33","Y","1981-12-01","CHANGES SCD FROM @        @ TO REFLECT SERVICE WHICH HAS BEEN RULED","CREDITABLE."," "," "," "," "," "," "," "]
["B34","Y","1981-12-01","CHANGES SCD FROM @        @ TO REFLECT PREVIOUSLY UNCLAIMED SERVICE."," "," "," "," "," "," "," "," "]
["B35","Y","1981-12-01","CHANGES SCD FROM @        @ BECAUSE"," "," "," "," "," "," "," "," "]
["B36","Y","1981-12-01","CHANGES SCD FROM @        @ UPON EMPLOYEE'S RECEIPT OF DISCHARGE FROM","UNIFORMED SERVICE."," "," "," "," "," "," "," "]
["B37","N","2009-02-01","CHANGES SCD-LEAVE FROM        UPON EMPLOYEE'S RETIREMENT FROM THE","UNIFORMED SERVICE.  RECOVERY OF EXCESS ANNUAL LEAVE ACCRUED IN THE PAST","BASED ON THE ERRONEOUS SCD-LEAVE HAS BEEN WAIVED. IF REQUIRED BY THE","CORRECTED SCD-LEAVE, EMPLOYEE'S CURRENT ANNUAL LEAVE ACCRUAL RATE WILL B","CORRECTED PROSPECTIVELY."," "," "," "," "]
["B41","N","2000-10-02","HEALTH BENEFITS WILL CONTINUE AS LONG AS YOU PARTICIPATE IN THE","WORK-STUDY PROGRAM IF YOU PAY THE EMPLOYEE'S SHARE OF COSTS. CONTACT YOU","SERVICING HUMAN RESOURCES OFFICE OR SEE THE FEHB HANDBOOK AT","HTTP://WWW.OPM.GOV/INSURE FOR DETAILED INFORMATION."," "," "," "," "," "]
["B43","N","1992-08-23","GOVERNMENT SHARE OF PREMIUM FOR HEALTH BENEFITS COVERAGE WILL BE REDUCED","BECAUSE YOU ARE WORKING PART TIME. YOU WILL HAVE TO PAY THE EMPLOYEE","SHARE OF THE PREMIUM PLUS THE DIFFERENCE BETWEEN WHAT THE GOVERNMENT PAY","FOR YOUR ENROLLMENT AND THE AMOUNT THE GOVERNMENT PAYS FOR A FULL-TIME","EMPLOYEE."," "," "," "," "]
["B44","N","1984-03-01","HEALTH BENEFITS COVERAGE CONTINUES."," "," "," "," "," "," "," "," "]
["B45","N","1999-02-28","YOU MAY CHANGE HEALTH BENEFITS ENROLLMENT WITHIN 60 DAYS AFTER THE","EFFECTIVE DATE OF THIS ACTION."," "," "," "," "," "," "," "]
["B46","N","1986-10-03","SF-2819 WAS PROVIDED. LIFE INSURANCE COVERAGE IS EXTENDED FOR 31 DAYS","DURING WHICH YOU ARE ELIGIBLE TO CONVERT TO AN INDIVIDUAL POLICY (NON-","GROUP CONTRACT)."," "," "," "," "," "," "]
["B47","N","1985-12-08","HEALTH BENEFITS COVERAGE IS EXTENDED FOR 31 DAYS DURING WHICH YOU ARE","ELIGIBLE TO CONVERT TO AN INDIVIDUAL POLICY (NONGROUP CONTRACT)."," "," "," "," "," "," "," "]
["B51","N","1986-01-05","BASIC LIFE INSURANCE COVERAGE AND ADDITIONAL OPTIONAL COVERAGE (IF","ELECTED) ARE BASED ON THE RATE OF ANNUAL SALARY PAYABLE TO YOU AS A","PART-TIME EMPLOYEE, NOT THE FULL-TIME SALARY RATE SHOWN IN BLOCK 20 OF","THIS SF50-B.  HOWEVER, BASIC LIFE INSURANCE COVERAGE IS ALWAYS AT LEAST",10000," "," "," "," "]
["B52","N","1980-01-01","INELIGIBLE FOR HEALTH BENEFITS UNTIL YOU COMPLETE ONE YEAR OF CURRENT\tCONTINUOUS EMPLOYMENT. THEN YOU MAY ELECT HEALTH BENEFITS FOR WHICH YOU\tWILL BE CHARGED THE FULL PREMIUM."," "," "," "," "," "," "]
["B53","N","1992-01-10","HEALTH BENEFITS COVERAGE IS EXTENDED FOR 31 DAYS DURING WHICH YOU ARE","ELIGIBLE TO CONVERT TO INDIVIDUAL POLICY (NONGROUP CONTRACT). YOU ARE","ALSO ELIGIBLE FOR TEMP CONTINUATION OF YOUR FEHB COVERAGE FOR UP TO","18 MTHS"," "," "," "," "," "]
["B60","N","1991-04-07","ELIGIBLE TO ELECT COVERAGE UNDER THE FEDERAL EMPLOYEES RETIREMENT","SYSTEM (FERS) WITHIN SIX MONTHS OF THE EFFECTIVE DATE OF THIS","PERSONNEL ACTION.  SF-3109 PROVIDED TO EMPLOYEE."," "," "," "," "," "," "]
["B61","N","1991-04-07","YOU APPEAR TO BE ELIGIBLE FOR EARLY DEFERRED RETIREMENT BENEFITS","AT AGE   .  IF YOU HAVE ANY QUESTIONS, CONTACT YOUR AGENCY","RETIREMENT COUNSELOR."," "," "," "," "," "," "]
["B62","N","1991-04-07","YOU APPEAR TO BE ELIGIBLE FOR IMMEDIATE MRA + 10 RETIREMENT ANNUITY.","IF YOU HAVE ANY QUESTIONS, CONTACT YOUR AGENCY RETIREMENT COUNSELOR."," "," "," "," "," "," "," "]
["B63","N","1992-02-09","ELECTED TO RETAIN COVERAGE UNDER A RETIREMENT SYSTEM FOR NAF EMPLOYEES"," "," "," "," "," "," "," "," "]
["B66","N","2006-08-06","AN EMPLOYEE SUBJECT TO THE PROVISIONS OF PL 108-375 IS ELIGIBLE FOR","CONTINUED FEHB COVERAGE UP TO 24 MONTHS WHEN CALLED TO ACTIVE DUTY AND","CERTAIN REQUIREMENTS (INCLUDING SERVING IN SUPPORT OF A CONTINGENCY","OPERATION) ARE MET. AN EMPLOYEE SUBJECT TO THE PROVISIONS OF PL 108-454","IS ELIGIBLE FOR FEHB COVERAGE FOR 24 MONTHS WHEN ABSENT BECAUSE OF","SERVICE IN THE UNIFORMED SERVICE AND CERTAIN REQUIREMENTS ARE MET.","CONTACT YOUR SERVICING HR OFFICE OR SEE THE FEHB HANDBOOK AT HTTP://WWW.","INSURE FOR DETAILED INFORMATION."," "]
["B67","N","1999-02-28","ELECTED FULL LIVING BENEFITS ON         . BASIC COVERAGE NOW EQUALS","ZERO."," "," "," "," "," "," "," "]
["B68","N","1999-02-28","ELECTED PARTIAL LIVING BENEFITS ON          . POST-ELECTION BASIC","INSURANCE AMOUNT IS $       . MUST ELECT \"NO REDUCTION\" AT RETIREMENT."," "," "," "," "," "," "," "]
["B69","N","1999-08-01","EMPLOYEE HAS ASSIGNED OWNERSHIP OF LIFE INSURANCE COVERAGE.  ASSIGNMENT","TERMINATES 31 DAYS AFTER SEPARATION DATE UNLESS EMPLOYEE IS ENTITLED TO","CONTINUED COVERAGE BEFORE THAT DATE."," "," "," "," "," "," "]
["B71","N","2013-04-07","IF YOU ENTER A LWOP OR ANY OTHER TYPE OF NONPAY STATUS OR YOUR PAY IS   ","INSUFF TO COVER YOUR FEHB PREM, THEN YOU MUST ELECT TO : (1) TERMINATE  ","ENROLL IN FEHB , OR (2) CONTU IT FOR UP TO 365 DAYS AND AGREE TO PAY THE","PREM OR INCUR A DEBT.  IF YOU DO NOT ELECT TO TERM OR CONT YOUR ENROLL,","IT AUTO TERM AT THE END OF THE LAST PP YOU PAID PREM. CONTACT YOUR HR  ","OFFICE OR SEE THE FEHB HANDBOOK AT HTTP://WWW.OPM.GOV/INSURE FOR INFO. ","                                                            "," "," "]
["B72","N","2013-04-07","FEGLI COVERAGE CONTINUES UNTIL YOUR TIME IN NONPAY STATUS TOTALS 12 MONT","(IF WHILE IN NONPAY STATUS YOU RECEIVE PAY DURING ANY PART OF A PAY     ","PERIOD.  YOU ARE NOT CONSIDERED TO BE IN NONPAY STATUS FOR FEGLI PURPOSE","CONTACT YOUR SERVICING HUMAN RESOURCES OFFICE OR SEE THE FEGLI HAND    ","BOOK AT HTTP://WWW.OPM.GOV/INSURE FOR DETAILED INFORMATION.            ","                                                                       ","                                                            "," "," "]
["B73","N","2007-12-23","YOU ARE RECEIVING                    CREDIT TOWARDS YOUR SCD-LEAVE AS","SHOWN IN BLOCK 31 FOR THE FOLLOWING PERIOD(S) OF NON-FEDERAL SERVICE:","FROM      TO   . THIS TIME IS PERMANENTLY CREDITABLE UNLESS YOU","FAIL TO COMPLETE 1 FULL YEAR OF CONTINUOUS SERVICE WITH THIS AGENCY."," "," "," "," "," "]
["B74","N","2007-12-23","YOU ARE RECEIVING                    CREDIT TOWARDS YOUR SCD-LEAVE AS","SHOWN IN BLOCK 31 FOR THE FOLLOWING PERIOD(S) OF ACTIVE DUTY MILITARY","SERVICE: FROM      TO   .  THIS TIME IS PERMANENTLY CREDITABLE","UNLESS YOU FAIL TO COMPLETE 1 FULL YEAR OF CONTINUOUS SERVICE WITH THIS","AGENCY."," "," "," "," "]
["B75","N","2005-04-28","CHANGES SCD-LEAVE FROM        BECAUSE EMPLOYEE FAILED TO COMPLETE 1","FULL YEAR OF CONTINUOUS SERVICE WITH THE APPOINTING AGENCY."," "," "," "," "," "," "," "]
["B76","N","2008-12-21","FEGLI COVERAGE CONTINUES AT NO COST TO YOU UNTIL YOUR TIME IN NONPAY","STATUS TOTALS 12 MONTHS.  IF YOU ARE IN ACTIVE DUTY MILITARY STATUS, YOU","MAY ELECT TO CONTINUE FEGLI COVERAGE FOR AN ADDITIONAL 12 MONTHS BY PAYI","BOTH EMPLOYEE AND AGENCY PREMIUMS (BASIC COVERAGE) AND BY PAYING THE","ENTIRE COST (OPTIONAL COVERAGE). PER SECTION 1102 OF PUBLIC LAW 110-181.","YOU MUST MAKE THE ELECTION BEFORE THE END OF THE FIRST 12 MONTHS IN NONP","STATUS. CONTACT YOUR SERVICING HUMAN RESOURCES OFFICE OR SEE THE FEGLI","OOK AT HTTP://WWW.OPM.GOV/INSURE/LIFE FOR DETAILED INFORMATION."," "]
["B77","N","1990-09-30","HEALTH BENEFITS COVERAGE WILL CONTINUE FOR UP TO 365 DAYS IN A NONPAY","STATUS UNLESS YOU CANCEL YOUR ENROLLMENT."," "," "," "," "," "," "," "]
["BE1","N","1993-11-28","REMOVE FROM ACTING PROGRAM IN ACCORDANCE WITH ASSESSMENT CENTER POLICY,","BUREAU PERSONNEL MANUAL CHAPTER 337. INELIGIBLE SCORE RECEIVED THROUGH","ASSESSMENT CENTER ON   /  /  /  . PER VACANCY ANNOUNCEMENT NO.","(           ) DATED   /  /  ."," "," "," "," "," "]
["BE2","N","1993-11-28","REMOVE FROM THE ACTING PROGRAM IN ACCORDANCE WITH BUREAU PERSONNEL MANUE","M-60-1, SECTION 1, \"ASSESSMENT CENTER PROGRAM.\"  EMPLOYEE DID NOT REPORT","FOR TESTING ON DATE SCHEDULED. PER ANNOUNCEMENT NO. (           )."," "," "," "," "," "," "]
["BE3","N","1993-11-28","COMPLETED THE ASSESSMENT CENTER ON   /  /  . PROCESS IN ACCORDANCE WITH","ASSESSMENT CENTER POLICY, BUREAU PERSONNEL MANUAL, M-60-1, CHAPTER 337,","SECTION 1, DATED 12/09/91."," "," "," "," "," "," "]
["BE4","N","1993-11-28","EMPLOYEE MAY BE PROMOTED TO THE FULLTIME SUPERVISORY POSITION WITHOUT","FURTHER COMPETITION (EXCEPT AMONGST OTHER EMPLOYEES WHO ARE ELIGIBLE FOR","PROMOTION TO THE FULL PERFORMANCE LEVEL) AS DESCRIBED IN PARAGRAPH 6-7M","OF THE BEP MERIT PROMOTION PLAN, DATED JUNE 25, 1987."," "," "," "," "," "]
["BE5","N","1993-11-28","SELECTED FOR ACTING POSITION IN ACCORDANCE WITH BEP BULLETIN NO. 65-50.1","ACTING PAY POLICY, DATED 12/10/90, APPLIED UNDER VACANCY ANNOUNCEMENT NO","(           ), WHICH OPENED ON   /  /   AND COMPLETED THE ASSESSMENT","CENTER ON   /  /  ."," "," "," "," "," "]
["BE6","N","1993-11-28","EMPLOYEE MAY SERVE IN A SUPERVISORY POSITION, AS NEEDED, FOR UP TO 120","WORKING DAYS PER YEAR. WHEN SERVING AS (","     ), WILL BE PAID AT THE RATE OF HIGHER GRADE (5X-08), STEP (2N) AND","SALARY (D9.2) PER (2A)."," "," "," "," "," "]
["BE7","N","1993-11-28","BASIC LIFE INSURANCE COVERAGE AND ADDITIONAL OPTIONAL COVERAGE (IF ELECT","AND THE AMOUNT OF WITHHOLDING WILL BE BASED ON THE SALARY SHOWN IN BLOCK","EXCEPT DURING THOSE PP'S IN WHICH YOU ARE SERVING AS AN ACTING SUPERVISO"," "," "," "," "," "," "]
["BUP","N","2003-08-01","AUTH:  MEMO DATED 01/24/01"," "," "," "," "," "," "," "," "]
["C02","N","1981-12-01","EMPLOYEE FOUND TO BE ELIGIBLE FOR                 RETIREMENT."," "," "," "," "," "," "," "," "]
["C03","N","1978-09-29","RETROACTIVE RESTORATION."," "," "," "," "," "," "," "," "]
["C04","N","1981-12-01","RETROACTIVE CHANGE TO INTERMEDIATE GRADE, LEVEL OR BAND."," "," "," "," "," "," "," "," "]
["C06","N","2006-04-30","RETROACTIVE CHANGE TO FORMER GRADE, LEVEL OR BAND BASED ON"," "," "," "," "," "," "," "," "]
["C07","N","2006-04-30","RETROACTIVE CHANGE TO LOWER GRADE, LEVEL OR BAND BASED ON"," "," "," "," "," "," "," "," "]
["C08","N","1983-12-25","ALSO CORRECTS SAME ITEM(S) ON PERSONNEL ACTION         DATED         ."," "," "," "," "," "," "," "," "]
["C09","N","1981-12-01","ALSO CORRECTS                           EFFECTIVE          ITEM","              TO ADD"," "," "," "," "," "," "," "]
["C10","N","1981-12-01","CORRECTS DATE OF SEPARATION FROM          TO AVOID A BREAK IN SERVICE WH","EMPLOYEE WAS APPOINTED BY"," "," "," "," "," "," "," "]
["C11","N","1981-12-01","CORRECTS ITEM               FROM"," "," "," "," "," "," "," "," "]
["C12","N","1981-12-01","ALSO CORRECTS THE SAME ITEM ON ALL PREVIOUS PERSONNEL ACTIONS FROM","         TO"," "," "," "," "," "," "," "]
["C13","N","1981-12-01","ALSO CORRECTS PERSONNEL ACTION                       ,            ,","EFFECTIVE         , ITEM NUMBER                     FROM     ."," "," "," "," "," "," "," "]
["C14","N","1981-12-01","ACTION CANCELLED BECAUSE:"," "," "," "," "," "," "," "," "]
["C15","N","1981-12-01","THIS NOTIFICATION OF PERSONNEL ACTION REPLACES A PREVIOUSLY EXECUTED ONE"," "," "," "," "," "," "," "," "]
["C16","N","1981-12-01","THIS NOTIFICATION OF PERSONNEL ACTION PREPARED BY"," "," "," "," "," "," "," "," "]
["C17","N","1981-12-01","COMPLETES ITEM               WHICH WAS OMITTED."," "," "," "," "," "," "," "," "]
["C18","N","1981-12-01","CORRECTS ITEM               TO READ:"," "," "," "," "," "," "," "," "]
["C19","N","1982-06-28","CORRECTS SALARY TO GIVE EMPLOYEE BENEFIT OF HIGHEST PREVIOUS RATE OF","BASIC PAY."," "," "," "," "," "," "," "]
["C20","N","1982-01-01","ACTION CANCELLED IN ACCORDANCE WITH OPM LETTER DATED           .THIS SF5","AND THE SF50 BEING CANCELLED MUST BE RETAINED PERMANENTLY IN THE EMPLOYE","OFFICIAL PERSONNEL FOLDER."," "," "," "," "," "," "]
["C21","N","2015-01-11","SERVICE FROM (             ) TO (               ) MAY BE CREDITED FOR:  ","(                   ).                                                  ","                                                                        ","                                                                       ","                                                                       ","                                                                       ","                                                            "," "," "]
["C27","N","1978-09-29","ENTITLED TO BACK PAY UNDER 5 USC 5596."," "," "," "," "," "," "," "," "]
["C28","Y","1978-09-29","ACTIVE DUTY BEGINS @        @"," "," "," "," "," "," "," "," "]
["C30","N","1994-07-10","NATURE OF ACTION AND CODE SHOWN ON ORGINAL ACTION ARE NO LONGER IN USE."," "," "," "," "," "," "," "," "]
["CC1","Y","1992-01-12","THE WAITING PERIOD FOR YOUR NEXT STEP INCREASE IS @          @"," "," "," "," "," "," "," "," "]
["CC2","N","1992-02-23","SUCCESSFUL COMPLETION OF REQUIREMENTS FOR PROMOTION TO COMMISSIONED","NATIONAL BANK EXAMINER."," "," "," "," "," "," "," "]
["CC3","N","1992-02-23","ACTION RESULTS IN A MERIT LUMP SUM PAYMENT OF $      ."," "," "," "," "," "," "," "," "]
["CC4","N","1992-02-23","ACTION RESULTS IN A PROMOTION LUMP SUM PAYMENT OF $      ."," "," "," "," "," "," "," "," "]
["CC5","N","1992-02-23","SALARY INCLUDES AN ADJUSTMENT OF $      . TO BRING SALARY UP TO THE","MINIMUM OF THE GRADE."," "," "," "," "," "," "," "]
["CC6","N","1992-02-23","FIELD EXAMINERS ARE SUBJECT TO FREQUENT TRAVEL FOR THE PURPOSE OF BANK","EXAMINATION AND RELATED FUNCTIONS AND ARE THEREFORE AUTHORIZED TO TRAVEL","ANYWHERE IN THE CONTINENTAL U.S. FOR THIS PURPOSE."," "," "," "," "," "," "]
["CC7","N","1992-02-23","ANNIVERSARY DATE HAS BEEN ADJUSTED TO REFLECT EXCESSIVE TIME IN NONPAY","STATUS. NEW ANNIVERSARY DATE IS         ."," "," "," "," "," "," "," "]
["CC8","N","1992-02-23","INCLUDES EQUITY ADJUSTMENT OF $      ."," "," "," "," "," "," "," "," "]
["CC9","N","2000-12-31","SPECIAL INCREASE GRANTED IN ACCORDANCE WITH THE PROVISIONS OF NB PAY PLA"," "," "," "," "," "," "," "," "]
["CF1","N","1993-07-25","YOUR APPOINTMENT ENTITLES YOU TO ADVERSE ACTION PROTECTIONS AFTER","COMPLETION OF 1 YEAR OF QUALIFYING SERVICE IF YOU ARE ENTITLED TO VETERA","PREF, OR AFTER 2 YEARS OF QUALIFYING SERVICE IF YOU ARE NOT ENTITLED","TO VETERAN PREFERENCE."," "," "," "," "," "]
["CG1","N","2005-06-12","SCD SUBJECT TO CHANGE UPON VERIFICATION OF PRIOR SERVICE"," "," "," "," "," "," "," "," "]
["CG2","N","2005-06-12","TRANSFERRED WITHOUT A BREAK IN SERVICE OF A WORK DAY"," "," "," "," "," "," "," "," "]
["CG3","N","2010-10-01","REGISTRATION FOR HEALTH BENEFITS AND LIFE INSURANCE MUST BE RECEIVED BY","PERSONNEL NLT 60 DAYS FROM THE EFFECTIVE DATE OF THIS ACTION."," "," "," "," "," "," "," "]
["CG4","N","2005-06-12","PREVIOUS RETIREMENT COVERAGE: NEVER COVERED"," "," "," "," "," "," "," "," "]
["CG5","N","2005-06-12","PREVIOUS RETIREMENT COVERAGE: PREVIOUSLY COVERED"," "," "," "," "," "," "," "," "]
["CG6","N","2005-06-12","ELIGIBLE FOR SICK & ANNUAL LEAVE"," "," "," "," "," "," "," "," "]
["CG7","N","2005-06-12","LUMP-SUM PAYMENT TO BE MADE FOR ANY UNUSED ANNUAL LEAVE. SF-8 ISSUED TO","EMPLOYEE"," "," "," "," "," "," "," "]
["CG8","N","2005-06-12","SF-8 ISSUED TO EMPLOYEE"," "," "," "," "," "," "," "," "]
["CG9","N","2007-07-22","OPF MAINTAINED BY DHS/US COAST GUARD, CG-1211HQ, 1900 HALF STREET,SW.,","WASHINGTON, DC 20593"," "," "," "," "," "," "," "]
["CGA","N","2007-07-22","OPF MAINTAINED BY DHS/US COAST GUARD, CG-1211W, 1900 HALF STREET,SW.,","WASHINGTON, DC 20593"," "," "," "," "," "," "," "]
["CGB","N","2005-06-12","OPF MAINTAINED BY DHS/US COAST GUARD, CG-1211SE, 4200 WILSON BLVD., SUIT","#400, ARLINGTON, VA 22203"," "," "," "," "," "," "," "]
["CGC","N","2005-06-12","OPF MAINTAINED BY DHS/US COAST GUARD, CG-1211NE, 2401 HAWKINS POINT ROAD","MAIL STOP 4, BALTIMORE, MD 21226"," "," "," "," "," "," "," "]
["CGD","N","2005-08-07","THIS IS A RETROACTIVE PERSONNEL ACTION WHICH TOOK EFFECT PRIOR TO THE","USCG NFC CONVERSION DATE OF 8/21/05. THE EFFECTIVE DATE OF THE ACTION IS","(     ). THIS ACTION WILL REQUIRE A RETROACTIVE ADJUSTMENT TO BE","CALCULATED AND PAID OUT BY NFC."," "," "," "," "," "]
["CM0","N","1996-07-01","SUBJECT TO SATISFACTORY RECORD CHECK AND INQUIRY UNDER E010450. INELIGIB","FOR HEALTH BENEFITS. INELIGIBLE FOR LEAVE. SELECTED FROM","  DATED          CREDITABLE MILITARY SERVICE            YRS        MOS.","PREVIOUS RETIREMENT COVERAGE:                     .  THIS EMPLOYEE HAS","ELECTED TO PARTICIPATE IN THE MIXED-TOUR PROGRAM WITH","SCHEDULE TOUR OF DUTY.  BASED ON THE AGENCY'S FLUCTUATING WORKLOAD, THE","EMPLOYEE WILL REVERT TO INTERMITTENT STATUS, AS NECESSARY."," "," "]
["CM1","N","1997-04-01","     YRS     MOS.  PREVIOUS RETIREMENT COVERAGE:"," "," ","SUBJECT TO SATISFACTORY RECORD CHECK AND INQUIRY UNDER EO 10450. SELECTE","FROM                  DATED            . APPOINTMENT AFFIDAVIT EXECUTED","          . FROZEN SERVICE:     YRS      MOS. CREDITABLE MILITARY SERVIC"," "," "," "]
["CM2","N","1998-03-29","ENTITLEMENT TO DIFFERENTIAL NO LONGER APPLICABLE.  BASE PAY ADJUSTED TO","MAXIMUM RATE OF PAY RANGE."," "," "," "," "," "," "," "]
["CM3","N","1998-03-29","BASE PAY ADJUSTED - COMPETITIVE SELECTION."," "," "," "," "," "," "," "," "]
["CM4","N","1998-03-29","BASE PAY ADJUSTED FOR STUDENT OR FACULTY MEMBER AT COMPLETION OF AN","ACADEMIC SCHOOL YEAR OR ADDITIONAL YEAR OF TEACHING OR RESEARCH."," "," "," "," "," "," "," "]
["CM5","N","1998-03-01","PAY INCREASE AUTHORIZED PURSUANT TO 13 USC 23(A)."," "," "," "," "," "," "," "," "]
["CM6","N","1998-07-01","RATE OF PAY PER HOUR IS $   .  ."," "," "," "," "," "," "," "," "]
["CNC","N","2003-08-01","NO CHANGE IN SALARY DUE TO PAY RETENTION"," "," "," "," "," "," "," "," "]
["CSR","N","2003-08-01","NIGHT RATE DIFFERENTIAL CHANGES FROM 15% TO 12%"," "," "," "," "," "," "," "," "]
["D01","N","1997-03-02","THIS ACTION IS PROCESSED IN ACCORDANCE WITH ASSISTANT ATTORNEY GENERAL","FOR ADMINISTRATION'S MEMORANDUM, SUBJECT: \"DELEGATION OF PERSONNEL","MANAGEMENT AUTHORITY DATED DECEMBER 17, 1996\"."," "," "," "," "," "," "]
["D02","N","1997-03-02","THIS ACTION IS PROCESSED IN ACCORDANCE WITH ASSISTANT ATTORNEY GENERAL","FOR ADMINISTRATION'S MEMORANDUM, SUBJECT: \"DELEGATION OF PERSONNEL","MANAGEMENT AUTHORITY DATED DECEMBER 2, 1996\"."," "," "," "," "," "," "]
["D03","N","1997-03-02","OPF MANTAINED BY: EXECUTIVE OFFICE FOR IMMIGRATION REVIEW, PERSONNEL STA","5107 LEESBURG PIKE, SUITE 2300, FALLS CHURCH, VA 22041."," "," "," "," "," "," "," "]
["D04","N","1997-09-01","YOU ARE SERVING UNDER AN EXCEPTED SERVICE APPOINTMENT. DURING THE","INITIAL PERIOD OF EMPLOYMENT IN THE EXCEPTED SERVICE, THE RIGHT TO","APPEAL AN ADVERSE ACTION IS LIMITED. UNDER THIS APPOINTMENT THAT","INITIAL PERIOD ENDS ON           ."," "," "," "," "," "]
["D05","N","1997-09-01","SALARY SHOWN IN BOX 12A AND 20A WAS USED TO PROCESS ASSIGNMENT TO","REVISED AD GRADE AND REPRESENTS BASIC PAY PAID PRIOR TO LAST TEMPORARY","PROMOTION TO A SUPERVISORY OR SENIOR LITIGATION COUNSEL POSITION.","THIS SALARY WILL NOT BE USED TO CALCULATE PAY ENTITLEMENTS."," "," "," "," "," "]
["D07","N","1992-10-04","EMPLOYEE WILL REMAIN IN TENURE GROUP II UNTIL COMPLETION OF","3-YEAR PROBATIONARY PERIOD WHEN THEY WILL BE CONVERTED TO TENURE","GROUP I."," "," "," "," "," "," "]
["D08","N","1998-03-01","THIS ACTION IS PROCESSED IN ACCORDANCE WITH THE ASSISTANT ATTORNEY GENER","FOR ADMINISTRATION'S MEMORANDUM,SUBJECT:\"DELEGATION OF PERSONNEL MANAGEM","AUTHORITY\" DATED MARCH 18, 1998."," "," "," "," "," "," "]
["D09","N","2009-12-06","APPOINTED BY THE PRESIDENT WITH THE ADVICE AND CONSENT OF THE SENATE","PURSUANT TO 28 USC 541(A).  WILL NOT ACCRUE ANNUAL OR SICK LEAVE IN","ACCORDANCE WITH 5 USC 6301(2)(B)(X)."," "," "," "," "," "," "]
["D10","N","2009-12-06","APPOINTED BY THE U.S. COURTS PURSUANT TO 28 USC 546(D) TO SERVE UNTIL A","PRESIDENTIAL APPOINTMENT IS MADE."," "," "," "," "," "," "," "]
["D11","N","2009-12-06","APPOINTED BY THE ATTORNEY GENERAL PURSUANT TO 28 USC 546(A) TO SERVE UNT","A PRESIDENTIAL APPOINTMENT IS MADE."," "," "," "," "," "," "," "]
["D12","N","2009-12-06","PAYMENT OF RESTORED ANNUAL LEAVE"," "," "," "," "," "," "," "," "]
["D13","N","2009-12-06","ANNUAL LEAVE BALANCE OF ______ HOURS AND SICK LEAVE BALANCE OF ______","HOURS FROZEN AT THE RATE OF $ ______ PER HOUR."," "," "," "," "," "," "," "]
["D14","N","2010-12-05","LUMP SUM PAYMENT TO BE MADE FOR ______ HOURS OF FROZEN ANNUAL LEAVE  ","AT THE RATE OF $ ______ PER HOUR.                                     ","                                                                        ","                                                                       ","                                                                       ","                                                                      ","                                                            "," "," "]
["D15","N","2012-01-09","AWARD HOURS MUST BE USED BY 00/00/00.  A TIME OFF AWARD CANNOT BE","CONVERTED TO A LUMP-SUM PAYMENT AND  IS NOT TRASFERRABLE TO ANOTHER","FEDERAL AGENCY."," "," "," "," "," "," "]
["D16","N","2018-01-21","ALL ATTORNEYS IN NON-TIME LIMITED/PERMANENT POSITIONS MUST SERVE A   ","2- YEAR TRIAL PERIOD BEGINNING ON THE FIRST DAY OF THEIR SERVICE IN A ","NON-TIME LIMITED/PERMANENT APPOINTMENT                                  ","                                                                       ","                                                                       ","                                                                      ","                                                            "," "," "]
["D17","N","2018-10-28","TRIAL PERIODS AFFECT RETENTION STANDING IN REDUCTION-IN-FORCE (RIF). ","TRIAL PERIODS DO NOT AFFECT APPEAL AND DUE PROCESS RIGHTS IN THE EVENT","OF AN ADVERSE ACTION, WHICH ARE DETERMINED BY 5 U.S.C.4303 AND 7513     ","                                                                       ","                                                                       ","                                                                      ","                                                            "," "," "]
["DE0","N","1997-12-01","CONGRATULATIONS! THIS BONUS IS AWARDED FOR YOUR PARTICIPATION IN DEA'S","FOREIGN LANGUAGE BONUS PROGRAM.  IT IS COMPUTED ON YOUR BASE SALARY AS","OF THE LAST FULL PAY PERIOD PRIOR TO THE END OF THE LAST FISCAL YEAR.","(SEPTEMBER 30TH). COMPUTATION BASED ON TESTED LANGUAGE PROFICIENCY AND","CERTIFIED USE IN SERVICE.  RESULTS OF BONUS AND AWARDS COMMITTEE REVIEW","AND EVALUATION PRODUCE CERTIFIED BONUS VALUE."," "," "," "]
["DIS","N","2003-08-01","YOU ARE ELIGIBLE TO APPLY FOR DISABILITY RETIREMENT.","PLEASE CONTACT YOUR AGENCY'S RETIREMENT SECTION","_________________________  PHONE NO._______________."," "," "," "," "," "," "]
["DJ1","N","1993-10-01","BEGINNING NOVEMBER 1, 1993, PAY PLAN CODE \"GM\" WILL IDENTIFY EMPLOYEES","COVERED  BY THE PMRS TERMINATION PROVISIONS OF PUBLIC LAW 103-89.  A GM","EMPLOYEE WILL CONTINUE TO BE PAID AT HIS/HER CURRENT RATE OF PAY AND WIL","BE ELIGIBLE FOR WITHIN-GRADE INCREASES (WGI'S). THE WAITING PERIOD","BEGINS OCTOBER 3, 1993."," "," "," "," "]
["DJ2","N","1993-10-01","BEGINNING NOVEMBER 1, 1993, PAY PLAN CODE \"GM\" WILL IDENTIFY EMPLOYEES","COVERED BY THE PMRS TERMINATION PROVISIONS OF PUBLIC LAW 103-89.  A GM","EMPLOYEE WILL CONTINUE TO BE PAID AT HIS/HER CURRENT RATE OF PAY AND WIL","BE ELIGIBLE FOR WITH-IN GRADE INCREASES (WGI'S).  THE WGI WAITING PERIOD","BEGINS THE DAY THE EMPLOYEE RECEIVED HIS/HER LAST EQUIVALENT INCREASE."," "," "," "," "]
["DJ3","N","1993-10-01","THIS ACTION TERMINATES THE EMPLOYEE'S COVERAGE UNDER THE PROVISIONS OF","PL 103-89 AND THE USE OF THE GM PAY PLAN CODE."," "," "," "," "," "," "," "]
["DJ4","N","1993-10-01","BEGINNING NOVEMBER 1, 1993, PAY PLAN CODE \"GM\" WILL IDENTIFY EMPLOYEES","COVERED BY THE PMRS TERMINATION PROVISIONS OF PUBLIC LAW 103-89.  A GM","EMPLOYEE WILL CONTINUE TO BE PAID AT HIS/HER CURRENT RATE OF PAY AND WIL","BE ELIGIBLE FOR WITHIN GRADE INCREASES (WGI'S).  SINCE YOUR","SALARY IS AT OR ABOVE THE TOP OF YOUR GRADE, YOU WILL NOT BE RECEIVING","WGI'S."," "," "," "]
["DJ5","N","1995-01-26","SALARY IN BLOCK 20 IS \"CONTINUED PAY\" WHICH CONSISTS OF WORLDWIDE/","NATIONWIDE SPECIAL RATE PLUS AN INTERIM GEOGRAPHIC ADJUSTMENT (IGA) OR","SPECIAL PAY ADJUSTMENT(SPA) FOR LAW ENFORCEMENT OFFICERS.  \"CONTINUED PA","AND GENERAL PAY INCREASES, ARE AUTHORIZED IN 5 CFR 531.106 AND 531.307.","A RESULT OF THIS ACTION, BASIC PAY (BLOCK 20A) HAS INCREASED, HOWEVER, T","CONTINUED RATE (BLOCK 20) REMAINS THE SAME. SALARY IN BLOCK 20B INCLUDES","THE IGA/SPA AMOUNT WHICH IS REDUCED BY THE AMOUNT OF THE INCREASE IN BAS","BLOCK A)."," "]
["DJ7","N","1995-02-05","APPOINTMENT IS SUBJECT TO THE COMPLETION OF A ONE-YEAR TRIAL PERIOD","BEGINNING __________.  WHILE SERVING THE TRIAL PERIOD, YOU MAY BE REMOVE","WITHOUT CAUSE OR THE RIGHT TO APPEAL."," "," "," "," "," "," "]
["DJ8","N","1994-11-27","THIS TEMPORARY LIMITED APPOINTMENT MEETS THE REQUIREMENTS OF 5 CFR 316.4","(A)"," "," "," "," "," "," "," "]
["DJ9","N","1995-02-05","APPOINTMENT IS SUBJECT TO THE COMPLETION OF A TWO-YEAR TRIAL PERIOD","BEGINNING __________.  WHILE SERVING THE TRIAL PERIOD, YOU MAY BE REMOVE","WITHOUT CAUSE OR THE RIGHT TO APPEAL."," "," "," "," "," "," "]
["E01","N","1982-06-28","APPOINTMENT IS INDEFINITE."," "," "," "," "," "," "," "," "]
["E03","N","1981-12-01","TRIAL PERIOD COMPLETED."," "," "," "," "," "," "," "," "]
["E04","N","1981-12-01","INITIAL PROBATIONARY PERIOD COMPLETED."," "," "," "," "," "," "," "," "]
["E05","N","1981-12-01","DATE FOR COMPLETION OF PROBATIONARY OR TRIAL PERIOD HAS BEEN ADJUSTED TO","REFLECT EXCESS TIME IN NONPAY STATUS.  NEW ESTIMATED COMPLETION DATE IS"," "," "," "," "," "," "," "]
["E06","N","1983-12-25","DATE FOR COMPLETION OF PROBATIONARY OR TRIAL PERIOD HAS BEEN ADJUSTED TO","REFLECT CREDIT FOR SERVICE ON INTERMITTENT WORK SCHEDULE. ESTIMATED","COMPLETION DATE IS         ."," "," "," "," "," "," "]
["E07","N","1991-04-07","YOU WILL BE IN TENURE GROUP II UNTIL YOU COMPLETE THE ONE-YEAR","PROBATIONARY PERIOD THAT BEGAN  / / ; THEN YOU WILL BE CHANGED","BACK TO TENURE GROUP I."," "," "," "," "," "," "]
["E08","N","2013-10-06","ADMINISTRATIVE LAW JUDGES RECEIVE A CAREER APPOINTMENT AND ARE EXEMPT","FROM THE PROBATIONARY PERIOD REQUIREMENTS.                            ","                                                                        ","                                                                       ","                                                                       ","                                                                      ","                                                            "," "," "]
["E14","N","2003-08-01","CORRECTION TO SALARY DUE TO RETRO PAY ADJUSTMENT EFFECTIVE 01-14-01."," "," "," "," "," "," "," "," "]
["E16","N","1981-12-01","YOUR VETERANS PREFERENCE IS NOT APPLICABLE FOR REDUCTION IN FORCE PURPOS"," "," "," "," "," "," "," "," "]
["E18","Y","1981-12-01","APPOINTMENT IS SUBJECT TO COMPLETION OF ONE YEAR INITIAL PROBATIONARY","PERIOD BEGINNING @        @."," "," "," "," "," "," "," "]
["E19","Y","1981-12-01","APPOINTMENT IS SUBJECT TO COMPLETION OF ONE YEAR TRIAL PERIOD BEGINNING","@        @."," "," "," "," "," "," "," "]
["E21","N","1981-12-01","YOU ARE SUBJECT TO REGULATIONS GOVERNING CONDUCT AND RESPONSIBILITIES OF","SPECIAL GOVERNMENT EMPLOYEES."," "," "," "," "," "," "," "]
["E23","N","1981-12-01","VETERAN PREFERENCE IS NOT APPLICABLE TO THE SENIOR EXECUTIVE SERVICE."," "," "," "," "," "," "," "," "]
["E24","N","1981-12-01","PROBATIONARY PERIOD FOR SES POSITION IS NOT REQUIRED."," "," "," "," "," "," "," "," "]
["E25","Y","1990-03-25","SUBJECT TO SATISFACTORY COMPLETION OF 1-YEAR SES PROBATIONARY PERIOD","BEGINNING @        @"," "," "," "," "," "," "," "]
["E37","N","1981-12-01","SATISFACTORILY COMPLETED TRAINING PRESCRIBED UNDER OPM-APPROVED TRAINING","AGREEMENT. MEETS BASIC QUALIFICATIONS FOR OTHER POSITIONS IN THIS SERIES"," "," "," "," "," "," "," "]
["E39","N","1981-12-01","EMPLOYEE IS ASSIGNED TO A WORKER-TRAINEE DEVELOPMENTAL POSITION."," "," "," "," "," "," "," "," "]
["E44","N","1981-12-01","PROBATIONARY PERIOD FOR SUPERVISORY OR MANAGERIAL POSITION NOT REQUIRED."," "," "," "," "," "," "," "," "]
["E45","N","1981-12-01","PROBATIONARY PERIOD FOR SUPERVISORY OR MANAGERIAL POSITION COMPLETED."," "," "," "," "," "," "," "," "]
["E46","Y","1982-09-19","SUBJECT TO COMPLETION OF @        @ PROBATIONARY PERIOD FOR ASSIGNMENT","TO SUPERVISORY OR MANAGERIAL POSITION BEGINNING @        @."," "," "," "," "," "," "," "]
["E51","N","1981-12-01","EMPLOYEE HAS GUARANTEED PLACEMENT RIGHTS DURING PROBATION."," "," "," "," "," "," "," "," "]
["E54","N","1981-12-01","EMPLOYEE ELECTS TO CONTINUE APPROPRIATE SES PROVISIONS UNDER 5 USC 3392("," "," "," "," "," "," "," "," "]
["E56","N","1987-08-12","QUALIFIED FOR THIS POSITION ONLY UNDER TRAINING AGREEMENT. NOT ELIGIBLE","FOR OTHER POSITIONS IN THIS SERIES UNTIL SATISFACTORILY COMPLETES","PRESCRIBED TRAINING."," "," "," "," "," "," "]
["E58","N","1991-03-11","APPT IS ON A PROVISIONAL BASIS. YOU ARE ELIGIBLE FOR RETIREMENT COVERAGE","FOR FEHB AND FEGLI. IF YOUR PERFORMANCE IS SATISFACTORY, & YOU MEET ALL","LEGAL QUALIFICATIONS & OTHER APPLICABLE REQMTS, YOU MAY BE CONVERTED TO","NONTEMP APPT BEFORE THIS APPT EXPIRES."," "," "," "," "," "]
["E59","N","2013-10-01","WHEN '7' IS REFLECTED IN BLOCK 23 ABOVE, EMPLOYEE IS ENTITLED TO NO","POINTS/ SOLE SURVIVORSHIP PREFERENCE."]
["EEE","N","2003-08-01","SALARY WOULD BE *$________IF NOT LIMITED BY 5 U.S.C. 5308."," "," "," "," "," "," "," "," "]
["EM2","N","1994-10-01","THIS ACTION IMPLEMENTS THE ERS REORGANIZATION OF 10/01/94."," "," "," "," "," "," "," "," "]
["EPP","N","2003-08-01","PERFORMANCE PLAN REQUIRED DUE TO:","__________________________________________________________."," "," "," "," "," "," "," "]
["FC1","N","1996-04-01","THE PROJECTED FULL PERFORMANCE LEVEL FOR THIS POSITION IS        , AND","PROMOTION(S) UP TO THIS LEVEL MAY BE MADE WITHOUT FURTHER COMPETITION.","PROMOTION(S) UP TO        QUALIFY AS CAREER LADDER PROMOTION(S)."," "," "," "," "," "," "]
["FC2","N","2000-06-19","TIME OFF AWARD HOURS MUST BE USED WITHIN TWO CALENDAR YEARS FROM THE","EFFECTIVE DATE."," "," "," "," "," "," "," "]
["FC3","N","2000-05-02","YOUR INITIAL APPOINTMENT IS TO WORK ON AUCTIONS, AND YOUR SALARY IS","FUNDED BY AUCTIONS REIMBURSEMENTS. YOU ARE NOT ELIGIBLE TO APPLY FOR FCC","WIDE ANNOUNCED VACANCIES UNLESS IT IS SPECIFICALLY NOTED ON THE VACANCY","ANNOUNCMENT THAT IT IS AN AUCTIONS FUNDED POSITION.  YOU ARE ELIGIBLE TO","APPLY FOR ANY COMMISSION VACANCIES WITH AN \"ALL SOURCES\" AREA OF","CONSIDERATION WHICH IS OPEN TO ALL QUALIFIED CANDIDATES BOTH FROM WITHIN","AND OUTSIDE THE GOVERNMENT"," "," "]
["FC4","N","2000-03-02","AUCTIONS FUNDED POSITION"," "," "," "," "," "," "," "," "]
["FC5","N","2001-12-15","AS A NON-PREFERENCE ELIGIBLE EMPLOYEE IN THE EXCEPTED SERVICE, YOU DO N\tHAVE GRIEVANCE OR APPEAL RIGHTS OF AN ADVERSE ACTION UNDER 5 U.S.C.\tCHAPTER 75 OR AN UNACCEPTABLE PERFORMANCE ACTION UNDER\t5 U.S.C. CHAPTER 43 UNTIL YOU HAVE COMPLETED 2 YEARS OF CURRENT CONTINUO\tSERVICE IN THE SAME OR SIMILAR POSITION."," "," "," "," "]
["FC6","N","2001-12-15","AS A PREFERENCE ELIGIBLE EMPLOYEE IN THE EXCEPTED SERVICE, YOU DO NOT\tHAVE GRIEVANCE OR APPEAL RIGHTS OF AN ADVERSE ACTION UNDER 5 U.S.C\tCHAPTER 75 OR AN UNACCEPTABLE PERFORMANCE ACTION UNDER\t5 U.S.C. CHAPTER 43 UNTIL YOU HAVE COMPLETED 1 YEAR OF CURRENT CONTINUOU\tSERVICE IN THE SAME OR SIMILAR POSITION."," "," "," "," "]
["FD1","N","1995-10-01","IN ACCORDANCE WITH THE 08/08/94 NTEU/FDIC JOINT RELEASE AND RELATED POLI","DECISIONS, THIS TIME-LIMITED PROMOTION WILL BE EFFECTIVE THROUGH 03/30/9","IF NOT SELECTED FOR A PERMANENT POSITION, THE INCUMBENT MAY RETAIN THE","SALARY ASSOCIATED WITH THIS TIME-LIMITED PROMOTION THROUGH 01/04/97 OR","THROUGH THE END OF THEIR APPOINTMENT WHICHEVER DATE OCCURS FIRST.  THIS","ASSIGNMENT MAY BE CLASSIFIED AT A LOWER GRADE LEVEL."," "," "," "]
["FD2","N","1995-01-22","MOBILITY REQUIREMENTS: THE INCUMBENT OF THIS POSITION MAY BE REASSIGNED/","RELOCATED TO ANY GEOGRAPHICAL LOCATION WHERE THE EMPLOYEE'S SERVICES ARE","NEEDED AS DETERMINED BY MANAGEMENT. EMPLOYEE SIGNED MOBILITY AGREEMENT","DATED   /  /  ."," "," "," "," "," "]
["FD3","N","1995-04-30","TO CALCULATE TOTAL COMPENSATION, MULTIPLY    % REMAINING REGIONAL PAY","DIFFERENTIAL TIMES BASIC PAY (BLOCK 20A) AND ADD TO TOTAL SALARY (BLOCK"," "," "," "," "," "," "," "]
["FD4","N","1996-03-31","YOUR PERSONNEL OFFICE IDENTIFIER IN BLOCK 48 HAS CHANGED WITH THIS","PERSONNEL ACTION. YOUR NEW SERVICING PERSONNEL OFFICE IS LOCATED AT:","FEDERAL DEPOSIT INSURANCE CORPORATION","1201 W. PEACHTREE STREET, NE","ATLANTA, GA  30309-3415","(404) 817-2596"," "," "," "]
["FD5","N","1996-03-31","YOUR PERSONNEL OFFICE IDENTIFIER IN BLOCK 48 HAS CHANGED WITH THIS","PERSONNEL ACTION. YOUR NEW SERVICING PERSONNEL OFFICE IS LOCATED AT:","FEDERAL DEPOSIT INSURANCE CORPORATION","500 W. MONROE","CHICAGO, IL 60661","(312) 382-5788"," "," "," "]
["FD6","N","1996-03-31","YOUR PERSONNEL OFFICE IDENTIFIER IN BLOCK 48 HAS CHANGED WITH THIS","PERSONNEL ACTION. YOUR NEW SERVICING PERSONNEL OFFICE IS LOCATED AT:","FEDERAL DEPOSIT INSURANCE CORPORATION","1910 PACIFIC AVENUE, SUITE 1300","DALLAS, TX 75201","(214) 965-7933"," "," "," "]
["FD7","N","1996-03-31","YOUR PERSONNEL OFFICE IDENTIFIER IN BLOCK 48 HAS CHANGED WITH THIS","PERSONNEL ACTION. YOUR NEW SERVICING PERSONNEL OFFICE IS LOCATED AT:","FEDERAL DEPOSIT INSURANCE CORPORATION","101 EAST RIVER DRIVE","EAST HARTFORD, CT 06108","(860) 291-4703"," "," "," "]
["FD8","N","1996-03-31","YOUR PERSONNEL OFFICE IDENTIFIER IN BLOCK 48 HAS CHANGED WITH THIS","PERSONNEL ACTION. YOUR NEW SERVICING PERSONNEL OFFICE IS LOCATED AT:","FEDERAL DEPOSIT INSURANCE CORPORATION","FOUR PARK PLAZA","IRVINE, CA 92714","(714) 442-1107"," "," "," "]
["FD9","N","1997-02-02","THE ACTUAL REORGANIZATION OF DIVISION FUNCTIONS OCCURRED ON 12/08/96."," "," "," "," "," "," "," "," "]
["FDA","N","1997-09-14","THIS ACTION REFLECTS THE CONVERSION FROM GG TO CG PAY PLAN AND THE\tCONVERSION TO AN OPEN RANGE SALARY STRUCTURE."," "," "," "," "," "," "," "]
["FDB","N","1997-09-14","THIS ACTION REFLECTS THE CONVERSION TO AN OPEN RANGE SALARY STRUCTURE."," "," "," "," "," "," "," "," "]
["FDC","N","2002-01-13","BLOCK 20A,BASIC PAY,INCLUDES A MERIT INCREASE BASED ON THE 2000-2001","SUMMARY NUMERIC SCORE."," ","19-STEP SYSTEM REMAINED IN EFFECT."," "," "," "," "," "]
["FDD","N","1999-03-28","CHANGES MASTER RECORD & INDIVIDUAL POSITION NUMBERS IN BLOCK #15."," "," "," "," "," "," "," "," "]
["FDE","N","1999-03-28","CHANGES        TO        ."," "," "," "," "," "," "," "," "]
["FDF","N","1999-08-01","ADMINISTRATIVE CHANGE ONLY.  TITLE, SERIES, GRADE, SALARY, AND DUTIES","ARE NOT AFFECTED."," "," "," "," "," "," "," "]
["FDG","N","1999-09-01","YOUR PERSONNEL OFFICE IDENTIFIER IN BLOCK 48 HAS CHANGED WITH THIS","PERSONNEL ACTION.  YOUR NEW SERVICING PERSONNEL OFFICE IS LOCATED AT:","FEDERAL DEPOSIT INSURANCE CORPORATION","OFFICE OF INSPECTOR GENERAL, HUMAN RESOURCES BRANCH","801 17TH STREET, NW, ROOM 904A","WASHINGTON, DC 20434","TELEPHONE NUMBER: (202)  416-2966","UMBER:  (202) 416-2968"," "]
["FDH","N","2010-01-03","PAY ADJUSTED TO BRING BASIC PAY TO THE 2010 SALARY RANGE MINIMUM."," "," "," "," "," "," "," "," "]
["FDI","N","2000-07-03","PAY ADJUSTMENT PURSUANT TO SECTION VI.B.3 OF THE 2000-2002 FDIC/NTEU","COMPENSATION AGREEMENT."," "," "," "," "," "," "," "]
["FDJ","N","2002-06-30","CHANGES MASTER RECORD NUMBER IN BLOCK #15 AND/OR ORGANIZATIONAL CODE IN","BLOCK #22. MASTER RECORD NUMBER CHANGES ARE DUE TO A RENUMBERING SYSTEM","ESTABLISHED TO REFLECT THE NEW ORGANIZATION STRUCTURE."," "," "," "," "," "," "]
["FDK","N","2004-01-11","SALARY INCLUDES A CORPORATE SUCCESS AWARD OF 3%."," "," "," "," "," "," "," "," "]
["FDL","N","2004-04-04","ACTION TAKEN TO IMPLEMENT CONVERSION TO CORPORATE MANAGEMENT (CM)","CLASSIFICATION AND PAY PROGRAM."," "," "," "," "," "," "," "]
["FDM","N","2007-05-27","SUBJECT TO COMPLETING A    YEAR TRIAL PERIOD BEGINNING           .","AGREEMENT RELATING TO ASSIGNMENT AS FINANCIAL INSTITUTION SPECIALIST","AND CONDITIONS OF TIME LIMITED EXCEPTED SERVICE APPOINTMENT WAS SIGNED B","EMPLOYEE ON   -  -    . EMPLOYEE IS SUBJECT TO RELOCTION TO MEET","MANAGEMENT NEEDS AS A CONDITION OF EMPLOYMENT."," ","EMPLOYEE          . EMPLOYEE SUBJECT TO RELOCATION TO MEET","EMENT NEEDS AS A CONDITION OF EMPLOYMENT."," "]
["FDN","N","2009-01-18","STATEMENT OF UNDERSTANDING RELATING TO CONDITIONS OF EMPLOYMENT FOR THIS","APPOINTMENT WAS SIGNED BY EMPLOYEE ON              ."," "," "," "," "," "," "," "]
["FDP","N","2009-01-18","PAY SET IN CONSIDERATION OF HIGHEST PREVIOUS RATE EARNED FOR RELATED WOR"," "," "," "," "," "," "," "," "]
["FDQ","N","2009-04-12","REASON FOR TEMPORARY APPOINTMENT:  TO PROVIDE SUPPORT FOR RESOLUTION OF","CLOSED FINANCIAL INSTITUTIONS."," "," "," "," "," "," "," "]
["FDR","N","2009-09-27","EXCEPTION TO CTAP/ICTAP.  THIS APPOINTMENT MAY BE EXTENDED FOR ONE","ADDITIONAL YEAR AS DETERMINED BY THE FDIC FOR A MAXIMUM OF FOUR YEARS.","YOU MAY ALSO BE CONVERTED FROM THIS APPOINTMENT TO A CAREER OR CAREER","CONDITIONAL APPOINTMENT UNDER 5 CFR 213.3202 (B)(11)(D)(IV) WITHOUT","COMPETITION.  SUCH CONVERSION IS DONE AT THE DISCRETION OF THE FDIC BASE","ON SUCCESSFUL JOB PERFORMANCE, COMPLETION OF TRAINING PLAN, AND","AVAILABILITY OF FUNDING.  IF YOU ARE NOT CONVERTED OR EXTENDED, YOU WILL","PARATED FROM THE FDIC AUTOMATICALLY.  EMPLOYEEE SUBJECT TO RELOCATION TO","TO MEET MANAGEMENT NEEDS AS CONDITION OF EMPLOYMENT."]
["FE1","N","2001-12-30","FEHB FAMILY COVERAGE REQUIRED BY P.L. 106-394"," "," "," "," "," "," "," "," "]
["FE2","N","2001-12-30","EMPLOYEE'S FEHB COVERAGE IS NO LONGER SUBJECT TO P.L. 106-394"," "," "," "," "," "," "," "," "]
["FGG","N","2003-08-01","OPEN SEASON CHANGE"," "," "," "," "," "," "," "," "]
["FM1","N","1991-01-13","LAST SEVERANCE PAY CHECK WILL BE __/__/__"," "," "," "," "," "," "," "," "]
["FM2","N","1991-01-13","SEVERANCE PAY ENTITLEMENT TERMINATES UPON REEMPLOYMENT.  IF YOU ARE","EMPLOYED BEFORE YOUR SEVERANCE PAY FUND IS EXHAUSTED, PLEASE NOTIFY","THE PERSONNEL OFFICE."," "," "," "," "," "," "]
["FT1","N","2007-06-24","SALARY INCLUDES A ONE-TIME WITHIN-GRADE ADJUSTMENT; A GENERAL INCREASE","OF 1.7%; AND A LOCALITY PAYMENT APPLICABLE IN THIS AREA."," "," "," "," "," "," "," "]
["G11","N","1994-07-15","EMPLOYEE PAID UNDER 5 U.S.C. CHAPTER 81 FROM          THROUGH          .","THE ENTIRE PERIOD SHALL BE CREDITED FOR ALL RIGHTS AND BENEFITS BASED ON","LENGTH OF SERVICE."," "," "," "," "," "," "]
["G29","Y","1990-01-28","INTERMITTENT EMPLOYMENT TOTALED @        @ HOURS IN WORK STATUS","FROM @        @ TO @        @."," "," "," "," "," "," "," "]
["G30","Y","1990-01-28","INTERMITTENT EMPLOYMENT TOTALED @        @ HOURS IN PAY STATUS","FROM @        @ TO @        @."," "," "," "," "," "," "," "]
["G31","Y","1982-09-19","NONPAY TIME NOT PREVIOUSLY RECORDED IN CALENDAR YEAR @    @","TOTALED @        @ HOURS."," "," "," "," "," "," "," "]
["G33","N","1981-12-01","SERVICE CREDIT FOR RETIREMENT, REDUCTION-IN-FORCE, AND LEAVE ACCRUAL","PURPOSES CONTINUES FOR UP TO A MAXIMUM OF SIX MONTHS OF NONPAY STATUS","TIME PER CALENDAR YEAR."," "," "," "," "," "," "]
["GP1","N","2003-10-01","10% NIGHT RATE"," "," "," "," "," "," "," "," "]
["GP2","N","2003-10-01","12% NIGHT RATE"," "," "," "," "," "," "," "," "]
["GP3","N","2004-01-11","11% NIGHT RATE."," "," "," "," "," "," "," "," "]
["GP4","N","2005-01-09","NIGHT RATE DIFFERENTIAL CHANGED FROM 11% TO 10% EFFECTIVE 01-09-05."," "," "," "," "," "," "," "," "]
["GQS","N","2003-08-01","NIGHT RATE DIFFERENTIAL CHANGED FROM 14% TO 12% EFFECTIVE 01-14-01."," "," "," "," "," "," "," "," "]
["H01","N","1995-03-05","RESULT OF THE REORGANIZATION OF THE OFFICE OF HOUSING"," "," "," "," "," "," "," "," "]
["H02","N","1995-05-08","RESULT OF THE REORGANIZATION OF THE OFFICE OF FAIR HOUSING AND EQUAL","OPPORTUNITY."," "," "," "," "," "," "," "]
["H03","N","1995-05-28","RESULT OF THE REORGANIZATION OF THE OFFICE OF PUBLIC AND INDIAN HOUSING"," "," "," "," "," "," "," "," "]
["H04","N","1995-09-01","RESULT OF SUCCESSFUL COMPLETION OF THE SINGLE FAMILY HOUSING TRAINING","PROGRAM."," "," "," "," "," "," "," "]
["HF1","N","2008-10-26","PER THE ATTACHED DIRECTOR'S MEMO SUBJECT: TRANSFER TO THE FHFA, DATED","10/27/2008, THE EFFECTIVE DATE IN BLOCK 4 OF THIS ACTION IS 10/26/2008."," "," "," "," "," "," "," "]
["HF2","N","2008-10-26","PER THE ATTACHED DIRECTOR'S MEMO SUBJECT: TRANSFER TO THE FHFA, DATED","10/27/2008, THE EFFECTIVE DATE IN BLOCK 4 OF THIS ACTION IS 10/27/2008."," "," "," "," "," "," "," "]
["HRC","N","2007-01-07","MAINTAIN BOTH THE ORIGINAL ACTION AND THE CANCELLATION ACTION IN THE","EMPLOYEE'S OFFICIAL PERSONNEL FOLDER."," "," "," "," "," "," "," "]
["IN1","N","2003-02-23","TO EFFECT THE TRANSFER TO THE DEPARTMENT OF HOMELAND SECURITY (DHS)","EFFECTIVE MARCH 9, 2003, ALL IMMIGRATION AND NATURALIZATION SERVICE","EMPLOYEES ARE TEMPORARILY BEING ASSIGNED TO THE BUREAU OF IMMIGRATION","AND CUSTOMS ENFORCEMENT.  ADDITIONAL ASSIGNMENT ACTIONS WILL BE EFFECTED","AS THE DHS TRANSITION PROGRESSES."," "," "," "," "]
["IR1","N","2003-01-01","OPF MAINTAINED BY: OPF CONSOLIDATED SITE. CONTACT THE ERC","FOR ASSISTANCE AT 1-866-7HELP4U"," "," "," "," "," "," "," "]
["IR2","N","2004-01-25","REASSIGNMENT TO CONVERT EMPLOYEE MOVING FROM POSITION IN IR PAY SYSTEM T","GS FOR PURPOSE OF DETERMINING RETAINED GRADE.  FIRST OF TWO ACTIONS, SAM","DATE."," "," "," "," "," "," "]
["IR3","N","2004-01-25","GRADE RETENTION ENTITLEMENT BASED UPON MOVEMENT FROM POSITION COVERED BY","THE IR PAY SYSTEM.  SECOND ACTION, SAME DATE."," "," "," "," "," "," "," "]
["IR4","N","2004-01-25","IF YOU HAVE QUESTIONS, PLEASE CONTACT THE EMPLOYEE RESOURCE CENTER (ERC)","AT 1-866-743-5748, TTY AT 1-866-924-3578, AND TELL THEM YOU HAVE RECEIVE","A RIF NOTICE."," "," "," "," "," "," "]
["IR5","N","2004-01-25","FOR QUESTIONS, CONTACT THE EMPLOYEE RESOURCE CENTER (ERC) BY PHONE AT","1-866-743-5748, TTY AT 1-866-924-3578, OR FAX 901-546-4597.  ASK THE ERC","REPRESENTATIVE TO ASSIGN YOUR QUESTION TO THE RECORDS VALIDATION TEAM.","A MEMBER OF THE TEAM WILL CONTACT YOU WITH A RESPONSE TO YOUR INQUIRY."," "," "," "," "," "]
["IR6","N","2007-06-10","TIME SERVED ON THIS 120 DAY, NON-COMPETITIVE TEMPORARY PROMOTION IS NOT\tCREDITABLE TOWARD MEETING THE REQUIREMENT FOR ONE-YEAR SUPERVISORY\tPROBATIONARY PERIOD.  IF THE TEMPORARY PROMOTION EXCEEDS 120 DAYS ALL TI\tSERVED ON THIS TEMPORARY PROMOTION BEGINNING,        , WILL BE\tCREDITABLE TOWARD SUPERVISORY PROBATIONARY PERIOD IN ADDITION TO ANY\tPREVIOUS CREDITABLE TIME SERVED"," "," "," "]
["J01","N","1995-04-05","INITIAL APPOINTMENT TO A LAW ENFORCEMENT POSITION."," "," "," "," "," "," "," "," "]
["J02","N","1995-04-05","APPOINTMENT SUBJECT TO SATISFACTORY COMPLETION OF THE INTRODUCTION TO","CORRECTIONAL TECHNIQUES COURSES IN GLYNCO, GEORGIA."," "," "," "," "," "," "," "]
["J03","N","1995-04-05","APPOINTMENT SUBJECT TO COMPLETION OF SATISFACTORY URINALYSIS RESULTS"," "," "," "," "," "," "," "," "]
["J04","N","1997-07-01","ASSIGNMENT TO REVISED AD GRADE."," "," "," "," "," "," "," "," "]
["J05","N","1997-07-01","GRADE BASED ON TOTAL YEARS OF PROFESSIONAL EXPERIENCE."," "," "," "," "," "," "," "," "]
["J06","N","1997-07-01","BASIC PAY IS GREEN-CIRCLED.  INELIGIBLE FOR INCREASES TO BASIC","PAY."," "," "," "," "," "," "," "]
["J07","N","1997-07-01","BASIC PAY IS RED-CIRCLED AND EXCEEDS MAXIMUM FOR GRADE."," "," "," "," "," "," "," "," "]
["J08","N","1997-07-01","BASED ON ANNUAL PAY REVIEW, INCREASE IN GRADE WITH NO INCREASE IN","BASIC PAY."," "," "," "," "," "," "," "]
["J09","N","1997-07-01","BASED ON ANNUAL PAY REVIEW, INCREASE IN BASIC PAY, NO INCREASE IN","GRADE."," "," "," "," "," "," "," "]
["J10","N","1997-07-01","BASED ON ANNUAL PAY REVIEW, INCREASE IN GRADE AND BASIC PAY."," "," "," "," "," "," "," "," "]
["J11","N","1997-07-01","BASED ON ANNUAL PAY REVIEW, NO GRADE OR BASIC PAY INCREASE."," "," "," "," "," "," "," "," "]
["J12","N","1997-07-01","ACTION CHANGES PERMANENT NON-SUPERVISORY, NON-SENIOR LITIGATION COUNSEL","(SLC) GRADE LEVEL AS A RESULT OF NEW ATTORNEY PAY SYSTEM. MEMORANDUM OF","UNDERSTANDING RELEVENT TO SUPERVISORY/SLC POSITION REMAINS IN EFFECT."," "," "," "," "," "," "]
["J13","N","1998-03-01","PERFORMANCE BONUS PAID UNDER THE ADMINISTRATIVELY DETERMINED (AD) PAY PL"," "," "," "," "," "," "," "," "]
["J14","N","1998-10-11","WELCOME TO THE DEPARTMENT OF JUSTICE"," "," "," "," "," "," "," "," "]
["J15","N","1998-10-11","CONGRATULATIONS ON YOUR PROMOTION"," "," "," "," "," "," "," "," "]
["JM8","N","2003-08-01","EMPLOYEE CONVERTED TO CAREER COND BASED UPON NEW AMENDMENT TO THE VETERA","EMPLOYMENT OPPORTUNITIES ACT OF 1998."," "," "," "," "," "," "," "]
["K01","N","1988-01-01","QUALIFICATION REQUIREMENTS MODIFIED BECAUSE OF GENERAL OPM AMENDMENT."," "," "," "," "," "," "," "," "]
["K02","N","1994-07-15","QUALIFICATIONS WAIVED PER REG. 351.703."," "," "," "," "," "," "," "," "]
["K12","N","1981-12-01","SELECTED FROM                      DATED"," "," "," "," "," "," "," "," "]
["K13","N","1981-12-01","REMOVES TEMPORARY LIMITATION PLACED ON THE LAST ACTION."," "," "," "," "," "," "," "," "]
["K15","N","2013-07-28","SELECTED FROM CERT                            UNDER DELEGATED EXAMINING;"," "," "," "," "," "," "," "," "]
["K16","N","1981-12-01","FROM PROMOTION NTE"," "," "," "," "," "," "," "," "]
["K17","N","2006-04-30","REPROMOTION TO GRADE,LEVEL OR BAND NOT ABOVE THAT FROM WHICH DOWNGRADED","WITHOUT PERSONAL CAUSE AND NOT AT EMPLOYEE'S REQUEST."," "," "," "," "," "," "," "]
["K18","N","2006-04-30","POSITION IS AT THE FULL PERFORMANCE LEVEL OR BAND."," "," "," "," "," "," "," "," "]
["K19","N","1981-12-01","SUCCESSOR POSITION - EMPLOYEE RETAINED IN COMPETITIVE SERVICE."," "," "," "," "," "," "," "," "]
["K20","N","1994-07-10","FULL PERFORMANCE LEVEL OF EMPLOYEE'S POSITION IS           ."," "," "," "," "," "," "," "," "]
["K23","N","1981-12-01","CHANGE IS A RESULT OF A CHANGE IN CLASSIFICATION STANDARDS"," "," "," "," "," "," "," "," "]
["K26","N","1981-12-01","RESULT OF ADDITIONAL DUTIES AND RESPONSIBILITIES."," "," "," "," "," "," "," "," "]
["K27","N","1981-12-01","CHANGE IS A RESULT OF A POSITION REVIEW."," "," "," "," "," "," "," "," "]
["K38","N","1981-12-01","PROMOTED OR REASSIGNED FROM                 EFFECTIVE"," "," "," "," "," "," "," "," "]
["K43","N","1981-12-01","RESULT OF FAILURE TO SATISFACTORILY COMPLETE PROBATIONARY PERIOD FOR A","SUPERVISORY OR MANAGERIAL POSITION."," "," "," "," "," "," "," "]
["K46","N","2004-08-25","DETAILED TO                                            UNDER THE","INTERGOVERNMENTAL PERSONNEL ACT (IPA)."," "," "," "," "," "," "," "]
["K50","Y","1981-12-01","FROM POSITION CHANGE NTE @        @"," "," "," "," "," "," "," "," "]
["K60","N","1993-01-24","ACTION IS IN LIEU OF RIF SEPARATION OF EMPLOYEE RETAINED UNDER TEMPORARY","EXCEPTION."," "," "," "," "," "," "," "]
["L99","N","1992-05-17","PERFORMANCE BONUS IN ACCORDANCE WITH PAY/PERFORMANCE POLICY FOR SENIOR","EXECUTIVES AT LOC"," "," "," "," "," "," "," "]
["LEO","N","2006-10-01","EMPLOYEE'S PAY PLAN IS BEING CHANGED FROM GS TO GL TO IDENTIFY GENERAL","SCHEDULE EMPLOYEES WHO ARE ENTITLED TO LAW ENFORCEMENT OFFICER SPECIAL","BASE RATES AT GRADES 03 THROUGH 10.  THE GL PAY PLAN IS A NEW PAY PLAN","ESTABLISHED BY OPM IN MAY 2005.  OPM REQUIRES THAT THE NEW GL PAY PLAN B","USED FOR ALL QUALIFYING LEOS AT GRADES 03 THROUGH 10 BEGINNING NO LATER","THAN OCTOBER 2006."," "," "," "]
["LUP","N","2003-08-01","POSITION/GRADE/SALARY/LOC/AGENCY CODE REMAINS UNCHANGED"," "," "," "," "," "," "," "," "]
["M01","N","1981-12-01","APPOINTMENT AFFIDAVIT EXECUTED"," "," "," "," "," "," "," "," "]
["M02","N","1981-12-01","YOU HAVE REEMPLOYMENT RIGHTS FOR 2 YEARS IN","GRANTED UNDER REG. 352.204 AND OPM LETTER OF"," "," "," "," "," "," "," "]
["M04","N","1981-12-01","UNDER P.L.96.8, IS ENTITLED TO CONTINUE UNDER FEGLI AND HEALTH BENEFITS.","HAS REEMPLOYMENT RIGHTS IN USDA OR SUCCESSOR AGENCY UPON SEPARATION FROM","THE INSTITUTE, SUBJECT TO SUCH TIME PERIOD AND OTHER CONDITIONS AS THE","PRESIDENT MAY PRESCRIBE."," "," "," "," "," "]
["M06","N","1985-09-01","REASON FOR TEMPORARY APPOINTMENT:"," "," "," "," "," "," "," "," "]
["M10","N","1981-12-01","OPF MAINTAINED BY"," "," "," "," "," "," "," "," "]
["M11","N","2014-11-06","A change to the work schedule or the part-time hours worked during","phased retirement/employment status will result in the termination of","phased retirement/employment status and the phased retirement annuity."," "," "," "," "," "," "]
["M12","N","2014-11-06","Employee may elect to enter full retirement status at any time by","submitting application SF 2801 for CSRS or SF 3107 for FERS."," "," "," "," "," "," "," "]
["M13","N","2014-11-06","If employee’s Phased Retirement terminates for any reason the individual","may not re-elect Phased Retirement."," "," "," "," "," "," "," "]
["M14","N","2014-11-06","Employee is required to spend 20% of their time mentoring. "," "," "," "," "," "," "," "," "]
["M15","N","2014-11-06","FEHB/FEGLI benefits are not affected by phased employment/phased ","retirement."," "," "," "," "," "," "," "]
["M16","N","2014-11-06","The time spent in phased employment/retirement status will be credited","as part-time service for annuity calculation purposes."," "," "," "," "," "," "," "]
["M17","N","2014-11-06","Employee’s phased retirement annuity is terminated. "," "," "," "," "," "," "," "," "]
["M18","N","2014-11-06","Employee is entitled to a composite retirement annuity."," "," "," "," "," "," "," "," "]
["M19","N","2014-11-06","Certify Full Time salary for FEGLI."," "," "," "," "," "," "," "," "]
["M20","N","1981-12-01","ACTION AT EMPLOYEE'S REQUEST."," "," "," "," "," "," "," "," "]
["M23","Y","1981-12-01","CONTINUES PROMOTION NTE @        @"," "," "," "," "," "," "," "," "]
["M24","Y","1981-12-01","CONTINUES POSITION CHANGE NTE @        @."," "," "," "," "," "," "," "," "]
["M26","N","1981-12-01","EMPLOYEE WAS ADVISED OF OPPORTUNITY TO FILE GRIEVANCE AND ELECTED TO DO"," "," "," "," "," "," "," "," "]
["M27","N","1981-12-01","EMPLOYEE WAS ADVISED OF OPPORTUNITY TO FILE GRIEVANCE AND ELECTED NOT TO","DO SO."," "," "," "," "," "," "," "]
["M30","N","1984-03-01","CHANGE FROM ON-CALL TO YEAR-ROUND EMPLOYMENT."," "," "," "," "," "," "," "," "]
["M31","N","1984-03-01","VOLUNTARY CHANGE FROM YEAR-ROUND TO ON-CALL EMPLOYMENT."," "," "," "," "," "," "," "," "]
["M33","N","1981-12-01","ON NONPAY STATUS IN"," "," "," "," "," "," "," "," "]
["M34","N","1981-12-01","ON PART-TIME OR INTERMITTENT APPOINTMENT IN"," "," "," "," "," "," "," "," "]
["M36","N","1986-09-24","CONCURRENT EMPLOYMENT:"," "," "," "," "," "," "," "," "]
["M37","N","2005-03-14","EMPLOYEE FAILED TO MAKE AN ELECTION, COVERAGE IS FERS BY DEFAULT ON","DUE TO PL 106-265 (FERCCA)."," "," "," "," "," "," "," "]
["M38","Y","1986-09-24","FROZEN SERVICE: @  @YRS. @  @MOS."," "," "," "," "," "," "," "," "]
["M39","Y","1986-01-01","CREDITABLE MILITARY SERVICE: @  @YRS. @  @MOS."," "," "," "," "," "," "," "," "]
["M40","N","1986-09-24","PREVIOUS RETIREMENT COVERAGE:"," "," "," "," "," "," "," "," "]
["M41","N","2005-03-14","EMPLOYEE FAILED TO MAKE AN ELECTION, COVERAGE IS CSRS BY DEFAULT ON","DUE TO PL 106-265"," "," "," "," "," "," "," "]
["M42","N","1981-12-01","APPROVED BY                        ON"," "," "," "," "," "," "," "," "]
["M43","N","2005-03-14","ERRONEOUS CSRS, SHOULD HAVE BEEN FERS-EMPLOYEE ELECTED CSRS OFFSET","ON             CORRECTION DUE TO P.L. 106-265 (FERCCA)"," "," "," "," "," "," "," "]
["M44","N","1987-01-01","EMPLOYEE ELECTED COVERAGE UNDER FERS."," "," "," "," "," "," "," "," "]
["M45","N","2014-01-01","EMPLOYEE IS AUTOMATICALLY COVERED UNDER FERS,  FERS-RAE OR FERS-FRAE."," "," "," "," "," "," "," "," "]
["M46","N","1988-01-01","EMPLOYEE IS COVERED UNDER FERS BECAUSE OF PREVIOUS ELECTION."," "," "," "," "," "," "," "," "]
["M47","N","2005-03-14","ERRONEOUS CSRS, SHOULD HAVE BEEN FERS-EMPLOYEE ELECTED FERS ON","CORRECTION DUE TO P.L. 106-265 (FERCCA)"," "," "," "," "," "," "," "]
["M48","N","2005-03-14","ERRONEOUS CSRS OFFSET, SHOULD HAVE BEEN FERS - EMPLOYEE ELECTED TO","REMAIN IN CSRS OFFSET ON     CORRECTION DUE TO PL 106-265 (FERCCA)."," "," "," "," "," "," "," "]
["M49","N","2005-03-14","ERRONEOUS CSRS OFFSET, SHOULD HAVE BEEN FERS - EMPLOYEE ELECTED FERS ON","CORRECTION DUE TO PL 106-265 (FERCCA)."," "," "," "," "," "," "," "]
["M50","Y","2005-03-14","ERRONEOUS CSRS, SHOULD HAVE BEEN SOCIAL SECURITY ONLY -EMPLOYEE ELECTED","CSRS OFFSET ON                 CORRECTION DUE TO PL 106-265 (FERCCA)."," "," "," "," "," "," "," "]
["M51","N","2005-03-14","ERRONEOUS CSRS, SHOULD HAVE BEEN SOCIAL SECURITY ONLY- EMPLOYEE ELECTED","SOCIAL SECURITY ONLY ON           , CORRECTION DUE TO PL 106-265 (FERCCA"," "," "," "," "," "," "," "]
["M52","N","1981-12-01","EMPLOYEE DECLINED CONVERSION TO THE SENIOR EXECUTIVE SERVICE AND CONTINU","UNDER                     WITH ALL ASSOCIATED RIGHTS AND BENEFITS."," "," "," "," "," "," "," "]
["M53","N","1981-12-01","EMPLOYEE IS TO SUFFER NO LOSS OF OR REDUCTION IN: PAY, LEAVE, CREDIT FOR","TIME OR SERVICE, OR PERFORMANCE OR EFFICIENCY RATING."," "," "," "," "," "," "," "]
["M54","N","2005-03-14","ERRONEOUS CSRS OFFSET, SHOULD HAVE BEEN SOCIAL SECURITY ONLY - EMPLOYEE","ELECTED TO REMAIN IN CSRS OFFSET ON       , CORRECTION DUE TO PL 106-265"," "," "," "," "," "," "," "]
["M55","N","2005-03-14","ERRONEOUS CSRS OFFSET, SHOULD HAVE BEEN SOCIAL SECURITY ONLY - EMPLOYEE","ELECTED SOCIAL SECURITY ONLY ON          ,DUE TO PL 106-265 (FERCCA)"," "," "," "," "," "," "," "]
["M56","N","2005-03-14","ERRONEOUS FERS, SHOULD HAVE BEEN CSRS - EMPLOYEE ELECTED TO REMAIN IN","FERS ON     , CORRECTION DUE TO PL 106-265 (FERCCA)."," "," "," "," "," "," "," "]
["M57","N","2005-03-14","ERRONEOUS FERS, SHOULD HAVE BEEN CSRS - EMPLOYEE ELECTED CSRS ON",", CORRECTION DUE TO PL 106-265 (FERCCA)."," "," "," "," "," "," "," "]
["M58","N","1981-12-01","NO SES REINSTATEMENT RIGHTS."," "," "," "," "," "," "," "," "]
["M59","N","2005-03-14","ERRONEOUS FERS, SHOULD HAVE BEEN CSRS OFFSET - EMPLOYEE ELECTED TO","REMAIN IN FERS ON      , CORRECTION DUE TO PL 106-265 (FERCCA)."," "," "," "," "," "," "," "]
["M60","N","1981-12-01","INFORMATION ON POSSIBLE 5 U.S.C. CHAPTER 83, SUBCHAPTER II, CASE MAY BE","OBTAINED FROM:"," "," "," "," "," "," "," "]
["M61","N","1981-12-01","POSSIBLE 5 U.S.C CHAPTER 83, SUBCHAPTER II, CASE."," "," "," "," "," "," "," "," "]
["M62","N","1981-12-01","YOU HAVE REEMPLOYMENT RIGHTS IN THIS AGENCY UNDER 5 USC 3582 PROVIDED","SEPARATION IS NO LATER THAN            AFTER THE DATE OF ENTRY ON DUTY","IN                      AND YOU APPLY TO THIS AGENCY WITHIN 90 DAYS FROM","DATE OF YOUR SEPARATION."," "," "," "," "," "]
["M63","N","2005-03-14","ERRONEOUS FERS, SHOULD HAVE BEEN CSRS OFFSET - EMPLOYEE ELECTED CSRS","OFFSET ON               , CORRECTION DUE TO PL 106-265 (FERCCA)"," "," "," "," "," "," "," "]
["M64","N","1981-12-01","YOU HAVE REEMPLOYMENT RIGHTS IN                 FOR","UNDER"," "," "," "," "," "," "," "]
["M65","N","2005-03-14","ERRONEOUS FERS, SHOULD HAVE BEEN SOCIAL SECURITY ONLY - EMPLOYEE ELECTED","TO REMAIN IN FERS ON        , CORRECTION DUE TO PL 106-265 (FERCCA)."," "," "," "," "," "," "," "]
["M66","N","2005-03-14","ERRONEOUS FERS, SHOULD HAVE BEEN SOCIAL SECURITY ONLY - EMPLOYEE ELECTED","SOCIAL SECURITY ONLY ON    , CORRECTION DUE TO PL 106-265 (FERCCA)."," "," "," "," "," "," "," "]
["M67","N","1980-01-01","FORWARDING ADDRESS=","     \"        \"   :"," "," "," "," "," "," "," "]
["M68","N","2005-03-14","CORRECTION IS THE RESULT OF CORRECTION MADE UNDER PL 106-265 (FERCCA)."," "," "," "," "," "," "," "," "]
["M71","N","1982-05-17","REASON FOR PLACEMENT IN NONPAY STATUS:"," "," "," "," "," "," "," "," "]
["M72","N","1981-12-01","REASON FOR FURLOUGH:"," "," "," "," "," "," "," "," "]
["M73","N","1982-10-31","TO BE FURLOUGHED ON (                    ), FOR TOTAL OF (      ) HOURS."," "," "," "," "," "," "," "," "]
["M74","N","1981-12-01","CHANGES DATA ELEMENT(S) IN BLOCK(S)"," "," "," "," "," "," "," "," "]
["M75","N","2013-04-07","TO BE FURLOUGHED ON DISCONTINUOUS DAYS BETWEEN (                        ","AND (                                NOT TO EXCEED A MAXIMUM  OF (      ","DURING THE FURLOUGH PERIOD.  YOU WILL BE NOTIFIED OF THE SPECIFIC DATES ","THAT YOU WILL BE FURLOUGHED DURING EACH PAY PERIOD.                    ","                                                                       ","                                                                       ","                                                            "," "," "]
["M76","N","1982-10-31","REQUESTED, IN LIEU OF ANNUAL LEAVE, AFTER DECLINING OFFER OF"," "," "," "," "," "," "," "," "]
["M78","N","1981-12-01","REALIGNMENT REFLECTS A CHANGE FROM THE SOUTH CENTRAL REGION TO THE","MID-ATLANTIC REGION."," "," "," "," "," "," "," "]
["M79","N","1998-05-24","CHANGES POSITION SENSITIVITY (BLOCK 4) IN POSITION MANAGEMENT SYSTEM."," "," "," "," "," "," "," "," "]
["M80","N","1982-09-19","VARIATIONS UNDER CS RULE 5 APPROVED BY OPM         ."," "," "," "," "," "," "," "," "]
["M81","N","1990-03-26","CODE S IN BLOCK 32 INDICATES A PART-TIME EMPLOYEE WHO IS JOB SHARING"," "," "," "," "," "," "," "," "]
["M82","N","1990-03-26","CODE T IN BLOCK 32 INDICATES A SEASONAL EMPLOYEE, WITH A PART-TIME","SCHEDULE, WHO IS JOB SHARING"," "," "," "," "," "," "," "]
["M83","N","1992-08-23","THE 3-YEAR LIMIT ON ELIGIBILITY FOR REINSTATEMENT IS EXTENDED BY THE","PERIOD YOU SERVE ON EXECPTED, SES, TERM, OR TEMPORARY APPOINTMENT."," "," "," "," "," "," "," "]
["M85","N","1992-10-18","YOU ARE SCHEDULED TO WORK A MINIMUM OF (    ) HOURS PER WEEK;","ADDITIONAL HOURS MAY BE SCHEDULED WHEN NEEDED TO COMPLETE ASSIGNMENTS."," "," "," "," "," "," "," "]
["M90","N","1993-10-08","EMPLOYEE RETAINED, ON ACCRUED ANNUAL LEAVE NTE   /  /  ,PAST RIF SEPARAT"," OF   /  /   TO ESTABLISH ELIGIBILITY FOR (","                                                                  )."," "," "," "," "," "," "]
["M91","N","1993-10-08","EMPLOYEE RETAINED ON SICK LEAVE PAST RIF SEPARATION DATE OF   /  /  ."," "," "," "," "," "," "," "," "]
["M92","N","1993-01-24","EMPLOYEE RETAINED PAST RIF EFFECTIVE DATE OF   /  /  TO (","                                                                      )."," "," "," "," "," "," "," "]
["M93","N","1993-10-08","EMPLOYEE RETAINED UNDER AUTHORITY OF LIQUIDATION PROVISIONS PRIOR TO","COMPLETION OF LIQUIDATION ON RIF SEPARATION DATE OF   /  /  ."," "," "," "," "," "," "," "]
["M94","N","2002-01-11","EMPLOYEE ELECTED DEEMED FERS COVERAGE UNDER 5 CFR 846.204 (B)(2)(I) ON"," "," "," "," "," "," "," "," "]
["M95","N","2002-01-11","EMPLOYEE GIVEN DEEMED FERS ELECTION NOTICE ON         , AND DID NOT","RESPOND.  EMPLOYEE IS DEEMED TO HAVE ELECTED FERS COVERAGE UNDER","5 CFR 846.204 (B)(2)(I)."," "," "," "," "," "," "]
["M96","N","2002-01-11","EMPLOYEE DECLINED FERS COVERAGE UNDER 5 CFR 846.204 (B)(2)(II) ON"," "," "," "," "," "," "," "," "]
["M97","N","2009-04-12","EMPLOYEE SUBJECT TO POST-EMPLOYMENT RESTRICTIONS UNDER","18 U.S.C. 207(C)."," "," "," "," "," "," "," "]
["MAH","N","2013-07-28","REG.362.107(A)                                                          ","                                                                        ","                                                                        ","                                                                       ","                                                                       ","                                                                       ","                                                            "," "," "]
["MIL","N","2002-08-25","THE AGENCY IS NOT PAYING THE EMPLOYEE'S SHARE OF FEHB PREMIUMS. THE","EMPLOYEE MUST MAKE ARRANGEMENTS WITH THE AGENCY FOR PAYMENT AS A BILL","WILL BE GENERATED UPON THE EMPLOYEE'S RETURN TO DUTY STATUS."," "," "," "," "," "," "]
["MOM","N","2003-08-01","SIDE ISSUE PAY MEMO APPROVED 08-06-1991."," "," "," "," "," "," "," "," "]
["N10","N","1979-12-01","TO (OR EXPECTED TO) BE PAID UNDER 5 U.S.C CHAPTER 81."," "," "," "," "," "," "," "," "]
["N11","N","1986-03-11","EMPLOYEE IS ENTITLED TO 45 CALENDAR DAYS OF CONTINUATION OF REGULAR PAY","UNDER 5 U.S.C., CHAPTER 81, SECTION 8118."," "," "," "," "," "," "," "]
["N12","N","1986-03-11","EXPECTED TO BE PAID UNDER 5 U.S.C. CHAPTER 81 FOLLOWING 45 CALENDAR DAYS","COP PERIOD."," "," "," "," "," "," "," "]
["N20","N","1981-12-01","SEVERANCE PAY PAYMENTS TO BE RESUMED BY"," "," "," "," "," "," "," "," "]
["N21","N","1981-12-01","SEVERANCE PAY TO BE RECOMPUTED BY"," "," "," "," "," "," "," "," "]
["N22","N","1981-12-01","ENTITLED TO          SEVERANCE PAY FUND TO BE PAID AT THE RATE OF","         PER WEEK OVER     WEEKS BEGINNING"," "," "," "," "," "," "," "]
["N23","N","1981-12-01","NOT ENTITLED TO SEVERANCE PAY."," "," "," "," "," "," "," "," "]
["N24","N","1981-12-01","SEVERANCE PAY SUSPENDED BY       UNTIL TERMINATION OF THIS APPOINTMENT."," "," "," "," "," "," "," "," "]
["N25","N","1981-12-01","SEVERANCE PAY DISCONTINUED.  EMPLOYEE HAS RECEIVED         WEEKS OF","SEVERANCE PAY."," "," "," "," "," "," "," "]
["N26","N","1981-12-01","LUMP-SUM PAYMENT TO COVER          HOURS ENDING"," "," "," "," "," "," "," "," "]
["N27","N","1982-06-01","LUMP-SUM PAYMENT TO BE MADE FOR ANY UNUSED ANNUAL LEAVE."," "," "," "," "," "," "," "," "]
["N30","N","1988-07-03","THIS ACTION RECORDS TOTAL AMOUNT RECEIVED UNDER PRODUCTIVITY","GAINSHARING AWARD PROGRAM DURING FY__."," "," "," "," "," "," "," "]
["N31","N","1991-04-07","FOR ADOPTION OF SUGGESTION NUMBER"," "," "," "," "," "," "," "," "]
["N32","N","1991-04-07","FOR ADOPTION OF INVENTION NUMBER"," "," "," "," "," "," "," "," "]
["N33","N","1994-07-15","FOR PATENT NO.                      ."," "," "," "," "," "," "," "," "]
["N59","N","1981-12-01","OPF RETAINED BY"," "," "," "," "," "," "," "," "]
["N60","N","1991-09-22","THIS ACTION RECORDS TOTAL TIME OFF HOURS USED DURING THE CURRENT LEAVE","YEAR."," "," "," "," "," "," "," "]
["N61","N","1992-08-23","PER REG. 531.203(D)(2)(VI), THE RATE RECEIVED SOLELY DURING PERIOD OF","INTERIM WGI MAY NOT BE USED TO ESTABLISH HIGHEST PREVIOUS RATE."," "," "," "," "," "," "," "]
["N62","N","2011-03-13","RETROACTIVE ELECTION OF NAFI COVERAGE UNDER P.L.104-106"," "," "," "," "," "," "," "," "]
["O01","N","2004-02-25","EMPLOYEE ELECTED OTS BASIC LIFE INSURANCE COVERAGE"," "," "," "," "," "," "," "," "]
["O02","N","2004-02-25","EMPLOYEE ELECTED OTS BASIC LIFE INSURANCE AND SPOUSE-A COVERAGE"," "," "," "," "," "," "," "," "]
["O03","N","2004-02-25","EMPLOYEE ELECTED OTS BASIC LIFE INSURANCE AND FAMILY-A COVERAGE"," "," "," "," "," "," "," "," "]
["O04","N","2004-02-25","EMPLOYEE ELECTED OTS BASIC LIFE INSURANCE, SPOUSE-A AND FAMILY-A COVERAG"," "," "," "," "," "," "," "," "]
["O05","N","2004-02-25","EMPLOYEE ELECTED OTS BASIC LIFE INSURANCE AND EMPLOYEE COVERAGE"," "," "," "," "," "," "," "," "]
["O06","N","2004-02-25","EMPLOYEE ELECTED OTS BASIC LIFE INSURANCE, EMPLOYEE, AND SPOUSE-A COVERA"," "," "," "," "," "," "," "," "]
["O07","N","2004-02-25","EMPLOYEE ELECTED OTS BASIC LIFE INSURANCE, EMPLOYEE, AND FAMILY-A COVERA"," "," "," "," "," "," "," "," "]
["O08","N","2004-02-25","EMPLOYEE ELECTED OTS BASIC LIFE INSURANCE, EMPLOYEE, SPOUSE-A, AND","FAMILY-A COVERAGE"," "," "," "," "," "," "," "]
["O09","N","2004-02-25","EMPLOYEE ELECTED OTS BASIC LIFE INSURANCE AND SPOUSE-B COVERAGE"," "," "," "," "," "," "," "," "]
["O10","N","2004-02-25","EMPLOYEE ELECTED OTS BASIC LIFE INSURANCE AND FAMILY-B COVERAGE"," "," "," "," "," "," "," "," "]
["O11","N","2004-02-25","EMPLOYEE ELECTED OTS BASIC LIFE INSURANCE, SPOUSE-B, AND FAMILY-B COVERA"," "," "," "," "," "," "," "," "]
["O12","N","2004-02-25","EMPLOYEE ELECTED OTS BASIC LIFE INSURANCE, EMPLOYEE, AND SPOUSE-B COVERA"," "," "," "," "," "," "," "," "]
["O13","N","2004-02-25","EMPLOYEE ELECTED OTS BASIC LIFE INSURANCE, EMPLOYEE, AND FAMILY-B COVERA"," "," "," "," "," "," "," "," "]
["O14","N","2004-02-25","EMPLOYEE ELECTED OTS BASIC LIFE INSURANCE, EMPLOYEE, SPOUSE-B, AND","FAMILY-B COVERAGE"," "," "," "," "," "," "," "]
["O15","N","2004-02-25","EMPLOYEE ELECTED OTS BASIC LIFE INSURANCE, SPOUSE-A, AND FAMILY-B COVERA"," "," "," "," "," "," "," "," "]
["O16","N","2004-02-25","EMPLOYEE ELECTED OTS BASIC LIFE INSURANCE, SPOUSE-B, AND FAMILY-A COVERA"," "," "," "," "," "," "," "," "]
["O17","N","2004-02-25","EMPLOYEE ELECTED OTS BASIC LIFE INSURANCE, EMPLOYEE, SPOUSE-A, AND","FAMILY-B COVERAGE"," "," "," "," "," "," "," "]
["O18","N","2004-02-25","EMPLOYEE ELECTED OTS BASIC LIFE INSURANCE, EMPLOYEE, SPOUSE-B, AND","FAMILY-A COVERAGE"," "," "," "," "," "," "," "]
["O22","N","2004-02-25","EMPLOYEE ELECTED OTS BASIC LIFE INSURANCE AND DOMESTIC PARTNER-A","COVERAGE"," "," "," "," "," "," "," "]
["O24","N","2004-02-25","EMPLOYEE ELECTED OTS BASIC LIFE INSURANCE, DOMESTIC PARTNER-A","AND FAMILY-A COVERAGE"," "," "," "," "," "," "," "]
["O26","N","2004-02-25","EMPLOYEE ELECTED OTS BASIC LIFE INSURANCE, EMPLOYEE, AND DOMESTIC","PARTNER-A COVERAGE"," "," "," "," "," "," "," "]
["O28","N","2004-02-25","EMPLOYEE ELECTED OTS BASIC LIFE INSURANCE, EMPLOYEE, DOMESTIC PARTNER-A,","AND FAMILY-A COVERAGE"," "," "," "," "," "," "," "]
["O29","N","2004-02-25","EMPLOYEE ELECTED OTS BASIC LIFE INSURANCE AND DOMESTIC PARTNER-B","COVERAGE"," "," "," "," "," "," "," "]
["O31","N","2004-02-25","EMPLOYEE ELECTED OTS BASIC LIFE INSURANCE, DOMESTIC PARTNER-B AND","FAMILY-B COVERAGE"," "," "," "," "," "," "," "]
["O32","N","2004-02-25","EMPLOYEE ELECTED OTS BASIC LIFE INSURANCE, EMPLOYEE, AND DOMESTIC","PARTNER-B COVERAGE"," "," "," "," "," "," "," "]
["O34","N","2004-02-25","EMPLOYEE ELECTED OTS BASIC LIFE INSURANCE, EMPLOYEE, DOMESTIC","PARTNER-B, AND FAMILY-B COVERAGE"," "," "," "," "," "," "," "]
["O35","N","2004-02-25","EMPLOYEE ELECTED OTS BASIC LIFE INSURANCE, DOMESTIC PARTNER-A","AND FAMILY-B COVERAGE"," "," "," "," "," "," "," "]
["O36","N","2004-02-25","EMPLOYEE ELECTED OTS BASIC LIFE INSURANCE, DOMESTIC PARTNER-B AND","FAMILY-A COVERAGE"," "," "," "," "," "," "," "]
["O37","N","2004-02-25","EMPLOYEE ELECTED OTS BASIC LIFE INSURANCE, EMPLOYEE, DOMESTIC","PARTNER-A AND FAMILY-B COVERAGE"," "," "," "," "," "," "," "]
["O38","N","2004-02-25","EMPLOYEE ELECTED OTS BASIC LIFE INSURANCE, EMPLOYEE, DOMESTIC","PARTNER-B, AND FAMILY-A COVERAGE"," "," "," "," "," "," "," "]
["O39","N","2004-02-25","RETIREMENT CODE 5 IN BLOCK #30 IS NOT RECOGNIZED AS FEDERAL RETIREMENT","PLAN. SERVICE UNDER THIS CODE IS NOT CREDITABLE TOWARDS LEAVE OR","RETIREMENT IN FUTURE FEDERAL EMPLOYMENT. ADJUSTMENT TO SCD IS NECESSARY"," "," "," "," "," "," "]
["O40","N","2004-02-25","REMARKS CONTINUED ON SECOND PAGE"," "," "," "," "," "," "," "," "]
["O41","N","2004-02-25","OTS LIFE INSURANCE COVERAGE IS EXTENDED FOR 31 DAYS DURING WHICH YOU","ARE ELIGIBLE TO CONVERT TO AN INDIVIDUAL POLICY (NONGROUP CONTRACT)"," "," "," "," "," "," "," "]
["O42","N","2004-02-25","CASH PAYMENT PORTION OF THE ANNUAL MERIT INCREASE"," "," "," "," "," "," "," "," "]
["O43","N","2004-02-25","FEGLI COVERAGE CARRIED INTO FIRF RETIREMENT"," "," "," "," "," "," "," "," "]
["O44","N","2004-02-25","ELECTION OF OTS LIFE INSURANCE"," "," "," "," "," "," "," "," "]
["O45","N","2004-02-25","OTS LIFE INSURANCE COVERAGE CONTINUES FOR UP TO 12 MONTHS IN A","NONPAY STATUS"," "," "," "," "," "," "," "]
["O46","N","2004-02-25","SALARY ADJUSTMENT TO MINIMUM OF SALARY RANGE"," "," "," "," "," "," "," "," "]
["O47","N","2004-02-25","FEHB COVERAGE CARRIED INTO FIRF RETIREMENT"," "," "," "," "," "," "," "," "]
["O48","N","2004-02-25","BLOCKS NUMBER 12B THRU 12D & 20B THRU 20D ARE NOT APPLICABLE BECAUSE","OTS ADMINISTERS A PAY PLAN OUTSIDE THE GENERAL SCHEDULE AS PROVIDED","FOR IN P.L. 101-73"," "," "," "," "," "," "]
["O51","N","2008-04-27","SERVICE FROM (DATE) TO (DATE) CREDITABLE AS CBPO SERVICE"," "," "," "," "," "," "," "," "]
["O52","N","2008-04-27","EXEMPT FROM MANDATORY RETIREMENT AND ELIGIBLE FOR PRORATED ANNUITY","UPON RETIREMENT."," "," "," "," "," "," "," "]
["O53","N","2008-04-27","EMPLOYEE IS SUBJECT TO MANDATORY RETIREMENT."," "," "," "," "," "," "," "," "]
["O54","N","2008-04-27","EMPLOYEE'S SCD FOR ENHANCED CBPO RETIREMENT COVERAGE IS"," "," "," "," "," "," "," "," "]
["O55","N","2004-02-25","EMPLOYEE CANCELLED OTS LIFE INSURANCE"," "," "," "," "," "," "," "," "]
["O56","N","2008-04-27","EMPLOYEE IS NOT ELIGIBLE FOR COVERAGE UNDER THE CBPO RETIREMENT PLAN","EFFECTIVE"," "," "," "," "," "," "," "]
["OFF","Y","2005-06-12","THE CALCULATED HOURLY RATE TO BE USED FOR PAYMENT OF OFF-SET MILITARY","LEAVE IS (*$ ___.__) AS OF @        @."," "," "," "," "," "," "," "]
["P01","N","1981-12-01","PREVIOUSLY EMPLOYED AT (PAY PLAN; GRADE, LEVEL OR BAND; RATE)."," "," "," "," "," "," "," "," "]
["P02","N","1981-12-01","PAY RATE FIXED TO INCLUDE RATE INCREASE DUE ON SAME DATE."," "," "," "," "," "," "," "," "]
["P03","N","1981-12-01","PAY RATE SHOWN IS SUBJECT TO UPWARD RETROACTIVE ADJUSTMENT UPON","VERIFICATION OF PRIOR SERVICE."," "," "," "," "," "," "," "]
["P04","N","2007-12-23","PAY SET USING THE SUPERIOR QUALIFICATIONS AND SPECIAL NEEDS PAY-SETTING","AUTHORITY UNDER 5 CFR 531.212."," "," "," "," "," "," "," "]
["P05","N","1992-03-08","SPECIAL RATE UNDER 5 USC 5305."," "," "," "," "," "," "," "," "]
["P06","N","2006-04-30","PAY RATE INCLUDES RATE CHANGES (E.G., WITHIN-GRADE INCREASES) OR OTHER","RATE CHANGES TO WHICH EMPLOYEE WOULD HAVE BEEN ENTITLED HAD HE/SHE","REMAINED CONTINUOUSLY IN FEDERAL SERVICE."," "," "," "," "," "," "]
["P07","N","2007-01-07","SPECIAL RATE TABLE"," "," "," "," "," "," "," "," "]
["P08","N","1981-12-01","ANNUAL SALARY TO BE REDUCED BY THE AMOUNT OF YOUR RETIREMENT ANNUITY AND","BY FUTURE COST OF LIVING INCREASES."," "," "," "," "," "," "," "]
["P09","N","1981-12-01","PAY OR STEP ADJUSTED          BY"," "," "," "," "," "," "," "," "]
["P10","Y","1981-12-01","ANNUITY AT PRESENT IS @        @PA."," "," "," "," "," "," "," "," "]
["P11","N","2007-01-07","BASIC PAY IN BLOCK 20A IS LAW ENFORCEMENT OFFICER SPECIAL BASE RATE,","WHICH IS HIGHER THAN NORMAL GS RATE."," "," "," "," "," "," "," "]
["P12","N","1981-12-01","ELIGIBILITY DATE FOR WITHIN GRADE INCREASE ADJUSTED TO REFLECT EXCESS","TIME IN NON-PAY STATUS. NEW ESTIMATED ELIGIBILITY DATE IS"," "," "," "," "," "," "," "]
["P13","N","1983-08-21","EFFECTIVE DATE ADJUSTED DUE TO EXCESS TIME IN NONPAY STATUS OF","HOURS."," "," "," "," "," "," "," "]
["P14","N","1983-04-17","WORK PERFORMANCE IS AT AN ACCEPTABLE LEVEL OF COMPETENCE."," "," "," "," "," "," "," "," "]
["P15","N","1981-12-01","WITHIN GRADE INCREASE TO STEP    DENIED BECAUSE YOUR WORK IS NOT AT AN","ACCEPTABLE LEVEL OF COMPETENCE. YOU REMAIN AT GS   , STEP"," "," "," "," "," "," "," "]
["P16","N","1981-12-01","MET ALL REQUIREMENTS FOR WGI TO          ON          DUE ON"," "," "," "," "," "," "," "," "]
["P17","Y","1982-06-01","ENTITLED TO RETAINED OR SAVED RATE OF PAY UNTIL @      @ OTHERWISE","PAY WOULD BE @      @ @      @."," "," "," "," "," "," "," "]
["P18","Y","1981-12-01","RETAINED RATE PERIOD EXPIRES @        @ EFFECTIVE          PAY WILL BE"," "," "," "," "," "," "," "," "]
["P19","N","1984-10-01","SALARY INCLUDES WGI FOR WHICH EMPLOYEE BECAME ELIGIBLE ON              ."," "," "," "," "," "," "," "," "]
["P20","N","1985-09-01","POSITION & PAY REFLECT THE FOLLOWING ACTIONS EFFECTIVE DURING EMPLOYEE'S","ABSENCE"," "," "," "," "," "," "," "]
["P21","N","2023-01-01","EMPLOYEE IS COMMENCING A TEMPORARY ASSIGNMENT WORKING UNDER A DOMESTIC","EMPLOYEE TELEWORKING OVERSEAS (DETO) AGREEMENT AND COMMENCING TO RECEIVE","DETO LOCALITY PAY (SECTION 9717 OF PUBLIC LAW 117-263)."]
["P22","N","2023-01-01","EMPLOYEE’S DETO LOCALITY PAYMENT HAS BEEN ADJUSTED DUE TO CHANGES IN","THE PAYABLE LOCALITY PAY PERCENTAGE."]
["P23","N","2023-01-01","Employee is no longer entitled to locality pay in connection with a","Domestic Employee Teleworking Overseas (DETO) Agreement."]
["P24","N","2023-01-01","Employee is entitled to locality pay under 5 U.S.C. 5304."]
["P30","N","1983-12-25","ELIGIBILITY DATE FOR WGI HAS BEEN ADJUSTED TO REFLECT CREDIT FOR SERVICE","ON INTERMITTENT WORK SCHEDULE.  ESTIMATED ELIGIBILITY DATE IS       ."," "," "," "," "," "," "," "]
["P48","N","1981-12-01","SALARY MAY NOT BE REDUCED BELOW SALARY EARNED IMMEDIATELY PRIOR TO SES","CONVERSION WITH ANY FUTURE INVOLUNTARY ACTION WHILE CONTINUOUSLY EMPLOYE"," "," "," "," "," "," "," "]
["P54","N","1989-06-05","SUPERIOR QUALIFICATIONS APPOINTMENT MADE UNDER 35 CFR 251.42"," "," "," "," "," "," "," "," "]
["P55","N","1989-06-05","SPECIAL RATE UNDER 35 CFR 251.42"," "," "," "," "," "," "," "," "]
["P66","N","1985-09-15","SALARY BLOCK CONTAINS CASH AWARD AMOUNT."," "," "," "," "," "," "," "," "]
["P70","Y","1991-04-07","SALARY IN BLOCK 20 INCLUDES RETENTION ALLOWANCE OF $@          @"," "," "," "," "," "," "," "," "]
["P72","Y","1991-04-07","SALARY IN BLOCK 20 INCLUDES SUPERVISORY DIFFERENTIAL OF $@          @"," "," "," "," "," "," "," "," "]
["P73","N","1991-04-07","BLOCK 20 SHOWS THE PERCENT OF YOUR RATE OF ADJUSTED BASIC PAY WHICH IS","PAID TO YOU FOR THE SUBSTANTIAL, IRREGULAR OVERTIME WORK YOU PERFORM","WHICH CANNOT BE CONTROLLED ADMINISTRATIVELY."," "," "," "," "," "," "]
["P80","Y","1991-04-07","SALARY IN BLOCK 12 INCLUDES SUPERVISORY DIFFERENTIAL OF $@          @"," "," "," "," "," "," "," "," "]
["P81","Y","1991-04-07","SALARY IN BLOCK 20 INCLUDES AUO OF $@          @"," "," "," "," "," "," "," "," "]
["P82","Y","1991-04-07","SALARY IN BLOCK 12 INCLUDES AUO OF $@          @"," "," "," "," "," "," "," "," "]
["P83","N","2023-09-01","THE EMPLOYEE OCCUPIES A POSITION SUBJECT TO THE PAY FREEZE FOR CERTAIN","SENIOR POLITICAL OFFICIALS. NOTWITHSTANDING OTHERWISE APPLICABLE PAY","STATUTES AND REGULATIONS, PAY MAY BE SET AND ADJUSTED ONLY IN ACCORDANCE","WITH APPLICABLE PROVISIONS OF THE PAY FREEZE STATUTE."," "," "," "," "," "]
["P84","N","2015-11-29","UNDER 5 U.S.C. 5550, YOU ARE ASSIGNED A LEVEL 1 REGULAR TOUR OF DUTY,   ","WHICH PROVIDES AN OVERTIME SUPPLEMENT EQUAL TO 25% OF BASIC PAY FOR     ","A REGULAR SCHEDULE OF 10 HOURS EACH REGULAR WORKDAY, INCLUDING 2        ","OVERTIME HOURS.                                                        ","                                                                       ","                                                                       ","                                                            "," "," "]
["P85","N","2015-11-29","UNDER 5 U.S.C. 5550, YOU ARE ASSIGNED A LEVEL 2 REGULAR TOUR OF DUTY,   ","WHICH PROVIDES AN OVERTIME SUPPLEMENT EQUAL TO 12.5% OF BASIC PAY FOR   ","A REGULAR SCHEDULE OF 9 HOURS EACH REGULAR WORKDAY, INCLUDING 1         ","OVERTIME HOUR.                                                         ","                                                                       ","                                                                       ","                                                            "," "," "]
["P86","N","2015-11-29","UNDER 5 U.S.C. 5550, YOU ARE ASSIGNED A BASIC REGULAR TOUR OF DUTY      ","WITH A REGULAR 8 HOUR WORKDAY WHICH PROVIDES NO OVERTIME SUPPLEMENT.    ","                                                                        ","                                                                       ","                                                                       ","                                                                       ","                                                            "," "," "]
["P88","N","2015-11-29","SALARY IN BLOCK 20 INCLUDES THE PROJECTED ANNUAL AMOUNT OF THE BORDER   ","PATROL OVERTIME SUPPLEMENT, SUBJECT TO THE BIWEEKLY PREMIUM PAY CAP,    ","IF APPLICABLE.                                                          ","                                                                       ","                                                                       ","                                                                       ","                                                            "," "," "]
["P89","N","2015-11-29","EMPLOYEE IS NO LONGER COVERED BY THE PROVISIONS OF 5 U.S.C. 5550.       ","                                                                        ","                                                                        ","                                                                       ","                                                                       ","                                                                       ","                                                            "," "," "]
["P90","N","1992-01-10","YOU ARE REQUIRED TO SUBMIT TO THE PERSONNEL OFFICE A COPY OF ANY","SUBSEQUENT NOTICE FROM OPM OF ANY CHANGE IN YOUR GROSS ANNUITY RATE."," "," "," "," "," "," "," "]
["P91","N","1994-04-03","WITHIN-GRADE INCREASE DENIED BECAUSE YOUR WORK IS NOT AT AN ACCEPTABLE","LEVEL OF COMPETENCE. YOUR SALARY DOES NOT CHANGE."," "," "," "," "," "," "," "]
["P92","Y","2007-01-07","SALARY INCLUDES A LOCALITY-BASED PAYMENT OF @      @% (IN BLOCK 20B)."," "," "," "," "," "," "," "," "]
["P93","N","2007-01-07","SPECIAL SALARY RATE EXCEEDS THE LOCALITY RATE OF PAY, EMPLOYEE","RECEIVES HIGHER SPECIAL RATE SUPPLEMENT (IN BLOCK 20B) INSTEAD OF","LOCALITY PAYMENT."," "," "," "," "," "," "]
["P98","Y","1994-10-30","SALARY IN BLOCK 12 INCLUDES AVAILABILITY PAY OF $@         @."," "," "," "," "," "," "," "," "]
["P99","Y","1994-10-30","SALARY IN BLOCK 20 INCLUDES AVAILABILITY PAY OF $@         @."," "," "," "," "," "," "," "," "]
["R01","N","1985-03-01","RESIGNED BECAUSE"," "," "," "," "," "," "," "," "]
["R02","N","1985-03-01","RESIGNED BECAUSE"," "," "," "," "," "," "," "," "]
["R03","N","1985-03-01","RESIGNED BECAUSE"," "," "," "," "," "," "," "," "]
["R04","N","1985-03-01","RESIGNED BECAUSE"," "," "," "," "," "," "," "," "]
["R05","N","1985-03-01","RESIGNED BECAUSE"," "," "," "," "," "," "," "," "]
["R06","N","1985-03-01","RESIGNED BECAUSE"," "," "," "," "," "," "," "," "]
["R07","N","1985-03-01","RESIGNED BECAUSE"," "," "," "," "," "," "," "," "]
["R08","N","1985-03-01","RESIGNED BECAUSE"," "," "," "," "," "," "," "," "]
["R09","N","1985-03-01","RESIGNED BECAUSE"," "," "," "," "," "," "," "," "]
["R10","N","1985-03-01","RESIGNED BECAUSE"," "," "," "," "," "," "," "," "]
["R11","N","1985-03-01","RESIGNED BECAUSE"," "," "," "," "," "," "," "," "]
["R12","N","1985-03-01","RESIGNED BECAUSE"," "," "," "," "," "," "," "," "]
["R13","N","1985-03-01","RESIGNED BECAUSE"," "," "," "," "," "," "," "," "]
["R14","N","1985-03-01","RESIGNED BECAUSE"," "," "," "," "," "," "," "," "]
["R15","N","1985-03-01","RESIGNED BECAUSE"," "," "," "," "," "," "," "," "]
["R16","N","1985-03-01","RESIGNED BECAUSE"," "," "," "," "," "," "," "," "]
["R17","N","1985-03-01","RESIGNED BECAUSE"," "," "," "," "," "," "," "," "]
["R18","N","1985-03-01","RESIGNED BECAUSE"," "," "," "," "," "," "," "," "]
["R19","N","1981-12-01","REASON FOR RESIGNATION:"," "," "," "," "," "," "," "," "]
["R20","N","1986-10-08","REASON FOR RETIREMENT: TO OBTAIN RETIREMENT BENEFITS"," "," "," "," "," "," "," "," "]
["R21","N","1981-12-01","REASON FOR RETIREMENT:"," "," "," "," "," "," "," "," "]
["R22","N","1986-10-08","ELECTED TO RECEIVE WORKERS' COMPENSATION IN LIEU OF A RETIREMENT ANNUITY"," "," "," "," "," "," "," "," "]
["R47","N","1981-06-01","RETAINED GRADE WILL NOT BE USED FOR PURPOSES OF REDUCTION IN FORCE."," "," "," "," "," "," "," "," "]
["R52","N","1981-12-01","REASON(S) FOR DECLINATION OF ASSIGNMENT:"," "," "," "," "," "," "," "," "]
["R53","N","1981-12-01","REASON(S) FOR DECLINATION OF RELOCATION:"," "," "," "," "," "," "," "," "]
["R55","N","1982-09-19","REFUSED JOB OFFER BECAUSE:"," "," "," "," "," "," "," "," "]
["RP1","N","2000-09-11","TIME OFF AWARD HOURS SHOWN IN BLOCK 20"," "," "," "," "," "," "," "," "]
["RP2","N","2000-09-11","SPOT CASH AWARD"," "," "," "," "," "," "," "," "]
["S20","N","1982-09-19","EMPLOYEE ABANDONED POSITION"," "," "," "," "," "," "," "," "]
["S25","N","1981-12-01","AGENCY FINDING:"," "," "," "," "," "," "," "," "]
["S28","N","1981-12-01","AGENCY FINDING: RESIGNED AFTER RECEIVING WRITTEN NOTICE ON","OF DECISION TO SEPARATE FOR"," "," "," "," "," "," "," "]
["S29","N","1981-12-01","AGENCY FINDING: RESIGNED AFTER RECEIVING WRITTEN NOTICE ON","OF DECISION TO DEMOTE FOR"," "," "," "," "," "," "," "]
["S30","N","1981-12-01","AGENCY FINDING: RESIGNED AFTER RECEIVING WRITTEN NOTICE ON","OF DECISION TO SUSPEND FOR"," "," "," "," "," "," "," "]
["S31","N","1982-06-28","AGENCY FINDING: RESIGNED AFTER RECEIVING WRITTEN NOTICE ON          OF","PROPOSAL TO SEPARATE FOR"," "," "," "," "," "," "," "]
["S32","N","1981-12-01","AGENCY FINDING: RESIGNED AFTER RECEIVING WRITTEN NOTICE ON          OF","PROPOSAL TO DEMOTE FOR"," "," "," "," "," "," "," "]
["S33","N","1981-12-01","AGENCY FINDING: RESIGNED AFTER RECEIVING WRITTEN NOTICE ON          OF","PROPOSAL TO SUSPEND FOR"," "," "," "," "," "," "," "]
["S34","N","1982-06-28","AGENCY FINDING: RETIRED AFTER RECEIVING WRITTEN NOTICE ON          OF","DECISION TO SEPARATE FOR"," "," "," "," "," "," "," "]
["S35","N","1981-12-01","AGENCY FINDING: RETIRED AFTER RECEIVING WRITTEN NOTICE ON          OF","DECISION TO DEMOTE FOR"," "," "," "," "," "," "," "]
["S36","N","1981-12-01","AGENCY FINDING: RETIRED AFTER RECEIVING WRITTEN NOTICE ON          OF","DECISION TO SUSPEND FOR"," "," "," "," "," "," "," "]
["S37","N","1981-12-01","AGENCY FINDING: RETIRED AFTER RECEIVING WRITTEN NOTICE ON          OF","PROPOSAL TO SEPARATE FOR"," "," "," "," "," "," "," "]
["S38","N","1981-12-01","AGENCY FINDING: RETIRED AFTER RECEIVING WRITTEN NOTICE ON          OF","PROPOSAL TO DEMOTE FOR"," "," "," "," "," "," "," "]
["S39","N","1981-12-01","AGENCY FINDING: RETIRED AFTER RECEIVING WRITTEN NOTICE ON          OF","PROPOSAL TO SUSPEND FOR"," "," "," "," "," "," "," "]
["S40","N","1981-12-01","AGENCY FINDING: TERMINATED AFTER RECEIVING WRITTEN NOTICE ON          OF","PROPOSAL TO SUSPEND FOR"," "," "," "," "," "," "," "]
["S41","N","1981-12-01","AGENCY FINDING: TERMINATED AFTER RECEIVING WRITTEN NOTICE ON          OF","PROPOSAL TO DEMOTE FOR"," "," "," "," "," "," "," "]
["S42","N","1982-09-19","AGENCY FINDING: TERMINATED AFTER RECEIVING WRITTEN NOTICE ON          OF","PROPOSAL TO SEPARATE FOR"," "," "," "," "," "," "," "]
["S43","N","1982-06-28","AGENCY FINDING: TERMINATED AFTER RECEIVING WRITTEN NOTICE ON          OF","DECISION TO SUSPEND FOR"," "," "," "," "," "," "," "]
["S44","N","1982-09-19","AGENCY FINDING: TERMINATED AFTER RECEIVING WRITTEN NOTICE ON          OF","DECISION TO DEMOTE FOR"," "," "," "," "," "," "," "]
["S45","N","1982-06-28","AGENCY FINDING: TERMINATED AFTER RECEIVING WRITTEN NOTICE ON          OF","DECISION TO SEPARATE FOR"," "," "," "," "," "," "," "]
["S46","N","1981-12-01","SEPARATED BY ORDER OF OFFICE OF PERSONNEL MANAGEMENT DATED          FOR","VIOLATION OF CS"," "," "," "," "," "," "," "]
["S47","N","1981-12-01","REASON(S) FOR REMOVAL:"," "," "," "," "," "," "," "," "]
["S48","N","1981-12-01","REASON(S) FOR TERMINATION:"," "," "," "," "," "," "," "," "]
["S49","N","1981-12-01","REASON FOR SUSPENSION:"," "," "," "," "," "," "," "," "]
["S50","N","1981-12-01","DISPLACEMENT NOTICE DATED:"," "," "," "," "," "," "," "," "]
["S51","N","1981-12-01","REDUCTION IN FORCE NOTICE DATED:"," "," "," "," "," "," "," "," "]
["S52","N","1986-07-06","REASON FOR TERMINATION:  PL 99-198 ELECTION OF COUNTY COMMITTEE MEMBERS","REQUIRES NEW ELECTION PROCEDURES FOR COUNTY COMMITTEE MEMBERS."," "," "," "," "," "," "," "]
["S54","N","1981-12-01","OFFERED JOBS OF"," "," "," "," "," "," "," "," "]
["S56","N","1981-12-01","NO REASON GIVEN BY EMPLOYEE FOR REFUSING JOB OFFER."," "," "," "," "," "," "," "," "]
["S57","N","1981-12-01","REFUSED EXTENSION OF APPOINTMENT."," "," "," "," "," "," "," "," "]
["S58","N","1981-12-01","NO OTHER WORK AVAILABLE."," "," "," "," "," "," "," "," "]
["S59","N","2023-10-02","WRITTEN WARNING IS A FIRST VIOLATION OF 5 USC 9202."]
["S60","N","2023-10-02","SUSPENSION IS FOR A SECOND VIOLATION OF 5 USC 9202."]
["S61","N","2023-10-02","SUSPENSION IS FOR A THIRD VIOLATION OF 5 USC 9202."]
["S62","N","2023-10-02","SUSPENSION IS FOR A FOURTH VIOLATION OF 5 USC 9202","AND THE CIVIL PENALTY IS $"]
["S63","N","2023-10-02","SUSPENSION IS FOR A FIFTH VIOLATION OF 5 USC 9202","AND THE CIVIL PENALTY IS $"]
["S64","N","2023-10-02","SUSPENSION IS FOR MORE THAN A FIFTH VIOLATION OF 5 USC 9202","AND THE CIVIL PENALTY IS $"]
["S65","N","1982-02-09","RESIGNED DURING INITIAL APPOINTMENT PROBATIONARY PERIOD."," "," "," "," "," "," "," "," "]
["S66","N","1982-02-09","RESIGNED DURING TRIAL PERIOD."," "," "," "," "," "," "," "," "]
["S68","N","1982-09-19","EMPLOYEE GAVE NO REASON FOR RESIGNATION."," "," "," "," "," "," "," "," "]
["S69","N","1981-12-01","EMPLOYEE GAVE NO REASON FOR RETIRING."," "," "," "," "," "," "," "," "]
["S73","N","1981-12-01","SEPARATED BY ORDER OF MERIT SYSTEMS PROTECTION BOARD DATED          FOR"," "," "," "," "," "," "," "," "]
["S74","N","1982-09-19","AGENCY FINDING: RESIGNED AFTER RECEIVING NOTICE OF PROPOSED POSITION","CHANGE AS RESULT OF FAILURE TO SATISFACTORILY COMPLETE PROBATIONARY","PERIOD FOR SUPERVISORY OR MANAGERIAL POSITION."," "," "," "," "," "," "]
["S75","N","1981-12-01","AGENCY FINDING: RESIGNED AFTER RECEIVING NOTICE OF DECISION ON POSITION","CHANGE AS A RESULT OF FAILURE TO SATISFACTORILY COMPLETE PROBATIONARY","PERIOD FOR SUPERVISORY OR MANAGERIAL POSITION."," "," "," "," "," "," "]
["S76","N","1981-12-01","AGENCY FINDING: RESIGNED AFTER RECEIVING NOTICE OF PROPOSED CONVERSION","FROM THE SENIOR EXECUTIVE TO A POSITION IN       SERVICE."," "," "," "," "," "," "," "]
["S77","N","1981-12-01","SUSPENSION TO BE IMPOSED ON"," "," "," "," "," "," "," "," "]
["S78","N","1982-10-19","EMPLOYEE IS ACCOMPANYING A US GOVERNMENT SPONSER OVERSEAS"," "," "," "," "," "," "," "," "]
["S80","N","1987-07-17","RESIGNED AFTER RECEIVING NOTICE THAT WITHIN-GRADE INCREASE WOULD BE DENI"," "," "," "," "," "," "," "," "]
["S81","N","1992-02-09","AGENCY FINDING: RETIRED AFTER RECEIVING WRITTEN NOTICE ON","OF DECISION TO REMOVE FROM THE SES FOR"," "," "," "," "," "," "," "]
["S82","N","1992-02-09","AGENCY FINDING: RESIGNED AFTER RECEIVING WRITTEN NOTICE ON   /  /   OF","PROPOSED PLACEMENT OUT OF THE SES FOR"," "," "," "," "," "," "," "]
["S83","N","1992-02-09","THERE IS NO ANNUITY REDUCTION BASED ON AGE PER 5 USC 8339(H)"," "," "," "," "," "," "," "," "]
["S84","N","1992-02-09","ELIGIBLE FOR AN ANNUITY SUPPLEMENT PER 5 USC 8421(A)(2)"," "," "," "," "," "," "," "," "]
["SI8","N","2009-10-01","IF REEMPLOYED WITH THE SMITHSONIAN INSTITUTION IN A TRUST OR FEDERAL POS","OR UNDER DIRECT OR PERS SVCS CONTRACT, WITHIN 5 YRS OF RETIREMENT, THE","GROSS AMT OF INCENTIVE PAYMENT MUST BE REPAID."," "," "," "," "," "," "]
["SI9","N","2009-10-01","VSIP PAID UNDER P.L. 108-72 DTD 8/15/03.  IF REEMPLOYED WITH FED","GOVT OR SMITHSONIAN INST, DIRECT OR PERS SVCS CONTRACT WITHIN 5","YRS OF RETIREMENT THE GROSS AMT OF INCENTIVE PAYMENT MUST BE REPAID."," "," "," "," "," "," "]
["SS0","N","1997-12-07","UNDER E.O. 11203, DATED MARCH 12, 1965, APPOINTMENT IS SUBJECT TO A TRIA","PERIOD PENDING CONVERSION TO THE COMPETITIVE SERVICE. EMPLOYEE MAY NOT B","CONVERTED TO THE COMPETITIVE SERVICE UNTIL HE/SHE COMPLETED AT LEAST THR","(3) YEARS OF FULL TIME CONTINUOUS SERVICE UNDER THIS APPOINTMENT AND","OTHERWISE MEET THE REQUIREMENTS FOR CONVERSION."," "," "," "," "]
["SS1","N","1997-12-07","EMPLOYMENT IS TERMINATED WHEN THE LIMITATION (OR EARLIER IF MORE THAN ON","IS REACHED.  THERE IS NO AUTHORITY TO PAY FOR SERVICE THEREFROM WITHOUT","APPROPRIATE PERSONNEL ACTION."," "," "," "," "," "," "]
["SS2","N","1997-12-07","PAYMENT OF TRAVEL AND TRANSPORTATION EXPENSES OF EMPLOYEE, IMMEDIATE FAM","AND HOUSEHOLD GOODS IS AUTHORIZED IN ACCORDANCE WITH THE ADMINISTRATIVE","EXPENSES ACTION OF 1946, AS AMENDED, AND REGULATIONS ISSUED THEREUNDER."," "," "," "," "," "," "]
["SS3","N","1997-12-07","SUBJECT TO PERIODIC REASSIGNMENT TO DUTY STATIONS WITHIN THE GEOGRAPHIC","JURISTICTIONS OF THE U.S. SECRET SERVICE."," "," "," "," "," "," "," "]
["SS4","N","1997-12-07","SUBJECT TO SATISFACTORY COMPLETION OF ALL REQUIRED TRAINING."," "," "," "," "," "," "," "," "]
["SS5","N","1997-12-07","SUBJECT TO SATISFACTORY COMPLETION OF FULL FIELD BACKGROUND INVESTIGATIO"," "," "," "," "," "," "," "," "]
["SSO","N","1997-12-07","UNDER E.O. 11203, DATED MARCH 12, 1965, APPOINTMENT IS SUBJECT TO A TRIA","PERIOD PENDING CONVERSION TO THE COMPETITIVE SERVICE. EMPLOYEE MAY NOT B","CONVERTED TO THE COMPETITIVE SERVICE UNTIL HE/SHE COMPLETED AT LEAST THR","(3) YEARS OF FULL TIME CONTINUOUS SERVICE UNDER THIS APPOINTMENT AND","OTHERWISE MEET THE REQUIREMENTS FOR CONVERSION."," "," "," "," "]
["ST1","N","1997-08-17","CODE 1 IN BLOCK 24 DENOTES CAREER STATUS GAINED UNDER CANAL ZONE","MERIT SYSTEM FOR EMPLOYEES IN STRI."," "," "," "," "," "," "," "]
["ST2","N","1997-08-17","CODE 2 IN BLOCK 24 DENOTES PERMANENT APPOINTMENT FOR EMPLOYEES","IN STRI."," "," "," "," "," "," "," "]
["ST3","N","1997-08-17","CODE 3 IN BLOCK 24 DENOTES TEMPORARY OR INDEFINITE APPOINTMENT FOR","EMPLOYEES IN STRI."," "," "," "," "," "," "," "]
["T05","N","1983-12-25","DATE FOR CONVERSION TO CAREER TENURE HAS BEEN ADJUSTED TO REFLECT CREDIT","FOR SERVICE ON INTERMITTENT WORK SCHEDULE.  ESTIMATED CONVERSION DATE","IS         ."," "," "," "," "," "," "]
["T06","N","1981-12-01","DATE FOR CONVERSION TO CAREER TENURE WAS ADJUSTED TO REFLECT EXCESS TIME","IN NONPAY STATUS.  NEW ESTIMATED CONVERSION DATE IS"," "," "," "," "," "," "," "]
["T07","N","2023-08-28","COMPLETED SERVICE REQUIREMENTS FOR CAREER TENURE AS FOLLOWS:","PERIOD 1: FROM (DATE)                TO (DATE),","PERIOD 2: FROM (DATE)                TO (DATE),","PERIOD 3: FROM (DATE)               TO (DATE)          ."," "," "," "," "," "]
["T08","N","1982-09-19","SERVICE COUNTING TOWARDS PERMANENT TENURE FROM            TO"," "," "," "," "," "," "," "," "]
["T09","Y","1981-12-01","SERVICE COUNTING TOWARDS PERMANENT TENURE FROM @        @."," "," "," "," "," "," "," "," "]
["T10","Y","1981-12-01","SERVICE COUNTING TOWARD CAREER TENURE FROM @        @."," "," "," "," "," "," "," "," "]
["T11","N","1981-12-01","COMPLETED ONE YEAR OF CURRENT CONTINUOUS SERVICE."," "," "," "," "," "," "," "," "]
["T29","N","1982-09-19","CHANGE IN TENURE GROUP:"," "," "," "," "," "," "," "," "]
["T30","N","1991-04-07","REASON FOR RETROACTIVE ACTION:"," "," "," "," "," "," "," "," "]
["T55","N","1981-12-01","TENURE AS USED FOR 5 USC 3502 IS NOT APPLICABLE TO THE SENIOR EXECUTIVE","SERVICE."," "," "," "," "," "," "," "]
["TF1","N","2003-01-12","THE ONLY CHANGE TO YOUR CURRENT POSITION IS THE AGENCY CODE.","CURRENT DUTIES AND RESPONSIBILITIES REMAIN UNCHANGED, THEREFORE, A NEW","POSITION DESCRIPTION WILL NOT BE PROVIDED AT THIS TIME."," "," "," "," "," "," "]
["TOP","N","2003-08-01","REORGANIZATION"," "," "," "," "," "," "," "," "]
["TR0","N","1996-09-03","UNDER EXECUTIVE ORDER 11203, DATED MARCH 12, 1965, APPOINTMENT IS SUBJEC","TO A TRAIL PERIOD PENDING CONVERSION TO THE COMPETITIVE SERVICE. EMPLOYE","MAY NOT BE CONVERTED TO THE COMPETITIVE SERVICE UNTIL HE/SHE HAS COMPLET","AT LEAST THREE YEARS OF FULL-TIME CONTINUOUS SERVICE UNDER THIS APPOINTM","AND OTHERWISE MEETS THE REQUIREMENTS FOR CONVERSION."," "," "," "," "]
["TR1","N","2001-07-01","AMOUNT IN BLOCK 20D IS TECHNICIAN PAY EQUAL TO 6% OF BASIC PAY PLUS     ","LOCALITY ADJUSTMENT.                                                    ","                                                                        ","                                                                       ","                                                                       ","                                                                       ","                                                            "," "," "]
["TR2","N","2000-01-01","REASON FOR TEMPORARY APPOINTMENT: RECRUITMENT IN ACCORDANCE WITH 5 CFR","213.3205 (E), TO MEET ANTICIPATED HIRING NEEDS.  EMPLOYEE INFORMED IN","ADVANCE OF THE REASONS FOR AND THE CONDITIONS OF APPOINTMENT UNDER","UNITED STATES CUSTOMS SERVICE (USCS) SCHEDULE B PROGRAM."," "," "," "," "," "]
["TR3","N","2002-08-01","APPOINTMENT IS NOT-TO-EXCEED 2 YEARS.  UPON SATISFACTORY COMPLETION OF 2","YEARS SERVICE UNDER THIS APPOINTMENT, YOU MAY BE NON-COMPETIVELY CONVERT","TO A CAREER-CONDITIONAL OR CAREER APPOINTMENT UNDER THE PROVISIONS OF","EXECUTIVE ORDER 13162.  YOU MUST MEET PROGRAM REQUIREMENTS TO","NON-COMPETITIVELY CONVERT TO A COMPETITIVE POSITION. IF YOUR PERFORMANCE","IS NOT SATISFACTORY, OR YOU FAIL TO SATISFACTORILY COMPLETE THE PROGRAM","EMPLOYMENT WILL BE TERMINATED."," "," "]
["TR4","N","2024-01-14","THE AMOUNT IN BLOCK 20B EQUALS THE LOCALITY ADJUSTMENT PLUS","TECHNICIAN PAY EQUAL TO 6% OF BASIC PAY PLUS THE LOCALITY","ADJUSTMENT.  TECHNICIAN PAY IS $@         @."]
["U01","N","2006-08-20","THIS ACTION REFLECTS A CAREER PROGRESSION PROMOTION."," "," "," "," "," "," "," "," "]
["U02","N","2006-08-20","SEPARATION THROUGH INVOLUNTARY WORKFORCE REDUCTION AUTHORIZED UNDER TSA'","HUB-SPOKE REALIGNMENT."," "," "," "," "," "," "," "]
["U03","N","2006-11-26","PASS PERFORMANCE SALARY INCREASE FOR ROLE MODEL OF EXCELLENCE."," "," "," "," "," "," "," "," "]
["U04","N","2006-11-26","PASS PERFORMANCE SALARY INCREASE FOR EXCEEDS STANDARDS"," "," "," "," "," "," "," "," "]
["U05","N","2006-11-26","ACTION APPROVED BY TSA AUTHORITY P.L. 107-71"," "," "," "," "," "," "," "," "]
["U06","N","2006-11-26","RETENTION INCENTIVE REFLECTS AN INCREASE APPROVED BY TSA OFFICIALS DATE","11/27/2006."," "," "," "," "," "," "," "]
["U07","N","2007-01-07","PAY ADJUSTMENT REFLECTS THE PASS PERFORMANCE INCREASE. BASE SALARY NOW","REFLECTS THE COMPARABILITY EQUIVALENT INCREASE AND THE PASS PERFORMANCE","INCREASE."," "," "," "," "," "," "]
["U08","N","2007-03-18","ACTION IS THE RESULT OF THE PHASE 2PT FEHB PILOT."," "," "," "," "," "," "," "," "]
["U09","N","2007-03-18","ACTION IS THE RESULT OF THE SPLIT SHIFT INCENTIVE."," "," "," "," "," "," "," "," "]
["U10","N","2007-03-18","ACTION IS THE RESULT OF THE FT TO PT INCENTIVE."," "," "," "," "," "," "," "," "]
["U11","N","2007-04-01","ELIGIBLE FOR RETURN RIGHTS AT THE COMPLETION OF THE FOREIGN TOUR OF DUTY","UNDER THE PROVISIONS OF TSA MANAGEMENT DIRECTIVE 1100.30-16."," "," "," "," "," "," "," "]
["U12","N","2007-04-01","TSA FORM 1142, FOREIGN DUTY SERVICE AGREEMENT, WAS SIGNED ON"," "," "," "," "," "," "," "," "]
["U13","N","2007-04-01","ELIGIBLE FOR PAY RETENTION UNDER THE PROVISIONS OF TSA MANAGEMENT DIRECT","1100.30-16, FOREIGN DUTY ASSIGNMENTS AND RETURN RIGHTS"," "," "," "," "," "," "," "]
["U14","N","2007-06-24","PAY INCREASE IS DUE TO ADJUSTMENT OF TSA'S PAY BANDS."," "," "," "," "," "," "," "," "]
["V01","N","2008-10-14","THE EMPLOYEE'S DUTIES REMAIN THE SAME. HOWEVER, THE EMPLOYEE'S POSITION","IS BEING CONVERTED FROM ONE PAY SYSTEM TO ANOTHER.  THE EMPLOYEE'S PAY","HAS BEEN SET ACCORDINGLY."," "," "," "," "," "," "]
["VGL","N","1998-03-29","VGL 5 USC 4703"," "," "," "," "," "," "," "," "]
["W01","N","2010-10-10","FEDERAL EMPLOYEES' HEALTH BENEFITS (FEHB):","YOU HAVE 60 DAYS FROM THE DATE OF HIRE TO ENROLL. SEND YOUR","COMPLETED SF-2809 TO","TO COMPARE PLANS AND GET MORE INFORMATION, VISIT","WWW.OPM.GOV/INSURE"," "," "," "," "]
["W02","N","2010-10-10","FEDERAL EMPLOYEES' GROUP LIFE INSURANCE (FEGLI):","YOU ARE AUTOMATICALLY ENROLLED IN BASIC COVERAGE. YOU HAVE 60","DAYS FROM THE DATE OF HIRE TO ELECT OPTIONAL COVERAGE. SEND","YOUR COMPLETED SF-2817 TO","TO GET MORE INFORMATION AND USE THE FEGLI CALCULATOR, VISIT","HTTP://WWW.OPM.GOV/INSURE/LIFE."," "," "," "]
["W03","N","2010-10-10","FLEXIBLE SPENDING ACCOUNT(FSA):","YOU HAVE 60 DAYS FROM THE DATE OF HIRE BUT NO LATER THAN OCT 1ST","TO ENROLL IN A HEALTH CARE OR DEPENDENT CARE FSA. IF HIRED","ON/AFTER OCT 1ST YOU WILL BE ELIGIBLE TO ENROLL DURING THE FSA","OPEN SEASON. TO GET MORE INFORMATION AND ENROLL ONLINE, VISIT","WWW.FSAFED.COM. ONLINE ENROLLMENT IS MANDATORY."," "," "," "]
["W04","N","2010-10-10","FEDERAL DENTAL AND VISION PROGRAM (FEDVIP):","YOU HAVE 60 DAYS FROM THE DATE OF HIRE TO ENROLL IN A","SUPPLEMENTAL DENTAL AND/OR VISION PLAN. TO GET MORE","INFORMATION AND ENROLL ONLINE, VISIT WWW.BENEFEDS.COM ONLINE","ENROLLMENT IS MANDATORY."," "," "," "," "]
["W05","N","2010-10-10","THRIFT SAVINGS PLAN (TSP):","YOU ARE ELIGIBLE TO CONTRIBUTE TO TSP. YOU ARE AUTOMATICALLY","ENROLLED AT THE RATE OF 3%. TO INCREASE OR DECREASE YOUR","CONTRIBUTION AMOUNT, COMPLETE A TSP-1 AND SEND IT TO","     .FERS EMPLOYEES ONLY: YOU WILL IMMEDIATELY RECEIVE AN AGENCY","AUTOMATIC CONTRIBUTION OF 1% OF YOUR PAY AND QUALIFY FOR UP TO 4%","MATCHING. TO GET INFORMATION, VISIT WWW.TSP.GOV/FORMS/TSPBK08.PDF"," "," "]
["W06","N","2010-10-10","FEDERAL LONG TERM CARE INSURANCE PROGRAM (FLTCIP)","YOU HAVE 60 DAYS FROM THE DATE OF HIRE TO APPLY FOR COVERAGE","USING THE ABBREVIATED UNDERWRITING APPLICATION. TO GET MORE","INFORMATION AND APPLY ONLINE, VISIT WWW.LTCFEDS.COM. YOU MAY","APPLY ONLINE OR DOWNLOAD AN APPLICATION."," "," "," "," "]
["W07","N","2010-10-10","CREDITABLE MILITARY SERVICE:","IF YOU HAVE HONORABLE, ACTIVE DUTY MILITARY SERVICE AND WANT TO","RECEIVE LEAVE AND RETIREMENT CREDIT, PLEASE CONTACT A BENEFITS","SPECIALIST AT:                             ."," "," "," "," "," "]
["W08","N","2010-10-10","YOU ARE NOW ELIGIBLE FOR HEALTH INSURANCE BUT YOU MUST PAY 100%","OF THE PREMIUM. YOU HAVE 60 CALENDAR DAYS FROM THE DATE OF THIS","NOTICE TO ENROLL. GET MORE INFORMATION FROM YOUR HUMAN","RESOURCES POC OR ONLINE AT HTTP://WWW.OPM.GOV/INSURE."," "," "," "," "," "]
["X36","N","1981-12-01","GRADE RETENTION ENTITLEMENT TERMINATED. NO FURTHER ENTITLEMENT TO GRADE","PAY RETENTION."," "," "," "," "," "," "," "]
["X37","Y","1982-09-19","EMPLOYEE IS ENTITLED TO RETAIN GRADE OF @   @ @   @ THROUGH @       @."," "," "," "," "," "," "," "," "]
["X38","N","1982-06-01","ON        EMPLOYEE WILL BE ENTITLED TO RETAIN GRADE OF         THROUGH","        PROVIDED THE PRECEDING PERIOD OF GRADE RETENTION IS NOT TERMINAT","EARLIER."," "," "," "," "," "," "]
["X39","N","1981-12-01","EMPLOYEE ELECTED TO TERMINATE GRADE RETENTION ENTITLEMENT."," "," "," "," "," "," "," "," "]
["X40","N","1981-12-01","EMPLOYEE IS ENTITLED TO PAY RETENTION."," "," "," "," "," "," "," "," "]
["X41","N","2007-01-07","EMPLOYEE IS NOW ENTITLED TO RETAINED RATE. SALARY IS EQUAL TO APPLICABLE","CAP ON RETAINED RATES - 150% OF MAXIMUM RATE OF GRADE TO WHICH ASSIGNED","OR LEVEL IV OF THE EXECUTIVE SCHEDULE."," "," "," "," "," "," "]
["X42","N","1981-12-01","PAY RETENTION ENTITLEMENT TERMINATED."," "," "," "," "," "," "," "," "]
["X43","Y","1981-12-01","EXPIRATION OF GRADE RETENTION PERIOD AS @   @ @   @."," "," "," "," "," "," "," "," "]
["X44","N","2007-01-07","EMPLOYEE IS ENTITLED TO GRADE RETENTION."," "," "," "," "," "," "," "," "]
["X45","N","1981-12-01","RETAINED GRADE WILL BE USED TO DETERMINE EMPLOYEE'S PAY, RETIREMENT, AND","INSURANCE BENEFITS, AND PROMOTION AND TRAINING ELIGIBILITY."," "," "," "," "," "," "," "]
["X46","Y","1982-09-19","ACTION GIVES EMPLOYEE WITHIN GRADE INCREASE/QUALITY INCREASE TO","STEP @   @ OF @   @ @   @, RETAINED GRADE."," "," "," "," "," "," "," "]
["X47","Y","1981-12-01","ACTION DENIES WITHIN GRADE INCREASE TO STEP @   @ OF EMPLOYEE'S RETAINED","GRADE."," "," "," "," "," "," "," "]
["X48","N","1981-12-01","DECLINED OFFER OF"," "," "," "," "," "," "," "," "]
["X49","N","2006-04-30","CHANGE TO LOWER GRADE, LEVEL OR BAND IS FOR PERSONAL CAUSE."," "," "," "," "," "," "," "," "]
["X50","N","1981-12-01","FAILED TO COMPLY WITH PRIORITY PLACEMENT PROGRAM REQUIREMENTS."," "," "," "," "," "," "," "," "]
["X61","N","1981-12-01","RETAINED GRADE WILL NOT BE USED FOR PURPOSE OF REDUCTION-IN-FORCE."," "," "," "," "," "," "," "," "]
["X62","N","1994-04-03","ACTION GRANTS WITHIN-GRADE INCREASE IN EMPLOYEE'S RETAINED GRADE OF","(PAY PLAN AND GRADE)."," "," "," "," "," "," "," "]
["X63","N","1994-04-03","ACTION DENIES WITHIN-GRADE INCREASE IN EMPLOYEE'S RETAINED GRADE OF","(PAY PLAN AND GRADE)."," "," "," "," "," "," "," "]
["X65","N","1993-10-08","GRADE RETENTION ENTITLEMENT IS TERMINATED."," "," "," "," "," "," "," "," "]
["X67","N","2007-01-07","EMPLOYEE RECEIVING RETAINED RATE IN EXCESS OF MAXIMUM ADJUSTED RATE OF","BASIC PAY FOR EMPLOYEES GRADE NOT ENTITLED TO LOCALITY PAYMENT OR SPECIA","RATE SUPPLEMENT."," "," "," "," "," "," "]
["X74","N","1992-01-12","CHANGE DATA ELEMENT IN BLOCK 29."," "," "," "," "," "," "," "," "]
["Y28","Y","1988-01-01","THIS ACTION IS STRICTLY TEMPORARY AND IS NOT TO EXCEED @        @. WHEN","YOUR SERVICES ARE NO LONGER NEEDED IN THIS TEMPORARY ASSIGNMENT, YOU WIL","BE REVERTED BACK TO YOUR LAST PERMANENT LEVEL (    -     TENURE GROUP","      ) WHERE YOU WILL BE GRANTED ALL RIGHTS AND PRIVLEGES AS IF YOU HAD","NOT BEEN TEMPORARILY CHANGED"," "," "," "," "]
["Y29","N","1988-07-03","CODE A IN BLOCK 28 INDICATES REEMPL. ANN-FERS"," "," "," "," "," "," "," "," "]
["Y30","N","1988-07-03","CODE B IN BLOCK 28 INDICATES FORMER ANN-FERS"," "," "," "," "," "," "," "," "]
["Y31","N","1988-07-03","CODE C IN BLOCK 28 INDICATES RETIRED OFF/REEMPL. ANN FERS"," "," "," "," "," "," "," "," "]
["Y32","N","1988-07-03","CODE D IN BLOCK 28 INDICATES RETIRED OFF/FORMER  ANN FERS"," "," "," "," "," "," "," "," "]
["Y33","N","1988-07-03","CODE E IN BLOCK 28 INDICATES RETIRED ENLISTED/REEMPL. ANN-FERS"," "," "," "," "," "," "," "," "]
["Y34","N","1988-07-03","CODE F IN BLOCK 28 INDICATES RETIRED ENLISTED/FORMER ANN-FERS"," "," "," "," "," "," "," "," "]
["Y40","N","1989-10-22",0," "," "," "," "," "," "," "," "]
["Y41","N","1989-10-22",0," "," "," "," "," "," "," "," "]
["Y42","N","1989-10-22",0," "," "," "," "," "," "," "," "]
["Y43","N","1989-10-22",0," "," "," "," "," "," "," "," "]
["Y44","N","1989-10-22",0," "," "," "," "," "," "," "," "]
["Y45","N","1989-10-22",0," "," "," "," "," "," "," "," "]
["Y46","N","1989-10-22",0," "," "," "," "," "," "," "," "]
["Y47","N","1989-10-22",0," "," "," "," "," "," "," "," "]
["Y48","N","1989-10-22",0," "," "," "," "," "," "," "," "]
["Y49","N","1989-10-22",0," "," "," "," "," "," "," "," "]
["Y50","N","1989-10-22",0," "," "," "," "," "," "," "," "]
["Y51","N","1989-10-22",0," "," "," "," "," "," "," "," "]
["Y52","N","1989-10-22",0," "," "," "," "," "," "," "," "]
["Y53","N","1989-10-22",0," "," "," "," "," "," "," "," "]
["Y54","N","1989-10-22",0," "," "," "," "," "," "," "," "]
["Y55","N","1989-10-22",0," "," "," "," "," "," "," "," "]
["Y56","N","1989-10-22",0," "," "," "," "," "," "," "," "]
["Y57","N","1989-10-22",0," "," "," "," "," "," "," "," "]
["Y58","N","1989-10-22",0," "," "," "," "," "," "," "," "]
["Y59","N","1989-10-22",0," "," "," "," "," "," "," "," "]
["Y60","N","1989-10-22",0," "," "," "," "," "," "," "," "]
["Y61","N","1989-10-22",0," "," "," "," "," "," "," "," "]
["Y62","N","1989-10-22",0," "," "," "," "," "," "," "," "]
["Y63","N","1989-10-22",0," "," "," "," "," "," "," "," "]
["Y64","N","1989-10-22",0," "," "," "," "," "," "," "," "]
["Y65","N","1989-10-22",0," "," "," "," "," "," "," "," "]
["Y66","N","1989-10-22",0," "," "," "," "," "," "," "," "]
["Y67","N","1989-10-22",0," "," "," "," "," "," "," "," "]
["Y68","N","1989-10-22",0," "," "," "," "," "," "," "," "]
["Y69","N","1989-10-22",0," "," "," "," "," "," "," "," "]
["Y70","N","1989-10-22",0," "," "," "," "," "," "," "," "]
["Y71","N","1989-10-22",0," "," "," "," "," "," "," "," "]
["Y72","N","1989-10-22",0," "," "," "," "," "," "," "," "]
["Y73","N","1989-10-22",0," "," "," "," "," "," "," "," "]
["Y74","N","1989-10-22",0," "," "," "," "," "," "," "," "]
["Y75","N","1989-10-22",0," "," "," "," "," "," "," "," "]
["Y76","N","1989-10-22",0," "," "," "," "," "," "," "," "]
["Y77","N","1989-10-22",0," "," "," "," "," "," "," "," "]
["Y78","N","1989-10-22",0," "," "," "," "," "," "," "," "]
["Y79","N","1989-10-22",0," "," "," "," "," "," "," "," "]
["Y80","N","1989-10-22",0," "," "," "," "," "," "," "," "]
["Y81","N","1989-10-22",0," "," "," "," "," "," "," "," "]
["Y82","N","1989-10-22",0," "," "," "," "," "," "," "," "]
["Y83","N","1989-10-22",0," "," "," "," "," "," "," "," "]
["Y85","N","1989-10-22",0," "," "," "," "," "," "," "," "]
["Y86","N","1989-10-22",0," "," "," "," "," "," "," "," "]
["Y87","N","1989-10-22",0," "," "," "," "," "," "," "," "]
["Y88","N","1989-10-22",0," "," "," "," "," "," "," "," "]
["Y89","N","1989-10-22",0," "," "," "," "," "," "," "," "]
["Y90","N","1989-10-22",0," "," "," "," "," "," "," "," "]
["Y91","N","1989-10-22",0," "," "," "," "," "," "," "," "]
["Y92","N","1989-10-22",0," "," "," "," "," "," "," "," "]
["Y93","N","1980-01-01",0," "," "," "," "," "," "," "," "]
["Y94","N","1989-10-22",0," "," "," "," "," "," "," "," "]
["Y95","N","1989-10-22",0," "," "," "," "," "," "," "," "]
["Y98","N","1997-01-01",0," "," "," "," "," "," "," "," "]
["Y99","N","1989-07-16","COOPERATIVE EDUCATION PROGRAM PARTICIPANT COVERED BY SPECIAL SALARY RATE","PER AN OPM LETTER DATED 07/14/89."," "," "," "," "," "," "," "]
["YA1","N","2000-05-02","APPOINTMENT IS NOT TO EXCEED 3 YEARS. UPON SATISFACTORY COMPLETION OF 3","YEARS OF SERVICE UNDER THIS APPOINTMENT, YOU MAY BE NON-COMPETITIVELY","CONVERTED TO A CAREER-CONDITIONAL APPOINTMENT UNDER THE","PROVISIONS OF EXECUTIVE ORDER 13162. YOU MUST MEET PROGRAM REQUIREMENTS","TO NON-COMPETITIVELY CONVERT TO A COMPETITIVE POSITION. IF YOUR","PERFORMANCE IS NOT SATISFACTORY, OR IF YOU FAIL TO SATISFACTORILY","COMPLETE THIS PROGRAM, EMPLOYMENT WILL BE TERMINATED."," "," "]
["YT1","N","2021-09-26","APPOINTMENTS IN THE DHS CYBERSECURITY SERVICE DO NOT CONFER ELIGIBILITY","TO BE NONCOMPETITIVELY CONVERTED TO A TERM, CAREER OR CAREER-","CONDITIONAL APPOINTMENT IN THE COMPETITIVE SERVICE."]
["YT2","N","2021-09-26","DHS-CS APPOINTMENT IS SUBJECT TO COMPLETION OF ","THREE-YEAR INITIAL PROBATIONARY PERIOD BEGINNING:  "]
["YT3","N","2021-11-15","DHS-CS initial probationary period completed"]
["YT4","N","2021-09-26","SALARY INCLUDES A LOCAL TALENT MARKET SUPPLEMENT  ","PAYMENT %, WHICH IS CONSIDERED PART OF SALARY AND SUBJECT ","TO THE AGGREGATE COMPENSATION LIMIT."]
["YT5","N","2021-11-15","The minimum wage and overtime pay provisions of the Fair Labor Standards","Act (FLSA) do not apply to employees in the DHS Cybersecurity Service."]
["YT6","N","2021-11-15","Reduction in salary is due to a change in the local talent market","supplement and is not a reduction in pay for the purposes of","5 U.S.C. 7512 and 5 CFR part 752."]
["YT7","N","2021-11-15","Salary increase is the result of a recognition adjustment and is not a","promotion for any purpose under Title 5 U.S.C. or 5 CFR."]
["YT8","N","2021-11-15","Acceptance of a recognition payment constitutes agreement for Federal","Government use of any idea, method, device, or similar that is the basis","of the payment."]
["YT9","N","2021-11-15","Recognition payments are subject to and may be limited by the aggregate","compensation limit and are not considered salary or basic pay for any","purpose under 5 U.S.C. or 5 CFR."]
["YTA","N","2021-11-15","Student Loan Repayment is excluded from the aggregate compensation limit","and is not considered salary or basic pay for any purpose under 5 U.S.C.","or 5 CFR."]
["Z10","N","1991-03-10","SUBJECT TO SATISFACTORY INVESTIGATION."," "," "," "," "," "," "," "," "]
["Z11","N","2010-04-25","RETENTION IN THIS POSITION IS CONTINGENT UPON THE SUCCESSFUL COMPLETION","AND FAVORABLE ADJUDICATION OF A PERSONNEL SECURITY INVESTIGATION."," "," "," "," "," "," "," "]
["Z12","N","2010-04-25","SECURITY REQUIREMENTS MET IN CONNECTION WITH PREVIOUS EMPLOYMENT."," "," "," "," "," "," "," "," "]
["Z14","N","1988-01-03","MUST BE ABLE TO HOLD TOP SECRET CLEARANCE."," "," "," "," "," "," "," "," "]
["Z21","N","1999-01-01","INITIAL APPOINTMENT UNDER SEC 7(A)(2) OF THE PEACE CORPS ACT,PL 87-293 A","AMENDED,BEGAN ON         ."," "," "," "," "," "," "," "]
["Z23","N","1999-01-01","EXTENSION BEYOND THE FIVE YEAR LIMIT APPROVED BY THE PEACE CORPS DIRECTO","ON          ."," "," "," "," "," "," "," "]
["Z26","N","1999-01-01","EXCEPTED APPOINTED NTE          OR SUBJECT TO THE NEEDS OF PEACE CORPS."," "," "," "," "," "," "," "," "]
["Z27","N","1999-01-01","PEACE CORPS ACT,PL 87-239 AS AMMENDED, PROVIDES THAT THIS EMPLOYMENT DOE","NOT AFFECT ANNUITIES OR RETIRED STATUS"," "," "," "," "," "," "," "]
["Z28","N","1999-01-01","SERVES AS SUB-CASHIER DURING TENURE AT THIS DUTY STATION."," "," "," "," "," "," "," "," "]
["Z29","N","1999-01-01","ACCESS TO CLASSIFIED INFORMATION IS NOT PERMITTED UNTIL A SECURITY","CLEARENCE IS GRANTED."," "," "," "," "," "," "," "]
["Z33","N","1991-02-10","ACTION REFLECTS THE ESTABLISHMENT UNDER SECTION 104 OF FEPCA OF 1990","(P.L. 101-509) OF A SEPARATE PAY SYSTEM FOR ADMINISTRATIVE LAW JUDGE","POSITIONS FORMERLY AT GS-15, 16, 17, AND 18."," "," "," "," "," "," "]
["Z34","N","1991-02-10","ACTION REFLECTS THE ESTABLISHMENT UNDER SECTION 104 OF THE FEPCA OF 1990","(P.L. 101-509) OF A SEPARATE PAY SYSTEM FOR AGENCY BOARD OF CONTRACT","APPEALS POSITIONS FORMERLY AT GS-16, 17, AND 18."," "," "," "," "," "," "]
["Z36","N","1999-01-01","ELIGIBLE FOR PAYMENT OF TRAVEL EXPENSES AND PER DIEM IN LIEU OF SUBSISTE","WHEN AWAY FROM HOME OR REGULAR PLACE OF BUSINESS"," "," "," "," "," "," "," "]
["Z37","N","1999-01-01","EXCEPTION TO THE MERIT PROMOTION PLAN."," "," "," "," "," "," "," "," "]
["Z38","N","1999-01-01","FORMER PEACE CORPS VOLUNTEER IN                FROM"," "," "," "," "," "," "," "," "]
["Z39","N","1999-01-01","RESIDENT HIRE.  NO TRAVEL INVOLVED."," "," "," "," "," "," "," "," "]
["Z40","Y","1988-01-03","WGI BEGINS/BEGAN: @        @"," "," "," "," "," "," "," "," "]
["Z41","Y","1988-01-03","LEAVE CATEGORY: @ @"," "," "," "," "," "," "," "," "]
["Z42","N","1988-01-03","APPOINTMENT ABOVE MINIMUM RATE BASED ON SUPERIOR QUALIFICATIONS."," "," "," "," "," "," "," "," "]
["Z43","N","1999-01-01","THIS IS NOT A CAREER LADDER POSITION.                                  ."," "," "," "," "," "," "," "," "]
["Z44","N","1999-01-01","COMPLETION OF A LIMITED APPOINTMENT DOES NOT CONSTITUTE A BASIS FOR","ENTITLEMENT TO SEVERANCE PAY."," "," "," "," "," "," "," "]
["Z45","N","2010-04-25","LEAVE CATEGORY: ___ HOURS"," "," "," "," "," "," "," "," "]
["Z46","N","2010-04-25","LEAVE CATEGORY: 1 HOUR FOR EVERY 20 HOURS WORKED & 4 HOURS FULL TIME","SCHEDULE"," "," "," "," "," "," "," "]
["Z47","N","1988-01-03","CAREER PROMOTION."," "," "," "," "," "," "," "," "]
["Z48","N","2010-04-25","NAME WAS FORMERLY AT:"," "," "," "," "," "," "," "," "]
["Z49","N","2010-04-25","ANNUAL LEAVE CEILING 360 HOURS."," "," "," "," "," "," "," "," "]
["Z52","N","1988-01-03","QUALIFIED FOR THIS POSITION ONLY UNDER AN APPROVED TRAINING AGREEMENT.","NOT EIGIBLE FOR OTHER POSITIONS IN THIS SERIES UNTIL EMPLOYEE","SATIFACTORILY COMPLETES PRESCRIBED TRAINING."," "," "," "," "," "," "]
["Z53","N","1988-01-03","SATISFACTORILY COMPLETED TRAINING PRESCRIBED UNDER AN APPROVED TRAINING","AGREEMENT. MEETS BASIC QUALIFICATIONS FOR OTHER POSITONS IN THIS SERIES."," "," "," "," "," "," "," "]
["Z54","N","1988-01-03","THIS DETAIL MAY NOT EXCEED 120 DAYS FOLLOWING THE COMPETITIVE SELECTION","PROCEDURES  SPECIFIED IN GAO ORDER 2335.1."," "," "," "," "," "," "," "]
["Z55","N","1988-01-03","SALARY PAID ONLY FOR TIME WORKED AND WHILE IN AN AUTHORIZED TRAVEL STATU"," "," "," "," "," "," "," "," "]
["Z56","N","1988-01-03","WGI DUE:"," "," "," "," "," "," "," "," "]
["Z57","N","1988-01-03","SENATE PUBLIC FINANCIAL DISCLOSURE REPORT WAIVED--EMPLOYMENT LIMITED TO","LESS THAN 60 WORKDAYS THIS CALENDAR YEAR."," "," "," "," "," "," "," "]
["Z60","Y","2015-04-05","APPOINTMENT IS SUBJECT TO COMPLETION OF A ONE YEAR TRIAL PERIOD FOR A   ","PREFERENCE ELIGIBLE BEGINNING  @                            @ .         ","                                                                        ","                                                                       ","                                                                       ","                                                                       ","                                                            "," "," "]
["Z70","N","2010-04-25","MAY WORK FULL TIME ANY PERIOD SCHOOL IS CLOSED; OTHERWISE, EMPLOYMENT","MAY NOT EXCEED 32 HOURS IN ANY CALENDAR WEEK.  EMPLOYEE MAY NOT WORK MOR","THAN 32 HOURS PER WEEK WHEN SCHOOL IS IN SESSION, EXCEPT THAT ON ANY DAY","SCHOOL IS CLOSED; EMPLOYEE MAY WORK 8 HOURS THAT DAY IN ADDITION TO ALL","OTHER REGULARLY SCHEDULED TIME."," "," "," "," "]
["Z71","N","1999-01-01","MERITORIOUS INCREASE IS BASED ON EMPLOYEE'S SUSTANINED HIGH QUALITY","PERFORMANCE."," "," "," "," "," "," "," "]
["Z72","N","1999-01-01","INCREASE IS BASED ON EMPLOYEE'S LANGUAGE PROFICIENCY IN         ."," "," "," "," "," "," "," "," "]
["Z73","N","1999-01-01","GRADUAL ACCRETION OF DUTIES DUE TO POSITION REVIEW."," "," "," "," "," "," "," "," "]
["Z74","N","1999-01-01","EMPLOYEE IS PARTICIPATING IN THE STUDENT AIDE PROGRAM. CONTINUED","EMPLOYMENT UNDER THIS APPOINTMENT IS DEPENDENT UPON MAINTAINING AN","ACCEPTABLE SCHOOL STANDING."," "," "," "," "," "," "]
["Z75","N","1999-01-01","EMPLOYEE MAY NOT EXCEED 40 HOURS IN ANY CALENDAR WEEK."," "," "," "," "," "," "," "," "]
["Z76","N","1999-01-01","SUNDAY THROUGH THURSDAY.  SUNDAY DIFFERENTIAL AUTHORIZED."," "," "," "," "," "," "," "," "]
["Z77","N","1999-01-01","EMPLOYEE MUST NOT WORK MORE THAN 130 DAYS IN A SERVICE YEAR. SERVICE YEA","BEGAN          ."," "," "," "," "," "," "," "]
["Z78","N","1999-01-01","EMPLOYEE IS A RETIRED CIVIL SERVICE ANNUITANT FROM            .EFFECTIVE","DATE OF RETIREMENT WAS          .DUE TO EMPLOYMENT UNDER SECTION 13(A) O","THE PEACE CORPS ACT,PL 87-293 AS AMMENDED,THIS EMPLOYMENT DOES NOT AFFEC","ANNUITIES OR RETIRED STATUS."," "," "," "," "," "]
["Z79","N","1999-01-01","THIS IS A CONFIDENTIAL POLICY MAKING POSITION SERVING AT THE PLEASURE OF","THE PEACE CORPS DIRECTOR."," "," "," "," "," "," "," "]
["Z80","N","1999-01-01","THIS IS A NON-COMPETITIVE APPOINTMENT SERVING AT THE PLEASURE OF THE PEA","CORPS DIRECTOR."," "," "," "," "," "," "," "]
["Z81","N","2013-02-24","APPOINTMENT IS SUBJECT TO SATISFACTORY COMPLETION OF A ___________TRIAL","PERIOD COMMENCING:"," "," "," "," "," "," "," "]
["Z82","N","1999-01-01","ANNUAL/SICK LEAVE,HEALTH BENEFITS, AND RETIREMENT TO BE TRANSFERRED."," "," "," "," "," "," "," "," "]
["Z83","N","1999-01-01","SF-8,SF-2810,SF-2821,PC-1800 ISSUED."," "," "," "," "," "," "," "," "]
["Z84","N","1999-01-01","CHANGE FEGLI DUE TO ELECTION WITHIN 31 DAYS OF EFFECTIVE DATE OF","APPOINTMENT."," "," "," "," "," "," "," "]
["Z85","N","1999-01-01","FROM LWOP NTE:"," "," "," "," "," "," "," "," "]
["Z86","N","1999-01-01","WAITING PERIOD FOR WRI BEGAN:"," "," "," "," "," "," "," "," "]
["Z87","N","1999-01-01","STATEMENT OF FINANCIAL INTEREST REQUIRED"," "," "," "," "," "," "," "," "]
["Z88","N","1999-01-01","TIMEKEEPER, PLEASE MAKE RETROACTIVE ADJUSTMENT TO LEAVE ACCURAL TO REFLE","LEAVE CATAGORY            FROM           ."," "," "," "," "," "," "," "]
["Z89","N","2010-04-25","SERVES AT THE DISCRETION OF THE PEACE CORPS DIRECTOR."," "," "," "," "," "," "," "," "]
["Z90","N","2010-04-25","LEAVE RETIREMENT, LIFE INSURANCE, HEALTH BENEFITS, AND TSP TO BE","TRANSFERRED."," "," "," "," "," "," "," "]
["Z91","N","1988-01-03","THIS APPOINTMENT IS INTENDED TO CONTINUE FOR TWO YEARS.  UPON SATISFACTO","COMPLETION OF PROGRAM, YOU WILL BE NON-COMPETITIVETLY CONVERTED TO","EXCEPTED-CONDITIONAL OR EXCEPTED APPOINTMENT.  IF PERFORMANCE IS NOT","SATISFACTORY OR IF YOU FAIL TO SATISFACTORILY COMPLETE PROGRAM,","EMPLOYMENT WILL BE TERMINATED."," "," "," "," "]
["Z92","N","1988-01-03","APPOINTMENT IS NTE TWO YEARS.  UPON SATISFACTORY COMPLETION OF INTERNSHI","YOU MAY BE NONCOMPETITIVELY CONVERTED TO EXCEPTED OR EXCEPTED-CONDITIONA","APPOINTMENT. IF YOUR PERFORMANCE IS NOT","SATISFACTORY OR IF YOU FAIL TO SATISFACTORILY COMPLETE INTERSHIP,","EMPLOYMENT WILL BE TERMINATED."," "," "," "," "]
["Z93","N","1988-01-01","THIS APPOINTMENT IS INTENDED TO CONTINUE THROUGH THE COMPLETION OF THE","REQUIREMENTS FOR GRADUATION FROM THE DEGREE PROGRAM THAT QUALIFIES YOU","FOR THE APPOINTMENT. WITHIN 120 DAYS OF SATISFACTORY COMPLETION OF THE","DEGREE PROGRAM.  THIS AGENCY MAY NON-COMPETITIVELY CONVERT YOU TO EXCEPT","OR EXCEPTED-CONDITIONAL APPOINTMENT. IF YOUR PERFORMANCE IS NOT","SATISFACTORY OR IF YOU YOU FAIL TO SATISFACTORILY COMPLETE THE PROGRAM,","EMPLOYMENT WILL BE TERMINATED."," "," "]
["Z94","N","1988-01-01","SF-85 NOT SUBMITTED--EMPLOYMENT NTE 30 WORKDAYS IN A SERVICE YEAR."," "," "," "," "," "," "," "," "]
["Z95","N","1988-01-03","EQUIVALENT TO GS-   STEP   ."," "," "," "," "," "," "," "," "]
["Z96","N","2005-09-01","THIS APPOINTMENT IS INTENDED TO CONTINUE FOR 2 YEARS, UNLESS EXTENDED UP","TO 1 ADDITIONAL YEAR.  UPON SATISFACTORY COMPLETION OF THE INTERNSHIP, Y","MAY BE NONCOMPETITIVELY CONVERTED TO A CAREER OR CAREER-CONDITIONAL APPT","IF YOU FAIL TO SATISFACTORILY COMPLETE THE INTERNSHIP, YOUR EMPLOYMENT W","BE TERMINATED."," "," "," "," "]
["Z97","N","1988-01-03","YOU HAVE REEMPLOYMENT RIGHTS FOR TWO YEARS IN GAO GRANTED UNDER A LETTER","OF AUTHORITY BY THE COMPTROLLER GENERAL DATED         AND UNDER GAO ORDE","2351.1."," "," "," "," "," "," "]
["Z98","N","1988-01-03","SALARY IS $        PH, NTE $         PER DAY, OR $           BIWEEKLY."," "," "," "," "," "," "," "," "]
["Z99","N","1988-01-03","INTERMITTENT EMPLOYMENT TOTALED     DAYS IN PAY STATUS FROM","TO          ."," "," "," "," "," "," "," "]
["ZA1","N","1988-01-03","SPECIAL RATE UNDER GAO ORDER 2531.2."," "," "," "," "," "," "," "," "]
["ZA2","N","1988-01-03","PAY RATE AUTHORIZED UNDER GAO ORDER 2531.2--SUPERVISES PREVAILING RATE","EMPLOYEES PAID $           PER ANNUM."," "," "," "," "," "," "," "]
["ZA3","Y","1988-01-03","SERVICE COUNTING TOWARDS EXCEPTED TENURE FROM @        @ TO        ."," "," "," "," "," "," "," "," "]
["ZA4","Y","1988-01-03","SERVICE COUNTING TOWARDS EXCEPTED TENURE FROM @         @."," "," ","SERVICE COUNTING TOWARDS EXCEPTED TENURE FROM          ."," "," "," "," "," "]
["ZA5","N","1988-01-03","SF-52#:                    ."," "," "," "," "," "," "," "," "]
["ZA6","N","1988-01-03","THIS IS A COMPTROLLER GENERAL'S CAREER APPIONTMENT AND THE EMPLOYEE IS N","ELIGIBLE FOR NONCOMPETITIVE APPOINTMENT TO AN EXECUTIVE BRANCH CAREER","RESERVE POSITION."," "," "," "," "," "," "]
["ZA8","N","1988-01-03","SELECTED FROM EXECUTIVE CANDIDATE DEVELOPMENT POOL."," "," "," "," "," "," "," "," "]
["ZB1","N","1988-01-03","HIGHEST PREVIOUS RATE RULE WILL BE APPLIED IN SETTING SALARY UPON","SUBSEQUENT PROMOTIONS."," "," "," "," "," "," "," "]
["ZB2","N","1988-01-03","TERM PROMOTION."," "," "," "," "," "," "," "," "]
["ZB3","N","1988-01-03","SATISFACTORILY COMPLETED UPWARD MOBILITY PROGRAM."," "," "," "," "," "," "," "," "]
["ZB5","N","1988-01-03","DATE FOR CONVERSION TO EXCEPTED TENURE HAS BEEN ADJUSTED TO REFLECT","EXCESS TIME IN NONPAY STATUS.  NEW ESTIMATED CONVERSION DATE IS"," "," "," "," "," "," "," "]
["ZB6","N","1988-01-03","COMPLETED SERVICE REQUIREMENT FOR EXCEPTED TENURE FROM","TO"," "," "," "," "," "," "," "]
["ZB7","N","1988-01-03","REMOVAL BY ORDER OF THE COMPTROLLER GENERAL DATED           FOR","VIOLATION OF"," "," "," "," "," "," "," "]
["ZB8","N","1988-01-03","REMOVAL BY ORDER OF GAO PERSONNEL APPEALS BOARD DATED","FOR"," "," "," "," "," "," "," "]
["ZC1","N","1991-02-24","CASH-IN-A-FLASH AWARD"," "," "," "," "," "," "," "," "]
["ZC7","N","1988-01-03","DETAILED TO HIGHER GRADED POSITION.DUTIES EQUIVALENT TO          ."," "," "," "," "," "," "," "," "]
["ZC8","N","1988-01-03","THIS IS A REIMBURSABLE DETAIL: EMPLOYEE TO BE PAID BY"," "," "," "," "," "," "," "," "]
["ZF1","N","1988-01-03","EMPLOYEE MUST MEET UPWARD MOBILITY PROGRAM REQUIREMENTS TO CONVERT","TO THE TARGET POSITION. IF PERFORMANCE IS NOT SATISFACTORY OR IF PROGRAM","REQUIREMENTS ARE NOT MET, EMPLOYEE WILL BE REMOVED FROM THE PROGRAM."," "," "," "," "," "," "]
["ZF2","N","1988-01-03","THE TARGET POSITION IS                              ."," "," "," "," "," "," "," "," "]
["ZF3","N","1988-01-03","EMPLOYEE HAS NOT MET THE PROVISIONS OF 31 USC 732(G) FOR","ACQUIRING COMPETITIVE STATUS FOR APPOINTMENT TO THE COMPETITIVE","SERVICE."," "," "," "," "," "," "]
["ZF4","N","1988-01-03","THIS APPOINTMENT IS MADE THROUGH THE PRESIDENT'S COMMISSION ON","EXECUTIVE EXCHANGE."," "," "," "," "," "," "," "]
["ZF5","N","1988-01-03","NO PERMANENT OFFER OF EMPLOYMENT CAN BE MADE DURING THE EXCHANGE YEAR","OR UPON COMPLETION OF THE ASSIGNMENT. THIS RESTRICTION REMAINS IN","EFFECT FOR 36 MONTHS AFTER THE APPOINTEE LEAVES THE FEDERAL GOVERNMENT."," "," "," "," "," "," "]
["ZF6","N","1988-01-03","ALL INFORMATION SUBJECT TO VERIFICATION UPON RECEIPT OF THE MERGED","RECORDS PERSONNEL FOLDER."," "," "," "," "," "," "," "]
["ZF7","N","1988-01-03","INITIAL PROBATIONARY PERIOD WAIVED."," "," "," "," "," "," "," "," "]
["ZF8","N","1988-01-03","PROBATIONARY PERIOD FOR SUPERVISORY OR MANAGERIAL POSITION WAIVED."," "," "," "," "," "," "," "," "]
["ZF9","N","1988-01-03","UNDER THE PROVISIONS OF 31 USC 732 (G) AN EMPLOYEE ACQUIRES COMPETITIVE","STATUS FOR APPOINTMENT TO THE COMPETITIVE SERVICE BASED ON ONE YEAR OF","CONTINUOUS SERVICE UNDER A NONTEMPORARY APPOINTMENT."," "," "," "," "," "," "]
["ZG1","N","1988-01-03","COMPLETED SERVICE REQUIREMENTS FOR CAREER TENURE FROM","TO            IN THE COMPETITIVE SERVICE."," "," "," "," "," "," "," "]
["ZG2","N","1988-01-03","ACTION CANCELLED IN ACCORDANCE WITH DIRECTOR OF PERSONNEL LETTER OR","INSTRUCTIONS DATED           . THIS SF-50 AND THE SF-50 BEING","CANCELLED MUST BE RETAINED PERMANENTLY IN THE EMPLOYEE'S MERGED","RECORDS PERSONNEL FOLDER."," "," "," "," "," "]
["ZG3","N","1988-01-03","OVERSEAS ASSIGNMENT WILL BE FOR TWO YEARS. BY MUTUAL AGREEMENT BETWEEN","THE OVERSEAS MANAGER AND THE STAFF MEMBER, ALL ASSIGNMENTS MAY BE","EXTENDED FOR UP TO TWO ADDITIONAL YEARS AT THE SAME GEOGRAPHIC LOCATION."," "," "," "," "," "," "]
["ZG4","N","1988-01-03","EMPLOYMENT IS NTE 120 DAYS FOLLOWING COMPLETION OF REQUIREMENTS FOR","GRADUATION FROM THE DEGREE PROGRAM WHICH QUALIFIES YOU FOR THIS","APPOINTMENT, AND MUST NOT EXCEED 1040 HOURS IN A SERVICE YEAR.","IF YOUR PERFORMANCE IS NOT SATISFACTORY OR IF YOU FAIL TO COMPLETE","THE PROGRAM, EMPLOYMENT WILL BE TERMINATED.","                                                            ."," "," "," "]
["ZG5","N","1988-01-03","EMPLOYEE IS NO LONGER ENTITLED TO PER DIEM ALLOWANCE FOR TRAVEL","BETWEEN HOME AND DUTY STATION FOR THE REMAINDER OF THIS SERVICE","YEAR."," "," "," "," "," "," "]
["ZG6","N","1999-01-01","SUBJECT TO COMPLETION OF A FAVORABLE BACKGROUND INVESTIGATION."," "," "," "," "," "," "," "," "]
["ZG7","N","1988-01-03","THIS APPOINTMENT CANNOT BE RENEWED OR EXTENDED. UPON SATISFACTORY","PERFORMANCE YOU MAY BE NONCOMPETITIVELY CONVERTED TO EXCEPTED","OR EXCEPTED-CONDITIONAL APPOINTMENT IN ACCORDANCE WITH PROCEDURES","OUTLINED IN GAO ORDER 2213.1(Y), OUTSTANDING SCHOLAR."," "," "," "," "," "]
["ZG8","N","1988-01-03","COMPLETED SERVICE REQUIREMENTS FOR CAREER TENURE FROM            TO","           IN THE COMPETITIVE SERVICE PRIOR TO GAO'S CONVERSION","UNDER 31 USC 732(G) TO EXCEPTED SERVICE ON OCTOBER 1,1980."," "," "," "," "," "," "]
["ZG9","N","1988-01-03","COMPLETED ONE YEAR OF CONTINUOUS SERVICE UNDER A NON-TEMPORARY","APPOINTMENT. EMPLOYEE HAS COMPETITIVE STATUS FOR APPOINTMENT IN","THE COMPETITIVE SERVICE UNDER THE PROVISION OF 31 USC 732(G)."," "," "," "," "," "," "]
["ZH1","N","1988-01-03","YOU HAVE REEMPLOYMENT RIGHTS IN GAO UNDER                PROVIDED","SEPARATION IS NO LATER THAN            AFTER THE DATE OF ENTRY","ON DUTY IN                  AND YOU APPLY TO THIS AGENCY","WITHIN            FROM DATE OF YOUR SEPARATION."," "," "," "," "," "]
["ZH2","N","1988-01-03","MERGED RECORDS PERSONNEL FOLDER MAINTAINED BY","      ."," "," "," "," "," "," "," "]
["ZH3","N","1988-01-03","THIS IS A NON-REIMBURSABLE DETAIL"," "," "," "," "," "," "," "," "]
["ZH4","Y","2004-05-30","PBC BONUS AWARD $@        @."," "," "," "," "," "," "," "," "]
["ZH5","N","2004-05-30","EMPLOYEE IS SUBJECT TO PERFORMANCE BASED COMP SYS."," "," "," "," "," "," "," "," "]
["ZH6","N","1989-06-18","SALARY RATE IN BLOCK 20 INCLUDES FULL OR PARTIAL WITHIN-GRADE INCREASE","WHICH WOULD HAVE BEEN DUE IF EMPLOYEE REMAINED IN THE GS."," "," "," "," "," "," "," "]
["ZH7","N","2004-05-30","EMPLOYEE IS ENTITLED TO PBC PAY PROTECTION."," "," "," "," "," "," "," "," "]
["ZH8","N","2004-05-30","EMPLOYEE IS NO LONGER ENTITLED TO PBC PAY PROTECTION."," "," "," "," "," "," "," "," "]
["ZH9","N","2004-05-30","PBC PAY PROTECTION PROVISIONS ARE NOT APPLICABLE."," "," "," "," "," "," "," "," "]
["ZJ1","N","1989-06-18","PAY PROTECTION PROVISIONS APPLIED IN DETERMINING SALARY."," "," "," "," "," "," "," "," "]
["ZJ2","Y","2004-06-22","SALARY INCLUDES PBC INCREASE OF $*******.                               ","                                                                        ","                                                                        ","                                                                       ","                                                                       ","                                                                       ","                                                            "," "," "]
["ZJ3","Y","1989-06-18","APPOINTMENT IS SUBJECT TO COMPLETION OF A 2 YEAR TRIAL/PROBATIONARY PERI","BEGINNING @        @."," "," "," "," "," "," "," "]
["ZJ4","N","1989-06-18","SALARY ADJUSTED DUE TO CHANGE IN MINIMUM ENTRY RATE UNDER PFP."," "," "," "," "," "," "," "," "]
["ZJ5","N","2004-05-30","SALARY SET IN ACCORDANCE WITH SPECIAL RATES."," "," "," "," "," "," "," "," "]
["ZJ6","N","1989-06-18","FULL PERFORMANCE LEVEL IS BAND IF"," "," "," "," "," "," "," "," "]
["ZJ7","N","2004-05-30","SALARY ADJUSTED DUE TO CHANGE IN PAY SYSTEM."," "," "," "," "," "," "," "," "]
["ZJ8","N","1990-01-01","SPECIAL EXPERIMENTAL PAY RATE AUTHORIZED UNDER NEW YORK'S ADMINISTRATIVE","PERFORMANCE & PAY INITIATIVE (NYAPPI)"," "," "," "," "," "," "," "]
["ZJ9","N","1990-01-01","PAY ADJUSTMENT BASED ON SALARY RATES APPROVED UNDER"," "," "," "," "," "," "," "," "]
["ZK1","N","1990-01-14","FULL AMOUNT OF THE PFP MERIT INCREASE ENTITLEMENT CANNOT BE GRANTED","BECAUSE THE ENTITLEMENT WOULD CAUSE THE MAXIMUM RATE TO BE EXCEEDED."," "," "," "," "," "," "," "]
["ZK2","N","1990-01-14","AUTOMATIC PFP MERIT INCREASE OF 2% GRANTED IN ACCORDANCE WITH GAO ORDER","2540.1. CHAPTER 3-1B(4)."," "," "," "," "," "," "," "]
["ZK3","N","1990-01-14","SALARY RECALCULATED TO INCLUDE PFP MERIT INCREASE."," "," "," "," "," "," "," "," "]
["ZK4","N","1991-06-02","PAY SET BASED ON HIGHEST PREVIOUS RATE OF $"," "," "," "," "," "," "," "," "]
["ZK5","N","1991-06-02","PAY SET BASED ON AUTHORITY TO PAY UP TO 6.67% INCREASE WHEN REASSIGNED."," "," "," "," "," "," "," "," "]
["ZK6","Y","1991-06-30","COMPLETED SERVICE REQUIREMENT FOR EXCEPTED TENURE FROM @        @","TO @        @."," "," "," "," "," "," "," "]
["ZK7","N","1995-07-23","EMPLOYEE IS AUTHORIZED TO RECEIVE SEPARATION INCENTIVE PAY. REEMPLOYMENT","WITHIN 5 YEARS AFTER THE SEPARATION DATE IS SUBJECT TO REPAYMENT OF","SEPARATION PAY TO GAO IN ACCORDANCE WITH GAO INTERIM NOTICE 2551.1 (A-95"," "," "," "," "," "," "]
["ZK8","N","2002-09-08","BONUS AWARD $"," "," "," "," "," "," "," "," "]
["ZK9","N","2002-09-08","EMPLOYEE ENTITLED TO PFP PAY PROTECTION IN ACCORDANCE WITH GAO ORDER",2540.3000000000002," "," "," "," "," "," "," "]
["ZM1","N","2002-09-08","APPOINTMENT ABOVE THE MINIMUM RATE IN ACCORDANCE WITH GAO ORDER 2540.3 O",2541.4," "," "," "," "," "," "," "]
["ZM2","N","2002-09-08","SALARY INCLUDES PDP INCREASE OF       PERCENT UNLESS INCREASE WOULD CAUS","MAXIMUM RATE TO BE EXCEEDED"," "," "," "," "," "," "," "]

{"sheet":"Config","index":7,"n_rows":31,"n_cols":10,"rows_kept":31,"cut":false,"hidden":true,"merged":[]}
["AG - Production COPY","empusda.copy.nfc.usda.gov","https",443,"EMPLOYEE","hr","PT_LOCAL","ENG",10,10]
["AG - Production","usda.empowhr.gov","https",443,"EMPLOYEE","hr","PT_LOCAL","ENG",10,10]
["DHS - Production COPY","empdhs.copy.nfc.usda.gov","https",443,"EMPLOYEE","hr","PT_LOCAL","ENG",10,10]
["DHS - Production","dhs.empowhr.gov","https",443,"EMPLOYEE","hr","PT_LOCAL","ENG",10,10]
["DOJ - Production COPY","empdoj.copy.nfc.usda.gov","https",443,"EMPLOYEE","hr","PT_LOCAL","ENG",10,10]
["DOJ - Production  ","doj.empowhr.gov","https",443,"EMPLOYEE","hr","PT_LOCAL","ENG",10,10]
["USDAUAT","empusda.cuat.nfc.usda.gov","https",443,"EMPLOYEE","hr","PT_LOCAL","ENG",10,10]
["DHSUAT","empdhs.cuat.nfc.usda.gov","https",443,"EMPLOYEE","hr","PT_LOCAL","ENG",10,10]
["DOJUAT","empdoj.cuat.nfc.usda.gov","https",443,"EMPLOYEE","hr","PT_LOCAL","ENG",10,10]
["USDAQA","empusda.qa.nfc.usda.gov","https",443,"EMPLOYEE","hr","PT_LOCAL","ENG",10,10]
["DHSQA","empdhs.qa.nfc.usda.gov","https",443,"EMPLOYEE","hr","PT_LOCAL","ENG",10,10]
["DOJQA","empdoj.qa.nfc.usda.gov","https",443,"EMPLOYEE","hr","PT_LOCAL","ENG",10,10]
["USDATEST","empusda.test.nfc.usda.gov","https",443,"EMPLOYEE","hr","PT_LOCAL","ENG",10,10]
["DHSTEST","empdhs.test.nfc.usda.gov","https",443,"EMPLOYEE","hr","PT_LOCAL","ENG",10,10]
["DOJTEST","empdoj.test.nfc.usda.gov","https",443,"EMPLOYEE","hr","PT_LOCAL","ENG",10,10]
["Training","train.empowhr.gov","https",443,"EMPLOYEE","hr","PT_LOCAL","ENG",10,10]
["Development","empowhr.dev.nfc.usda.gov","https",443,"EMPLOYEE","hr","PT_LOCAL","ENG",10,10]
[]
["CREATE","Remarks","NOA","DESCR",null,null,"Check Mail Address Translate Values"]
[null,0,820,"DHS-CS RECOGNITION PAYMENT",null,null,1,"Personnel Office Identifier"]
[null,1,822,"GROUP TIME OFF AWARD-OTHER",null,null,2,"Check Mail Address"]
[null,2,823,"INDIVIDUAL TIME OFF AWARD -OTHER",null,null,3,"Specified Address"]
[null,3,840,"INDIVIDUAL CASH AWARD RB"]
[null,4,841,"GROUP AWARD-CH 45"]
[null,5,846,"INDIVIDUAL TIME-OFF-AWARD"]
[null,6,847,"GROUP TIME-OFF-AWARD"]
[null,7,849,"INDIV CASH AWARD NRB"]
[null,8,886,"LUMP SUM PERF PYMT RB-NILPA"]
[null,9,889,"GROUP AWARD-OTHER"]
[null,10]
[null,null,"NOTE:  this list comes from TMGT062"]